{
    "presets": [
        "@babel/preset-react",
        [
            "@babel/preset-env",
            {
                "targets": {
                    "edge": "17",
                    "firefox": "60",
                    "chrome": "67",
                    "safari": "11.1"
                },
                "useBuiltIns": "usage",
                "corejs": "3.6.5"
            }
        ]
    ],
    "plugins": [
        "@babel/plugin-proposal-object-rest-spread",
        "@babel/plugin-transform-runtime",
        "@babel/transform-react-jsx"
    ]
}