{
  "version": "map_v1.0",
  "backgroundColor": "#FF00FF",
  "hasTitle": true,
  "hasNavigation": true,
  "hasInfo": true,
  "zoomInitial": 0,
  "zoomMin": 0,
  "zoomMax": 15,
  "centerInitial": ""
}
