[
  {
    "id": 1,
    "display_name": "Text",
    "slug": "TEXT"
  },
  {
    "id": 2,
    "display_name": "Select",
    "slug": "SELECT"
  },
  {
    "id": 3,
    "display_name": "Date",
    "slug": "DATE"
  },
  {
    "id": 4,
    "display_name": "Coordinates",
    "slug": "COORDINATES"
  },
  {
    "id": 5,
    "display_name": "Taglist",
    "slug": "TAGLIST"
  },
  {
    "id": 6,
    "display_name": "Text Area",
    "slug": "TEXTAREA"
  },
  {
    "id": 7,
    "display_name": "Image",
    "slug": "MEDIAPICKER"
  },
  {
    "id": 8,
    "display_name": "Audio / Video",
    "slug": "MEDIAPICKER2"
  }
]
