{
  "config": {
    "title": "Feral Dev Ops",
    "description": "My awesome app using docz",
    "menu": [],
    "version": "2.0.0-rc.41",
    "repository": null,
    "native": false,
    "themeConfig": {},
    "separator": "-",
    "files": "**/*.{md,mdx}",
    "port": 4000
  },
  "entries": [
    {
      "key": "README.md",
      "value": {
        "id": "04c6e90faac2675aa89e2176d2eec7d8",
        "filepath": "README.md",
        "fullpath": "/Users/andrew/Code/Documentation/devops/README.md",
        "link": "",
        "hidden": false,
        "slug": "readme",
        "route": "/readme",
        "name": "Readme",
        "menu": "",
        "headings": [
          {
            "slug": "guide-to-feral-devops",
            "depth": 1,
            "value": "Guide to Feral DevOps"
          }
        ]
      }
    },
    {
      "key": "content/index.md",
      "value": {
        "id": "a6ab42ad501cfe5f7290dcdbeda6ce90",
        "filepath": "content/index.md",
        "fullpath": "/Users/andrew/Code/Documentation/devops/content/index.md",
        "link": "",
        "hidden": false,
        "slug": "content-index",
        "route": "/content-index",
        "name": "Index",
        "menu": "",
        "headings": []
      }
    }
  ],
  "props": []
}
