5
Coordinates from ORCA-job optfreq E -338.058934410439
  C      -2.717020      2.174060     -0.046440
  F      -1.335510      2.168930     -0.048700
  F      -3.173000      2.921220      1.022400
  F      -3.182150      0.878050      0.065870
  H      -3.086720      2.618910     -0.993120
5
Coordinates from ORCA-job optfreq E -338.066132448317
  C      -2.721067      2.178774     -0.056825
  F      -1.382780      2.161989     -0.032448
  F      -3.148784      2.884620      0.996894
  F      -3.158192      0.920612      0.077578
  H      -3.083576      2.615174     -0.985189
5
Coordinates from ORCA-job optfreq E -338.066298101654
  C      -2.719444      2.176614     -0.052270
  F      -1.388985      2.162429     -0.032973
  F      -3.146884      2.881984      0.991972
  F      -3.156490      0.926058      0.076368
  H      -3.082596      2.614085     -0.983087
5
Coordinates from ORCA-job optfreq E -338.066302044168
  C      -2.719106      2.176249     -0.051465
  F      -1.387944      2.162755     -0.033670
  F      -3.147595      2.882883      0.992278
  F      -3.157217      0.925289      0.075842
  H      -3.082539      2.613993     -0.982974
5
Coordinates from ORCA-job optfreq E -338.066302040605
  C      -2.719100      2.176245     -0.051449
  F      -1.387941      2.162765     -0.033673
  F      -3.147593      2.882848      0.992287
  F      -3.157228      0.925313      0.075863
  H      -3.082538      2.613999     -0.983019
