5
Coordinates from ORCA-job optfreq
  C   -2.69892456258027      2.15223664306761     -0.00014562909002
  F   -1.38092996730549      2.14778687192508     -0.00197913485720
  F   -3.13352927591110      2.86468574106918      1.01976919316406
  F   -3.14300879260079      0.91588921898334      0.10724797630810
  F   -3.13800740160235      2.68057152495478     -1.12488240552494
