! rhf cisd
%pal
  nprocs 1
end
%maxcore 4000
%coords
  ctyp internal
  charge 0
  mult 1
  pardef
    rHe [2.5 3.0 3.5 100]
  end
  coords
    He 0   0   0   0   0   0
    He 1   0   0 {rHe} 0   0
  end
end
%basis
  newgto He
    S 4
    1 9079.303600 0.0006320
    2 58.789362 0.0414350
    3 10.200107 0.2992590
    4 2.346173 0.9749240
    S 1
    1 0.728426 1.0000000
    S 1
    1 0.283539 1.0000000
    S 1
    1 0.131665 1.0000000
    S 1
    1 0.060512 1.0000000
    P 1
    1 2.278600 1.0000000
    P 1
    1 0.539650 1.0000000
    P 1
    1 0.166860 1.0000000
    P 1
    1 0.050000 1.0000000
    D 1
    1 0.680000 1.0000000
    D 1
    1 0.180000 1.0000000
    D 1
    1 0.060000 1.0000000
  end
end