18
Coordinates from ORCA-job optfreq E -235.676492041156
  C       0.318070      0.236090      0.182030
  C       1.284140      1.115310      0.562470
  C       0.493970     -0.856320     -0.849330
  C      -1.092560      0.204780      0.727140
  C       2.694770      1.146630      0.017360
  C       1.108240      2.207730      1.593830
  H       0.117650      2.261490      2.043200
  H       1.310610      3.183560      1.136660
  H       1.827220      2.065240      2.409290
  H       2.914250      0.391080     -0.735670
  H       3.410470      1.006330      0.836080
  H       2.893860      2.124650     -0.436560
  H       1.484560     -0.910090     -1.298690
  H      -0.225010     -0.713830     -1.664790
  H       0.291600     -1.832150     -0.392150
  H      -1.312040      0.960330      1.480180
  H      -1.291650     -0.773240      1.181060
  H      -1.808260      0.345080     -0.091570
18
Coordinates from ORCA-job optfreq E -235.677314810537
  C       0.322298      0.239911      0.183663
  C       1.279910      1.111497      0.560837
  C       0.515280     -0.849105     -0.851871
  C      -1.086818      0.222570      0.739997
  C       2.689027      1.128840      0.004506
  C       1.086930      2.200514      1.596373
  H       0.087714      2.237923      2.036540
  H       1.286160      3.184790      1.149636
  H       1.803643      2.069081      2.419275
  H       2.890361      0.363565     -0.748776
  H       3.416383      0.989682      0.816686
  H       2.900926      2.105000     -0.454146
  H       1.514498     -0.886521     -1.292031
  H      -0.201431     -0.717675     -1.674774
  H       0.316049     -1.833379     -0.405127
  H      -1.288150      0.987841      1.493282
  H      -1.298713     -0.753591      1.198649
  H      -1.814177      0.361728     -0.072179
18
Coordinates from ORCA-job optfreq E -235.677407029683
  C       0.322202      0.239908      0.183569
  C       1.280008      1.111501      0.560934
  C       0.516595     -0.849117     -0.852492
  C      -1.087163      0.223796      0.740835
  C       2.689373      1.127613      0.003669
  C       1.085615      2.200525      1.596996
  H       0.086535      2.233943      2.034888
  H       1.285881      3.187330      1.154914
  H       1.803405      2.075195      2.420656
  H       2.886630      0.361655     -0.748382
  H       3.420815      0.991721      0.813488
  H       2.906955      2.103699     -0.453879
  H       1.515677     -0.882540     -1.290381
  H      -0.201194     -0.723788     -1.676154
  H       0.316326     -1.835922     -0.410408
  H      -1.284419      0.989752      1.492888
  H      -1.304745     -0.752291      1.198382
  H      -1.818607      0.359690     -0.068982
18
Coordinates from ORCA-job optfreq E -235.677427137676
  C       0.321794      0.239649      0.183351
  C       1.280415      1.111758      0.561154
  C       0.515983     -0.849149     -0.852313
  C      -1.087243      0.223554      0.740224
  C       2.689453      1.127853      0.004280
  C       1.086227      2.200557      1.596818
  H       0.087525      2.232210      2.034557
  H       1.287245      3.188366      1.157239
  H       1.805447      2.079239      2.419857
  H       2.885529      0.361827     -0.747350
  H       3.422733      0.994479      0.812893
  H       2.910251      2.104013     -0.451657
  H       1.514686     -0.880804     -1.290049
  H      -0.203234     -0.727829     -1.675354
  H       0.314961     -1.836957     -0.412735
  H      -1.283318      0.989578      1.491855
  H      -1.308041     -0.752606      1.196159
  H      -1.820522      0.356930     -0.068389
18
Coordinates from ORCA-job optfreq E -235.677427793116
  C       0.321717      0.239632      0.183295
  C       1.280492      1.111775      0.561210
  C       0.515849     -0.849008     -0.852126
  C      -1.087087      0.223578      0.739968
  C       2.689297      1.127829      0.004536
  C       1.086360      2.200416      1.596631
  H       0.087872      2.231928      2.034989
  H       1.287045      3.188267      1.157017
  H       1.806133      2.079681      2.419252
  H       2.885680      0.361945     -0.747223
  H       3.422570      0.994599      0.813165
  H       2.910367      2.104087     -0.451034
  H       1.514338     -0.880523     -1.290481
  H      -0.203921     -0.728270     -1.674749
  H       0.315161     -1.836858     -0.412514
  H      -1.283468      0.989461      1.491728
  H      -1.308158     -0.752680      1.195536
  H      -1.820359      0.356811     -0.068660
