5

C         -2.69888        2.15223        0.00000
F         -1.31737        2.14711       -0.00226
F         -3.15487        2.89940        1.06884
F         -3.16402        0.85623        0.11231
F         -3.15926        2.70620       -1.17888
