5
Coordinates from ORCA-job optfreq E -437.527852211472
  C      -2.698880      2.152230      0.000000
  F      -1.317370      2.147110     -0.002260
  F      -3.154870      2.899400      1.068840
  F      -3.164020      0.856230      0.112310
  F      -3.159260      2.706200     -1.178880
5
Coordinates from ORCA-job optfreq E -437.544599002335
  C      -2.698918      2.152141     -0.000170
  F      -1.377166      2.147949     -0.001737
  F      -3.134504      2.866848      1.022610
  F      -3.144402      0.912089      0.107461
  F      -3.139410      2.682143     -1.128155
5
Coordinates from ORCA-job optfreq E -437.544727426684
  C      -2.699004      2.152121     -0.000300
  F      -1.383859      2.148185     -0.001715
  F      -3.132174      2.862708      1.017227
  F      -3.142313      0.918734      0.107188
  F      -3.137049      2.679423     -1.122390
5
Coordinates from ORCA-job optfreq E -437.544736360158
  C      -2.699062      2.152124     -0.000275
  F      -1.382536      2.148190     -0.001800
  F      -3.132644      2.863468      1.018383
  F      -3.142756      0.917432      0.107306
  F      -3.137402      2.679957     -1.123605
5
Coordinates from ORCA-job optfreq E -437.544736311633
  C      -2.699083      2.152119     -0.000277
  F      -1.382545      2.148212     -0.001817
  F      -3.132637      2.863427      1.018374
  F      -3.142767      0.917469      0.107324
  F      -3.137368      2.679943     -1.123594
