43
Coordinates from ORCA-job opt E -1129.229751456939
  C      -1.087090      1.506992      0.222359
  C      -1.176368      0.345986     -0.562698
  C      -0.167301      1.735622      1.247739
  O      -0.419421     -0.651684     -0.516827
  O       0.754133      0.962124      1.625271
  C      -0.299212      3.036225      2.015881
  C      -2.327626      0.275774     -1.545658
  H      -1.277667      3.094584      2.486768
  H      -0.192712      3.880191      1.338486
  H       0.472347      3.084287      2.779497
  H      -2.262526      1.102546     -2.248798
  H      -3.275777      0.347492     -1.017735
  H      -2.284146     -0.664902     -2.087393
  Ru      1.307570     -0.675687      0.567731
  H       4.049757      2.962199     -1.322407
  H       4.985723     -1.049199      3.071243
  C       3.293652      1.052265     -0.690219
  C       4.064567     -0.144057      1.365980
  C       5.251579     -0.344756      2.288008
  C       3.724734      2.025956     -1.769850
  C       4.246555      0.725401      0.282855
  O       2.113086      0.626001     -0.769239
  O       3.021164     -0.781376      1.659817
  H       5.536167      0.603718      2.737360
  H       4.554689      1.607892     -2.334682
  H       2.891145      2.213612     -2.440931
  H       6.100575     -0.727835      1.726739
  H      -0.468609     -4.756532      2.772517
  H       3.374248     -3.858165     -1.735774
  C       0.731405     -3.152482      1.993554
  C       2.145900     -3.391350     -0.048151
  C       2.947446     -4.373629     -0.879706
  C       0.117453     -3.920509      3.146803
  C       1.558626     -3.878513      1.121342
  O       0.426504     -1.940158      1.905277
  O       2.058497     -2.220724     -0.508445
  H       2.303366     -5.177540     -1.228716
  H       0.905017     -4.311688      3.786540
  H      -0.520924     -3.257840      3.724326
  H       3.744412     -4.806813     -0.280317
  H       1.713717     -4.922330      1.350096
  H       5.217470      1.188864      0.188231
  H      -1.830256      2.271430      0.051135
43
Coordinates from ORCA-job opt E -1129.235621634351
  C      -1.100850      1.522625      0.222603
  C      -1.186725      0.356154     -0.570028
  C      -0.181403      1.748415      1.257749
  O      -0.411996     -0.641518     -0.517774
  O       0.751628      0.962590      1.626053
  C      -0.306040      3.038960      2.050292
  C      -2.334365      0.261860     -1.560584
  H      -1.293931      3.097117      2.532348
  H      -0.201411      3.905589      1.379607
  H       0.475957      3.076704      2.819925
  H      -2.280427      1.095701     -2.277368
  H      -3.299269      0.325698     -1.034268
  H      -2.276913     -0.690089     -2.104216
  Ru      1.314813     -0.670593      0.567618
  H       4.064903      2.973055     -1.370572
  H       4.974762     -1.039702      3.112573
  C       3.314423      1.055064     -0.705890
  C       4.081186     -0.129403      1.377415
  C       5.255858     -0.333938      2.320105
  C       3.734554      2.017205     -1.805097
  C       4.267917      0.734046      0.279988
  O       2.124003      0.620363     -0.777642
  O       3.022632     -0.766430      1.667775
  H       5.547278      0.625508      2.774573
  H       4.574476      1.593103     -2.376740
  H       2.889495      2.195730     -2.482644
  H       6.123192     -0.728258      1.768699
  H      -0.494377     -4.761404      2.795400
  H       3.369371     -3.848269     -1.772730
  C       0.733171     -3.165303      2.001397
  C       2.146173     -3.407462     -0.056221
  C       2.942307     -4.378757     -0.911689
  C       0.106348     -3.915875      3.163890
  C       1.562298     -3.896628      1.121767
  O       0.437374     -1.939983      1.904555
  O       2.058376     -2.218998     -0.507477
  H       2.290625     -5.189296     -1.272983
  H       0.896334     -4.317129      3.817561
  H      -0.532698     -3.236134      3.742354
  H       3.752628     -4.829969     -0.319140
  H       1.715773     -4.952237      1.350035
  H       5.249308      1.200848      0.184026
  H      -1.854889      2.292429      0.052765
43
Coordinates from ORCA-job opt E -1129.236529598450
  C      -1.108899      1.527094      0.226455
  C      -1.188405      0.361558     -0.572131
  C      -0.193142      1.752087      1.265903
  O      -0.398943     -0.629467     -0.518816
  O       0.749758      0.963989      1.624009
  C      -0.317730      3.027456      2.078780
  C      -2.329411      0.247802     -1.565212
  H      -1.304815      3.078921      2.567891
  H      -0.221646      3.908128      1.421814
  H       0.468275      3.058314      2.846136
  H      -2.288972      1.082897     -2.284701
  H      -3.300383      0.299682     -1.044455
  H      -2.257151     -0.704214     -2.109074
  Ru      1.326369     -0.663017      0.567281
  H       4.084526      2.962144     -1.413609
  H       4.961724     -1.013373      3.139353
  C       3.335641      1.052455     -0.717771
  C       4.093695     -0.112802      1.385387
  C       5.253791     -0.314073      2.343652
  C       3.749521      1.997968     -1.831081
  C       4.284441      0.738649      0.277260
  O       2.140739      0.615349     -0.784641
  O       3.027094     -0.746551      1.674560
  H       5.546996      0.648248      2.795971
  H       4.589929      1.569046     -2.402447
  H       2.901876      2.168144     -2.509283
  H       6.130721     -0.714607      1.807986
  H      -0.508775     -4.747163      2.808490
  H       3.351693     -3.837825     -1.793872
  C       0.737197     -3.168131      2.003701
  C       2.142340     -3.414659     -0.062015
  C       2.923970     -4.376950     -0.937181
  C       0.101705     -3.902582      3.169149
  C       1.561853     -3.902584      1.118896
  O       0.453273     -1.936306      1.903208
  O       2.060418     -2.216020     -0.503615
  H       2.265753     -5.180501     -1.308416
  H       0.886374     -4.312213      3.827633
  H      -0.530293     -3.212685      3.745333
  H       3.735238     -4.847809     -0.357518
  H       1.707826     -4.961801      1.342954
  H       5.268218      1.204023      0.180481
  H      -1.870518      2.292768      0.061569
43
Coordinates from ORCA-job opt E -1129.236940610363
  C      -1.117276      1.524713      0.233233
  C      -1.185413      0.363254     -0.572549
  C      -0.205759      1.750352      1.274650
  O      -0.379547     -0.616201     -0.520939
  O       0.748592      0.965651      1.620035
  C      -0.336218      3.008358      2.107795
  C      -2.319570      0.231044     -1.566637
  H      -1.319915      3.046625      2.605194
  H      -0.255519      3.902414      1.466717
  H       0.454443      3.035559      2.869756
  H      -2.296071      1.068362     -2.284548
  H      -3.294340      0.265833     -1.051289
  H      -2.229445     -0.717432     -2.112986
  Ru      1.343157     -0.652731      0.566408
  H       4.113728      2.944646     -1.456503
  H       4.951241     -0.979109      3.162727
  C       3.360691      1.048679     -0.728693
  C       4.107204     -0.092740      1.392698
  C       5.252809     -0.286736      2.365193
  C       3.772158      1.974707     -1.855272
  C       4.302684      0.743886      0.274878
  O       2.163081      0.611677     -0.791167
  O       3.035151     -0.722812      1.680451
  H       5.544820      0.677615      2.814334
  H       4.610577      1.538656     -2.424469
  H       2.923558      2.137650     -2.533277
  H       6.138584     -0.690544      1.846488
  H      -0.522900     -4.723589      2.818491
  H       3.328486     -3.828578     -1.811183
  C       0.741827     -3.164695      2.003985
  C       2.134134     -3.418562     -0.068282
  C       2.894799     -4.375098     -0.962853
  C       0.098922     -3.883709      3.171052
  C       1.556498     -3.904010      1.113645
  O       0.474049     -1.928160      1.901792
  O       2.063838     -2.211885     -0.498222
  H       2.225152     -5.163212     -1.346978
  H       0.876834     -4.303914      3.831210
  H      -0.522205     -3.183639      3.745840
  H       3.700102     -4.873237     -0.397527
  H       1.690075     -4.966320      1.331687
  H       5.287897      1.206565      0.177264
  H      -1.889045      2.282056      0.075865
43
Coordinates from ORCA-job opt E -1129.237095439409
  C      -1.124591      1.516854      0.240266
  C      -1.180024      0.359946     -0.571962
  C      -0.214715      1.744706      1.281126
  O      -0.361196     -0.608020     -0.524156
  O       0.749101      0.967019      1.616079
  C      -0.354695      2.991398      2.127140
  C      -2.310638      0.216958     -1.566534
  H      -1.334433      3.014221      2.632172
  H      -0.291222      3.893584      1.496439
  H       0.440820      3.020754      2.883058
  H      -2.300910      1.057976     -2.279630
  H      -3.286515      0.235414     -1.053532
  H      -2.206218     -0.726492     -2.117810
  Ru      1.358896     -0.643829      0.565133
  H       4.141916      2.932002     -1.482377
  H       4.950479     -0.954045      3.174951
  C       3.380333      1.047128     -0.735020
  C       4.118471     -0.078039      1.396396
  C       5.256266     -0.264568      2.377341
  C       3.793613      1.960339     -1.869552
  C       4.317880      0.748733      0.273336
  O       2.181903      0.611993     -0.794689
  O       3.044415     -0.705776      1.682826
  H       5.543956      0.701187      2.825047
  H       4.628649      1.517044     -2.437180
  H       2.944720      2.121157     -2.546728
  H       6.147921     -0.667100      1.868915
  H      -0.534195     -4.701136      2.823709
  H       3.312944     -3.826345     -1.818799
  C       0.744008     -3.156726      2.003038
  C       2.125003     -3.418859     -0.073110
  C       2.867454     -4.376298     -0.979635
  C       0.097242     -3.867111      3.171449
  C       1.547558     -3.902157      1.108479
  O       0.490700     -1.917828      1.901371
  O       2.067534     -2.208319     -0.494219
  H       2.184470     -5.145683     -1.376709
  H       0.870852     -4.296325      3.830052
  H      -0.513912     -3.159960      3.747123
  H       3.661153     -4.900633     -0.422631
  H       1.668918     -4.966586      1.321651
  H       5.303694      1.209334      0.175366
  H      -1.905733      2.265480      0.089818
43
Coordinates from ORCA-job opt E -1129.237191070393
  C      -1.132651      1.504671      0.247890
  C      -1.172749      0.352684     -0.571460
  C      -0.222461      1.736206      1.286911
  O      -0.340913     -0.602729     -0.529269
  O       0.751305      0.968370      1.611565
  C      -0.375369      2.974015      2.143282
  C      -2.301689      0.201464     -1.566464
  H      -1.349996      2.976840      2.657691
  H      -0.333836      3.882189      1.520257
  H       0.426555      3.010425      2.891572
  H      -2.305872      1.047993     -2.272281
  H      -3.277283      0.201300     -1.053595
  H      -2.183168     -0.735533     -2.125177
  Ru      1.376423     -0.634802      0.563014
  H       4.172938      2.923516     -1.500552
  H       4.957513     -0.935029      3.181128
  C       3.399658      1.048457     -0.739366
  C       4.131025     -0.064653      1.398509
  C       5.264211     -0.244007      2.385676
  C       3.816800      1.952115     -1.879774
  C       4.334300      0.755783      0.272488
  O       2.201283      0.615111     -0.797269
  O       3.056631     -0.691722      1.682659
  H       5.543672      0.722813      2.835189
  H       4.647170      1.500355     -2.446705
  H       2.967483      2.114073     -2.555589
  H       6.161528     -0.640495      1.883581
  H      -0.546511     -4.676004      2.827825
  H       3.302517     -3.829874     -1.820898
  C       0.744782     -3.145002      2.001961
  C       2.114008     -3.417948     -0.077894
  C       2.837282     -4.380882     -0.993669
  C       0.095201     -3.849135      3.172337
  C       1.535128     -3.898893      1.103311
  O       0.506805     -1.904240      1.901814
  O       2.071598     -2.205247     -0.491365
  H       2.136831     -5.124669     -1.407660
  H       0.865807     -4.287514      3.827626
  H      -0.505418     -3.135435      3.750398
  H       3.612083     -4.936400     -0.441360
  H       1.642918     -4.965250      1.312199
  H       5.320357      1.215083      0.174684
  H      -1.924026      2.243394      0.104789
43
Coordinates from ORCA-job opt E -1129.237247879147
  C      -1.140169      1.491546      0.254159
  C      -1.165584      0.343838     -0.571778
  C      -0.228404      1.727380      1.291066
  O      -0.322429     -0.600587     -0.535749
  O       0.754403      0.969650      1.607338
  C      -0.394594      2.958942      2.154920
  C      -2.294303      0.186604     -1.567050
  H      -1.363259      2.940166      2.679903
  H      -0.376863      3.870626      1.536324
  H       0.414632      3.005888      2.894739
  H      -2.310866      1.039287     -2.264904
  H      -3.268586      0.168302     -1.052349
  H      -2.163714     -0.743796     -2.134081
  Ru      1.392564     -0.627169      0.560262
  H       4.202095      2.920396     -1.509396
  H       4.969901     -0.925981      3.181022
  C       3.416432      1.052264     -0.742068
  C       4.143705     -0.054954      1.398605
  C       5.274687     -0.229094      2.389947
  C       3.837160      1.951274     -1.885465
  C       4.350231      0.763125      0.271658
  O       2.218365      0.620170     -0.799077
  O       3.069498     -0.682292      1.680389
  H       5.542987      0.738196      2.844892
  H       4.661526      1.491207     -2.454209
  H       2.986637      2.118205     -2.558568
  H       6.177366     -0.615595      1.890173
  H      -0.558004     -4.652338      2.831458
  H       3.301041     -3.837934     -1.816384
  C       0.744249     -3.132448      2.001446
  C       2.103578     -3.416925     -0.081709
  C       2.809739     -4.387666     -1.003452
  C       0.092827     -3.832132      3.174266
  C       1.522546     -3.895252      1.099683
  O       0.519550     -1.890070      1.902954
  O       2.075091     -2.203378     -0.490442
  H       2.090878     -5.101484     -1.438015
  H       0.862024     -4.277897      3.825921
  H      -0.498778     -3.113107      3.755080
  H       3.559783     -4.976003     -0.451568
  H       1.618469     -4.963021      1.306020
  H       5.336225      1.222275      0.174618
  H      -1.940763      2.221174      0.117431
43
Coordinates from ORCA-job opt E -1129.237291396538
  C      -1.145845      1.479608      0.257984
  C      -1.159458      0.335065     -0.573124
  C      -0.232408      1.719667      1.293194
  O      -0.307418     -0.601056     -0.542828
  O       0.757984      0.970767      1.603616
  C      -0.410402      2.946814      2.162289
  C      -2.288750      0.173199     -1.568280
  H      -1.371854      2.906343      2.699451
  H      -0.417717      3.859945      1.545678
  H       0.406989      3.006676      2.892453
  H      -2.315969      1.031750     -2.258607
  H      -3.261091      0.138572     -1.050551
  H      -2.148538     -0.751113     -2.143312
  Ru      1.406031     -0.621573      0.557046
  H       4.227647      2.921484     -1.511081
  H       4.985317     -0.927337      3.174996
  C       3.429986      1.058079     -0.743321
  C       4.155528     -0.048398      1.397422
  C       5.285565     -0.219876      2.391325
  C       3.852943      1.956218     -1.887467
  C       4.364113      0.770738      0.271226
  O       2.232512      0.625448     -0.800812
  O       3.081816     -0.677155      1.676647
  H       5.539704      0.746613      2.856297
  H       4.670040      1.488451     -2.460626
  H       3.000430      2.131111     -2.556352
  H       6.193956     -0.591654      1.890752
  H      -0.567282     -4.631968      2.835298
  H       3.309948     -3.849111     -1.804579
  C       0.743443     -3.121062      2.001946
  C       2.094858     -3.416759     -0.084205
  C       2.786150     -4.395708     -1.009679
  C       0.090652     -3.817008      3.177302
  C       1.512163     -3.891861      1.098278
  O       0.528766     -1.877216      1.904504
  O       2.077396     -2.203205     -0.491437
  H       2.049429     -5.074627     -1.470077
  H       0.859480     -4.267708      3.826088
  H      -0.494259     -3.093873      3.760205
  H       3.504917     -5.019204     -0.455061
  H       1.599070     -4.960453      1.303968
  H       5.349754      1.230804      0.175420
  H      -1.953725      2.201962      0.126022
43
Coordinates from ORCA-job opt E -1129.237302006326
  C      -1.148986      1.473511      0.260450
  C      -1.157109      0.330718     -0.573456
  C      -0.234578      1.716269      1.294373
  O      -0.300043     -0.601261     -0.546641
  O       0.760494      0.971963      1.601521
  C      -0.417776      2.941052      2.166097
  C      -2.286370      0.165909     -1.568454
  H      -1.374653      2.888802      2.712481
  H      -0.440779      3.855331      1.549907
  H       0.405954      3.008369      2.889191
  H      -2.320060      1.028219     -2.254388
  H      -3.258096      0.121559     -1.049256
  H      -2.140245     -0.754909     -2.148329
  Ru      1.412785     -0.618815      0.555199
  H       4.241719      2.921433     -1.512503
  H       4.993043     -0.928801      3.171187
  C       3.437414      1.060808     -0.744589
  C       4.161964     -0.044819      1.396724
  C       5.290850     -0.214902      2.392349
  C       3.860654      1.958570     -1.888956
  C       4.371370      0.774287      0.270569
  O       2.240133      0.627592     -0.802482
  O       3.088103     -0.673947      1.675023
  H       5.536746      0.750899      2.863928
  H       4.673200      1.486787     -2.465702
  H       3.006543      2.138381     -2.554610
  H       6.203142     -0.577482      1.891689
  H      -0.573416     -4.621225      2.837569
  H       3.321182     -3.851961     -1.794576
  C       0.742417     -3.115909      2.001881
  C       2.090756     -3.417363     -0.085468
  C       2.775253     -4.399852     -1.012613
  C       0.088731     -3.809053      3.178659
  C       1.506499     -3.890462      1.097167
  O       0.533271     -1.870899      1.905139
  O       2.079386     -2.203354     -0.492019
  H       2.027711     -5.058520     -1.492953
  H       0.857212     -4.262766      3.825924
  H      -0.492202     -3.083367      3.762712
  H       3.474782     -5.046976     -0.453950
  H       1.588838     -4.959530      1.302631
  H       5.356822      1.234921      0.175460
  H      -1.960789      2.192181      0.131121
43
Coordinates from ORCA-job opt E -1129.237366670313
  C      -1.149432      1.471567      0.257605
  C      -1.158488      0.329493     -0.577148
  C      -0.235008      1.714367      1.292107
  O      -0.301984     -0.603396     -0.553345
  O       0.760757      0.971199      1.599688
  C      -0.419138      2.939261      2.163833
  C      -2.288556      0.166908     -1.571897
  H      -1.369111      2.876467      2.722140
  H      -0.458906      3.851746      1.545342
  H       0.412511      3.015723      2.877615
  H      -2.324480      1.032783     -2.253278
  H      -3.258658      0.117084     -1.050072
  H      -2.141758     -0.750662     -2.156642
  Ru      1.411431     -0.620036      0.550558
  H       4.253803      2.923623     -1.501110
  H       5.001460     -0.954799      3.153484
  C       3.437938      1.063957     -0.744273
  C       4.163445     -0.050443      1.392236
  C       5.292690     -0.224529      2.387106
  C       3.860457      1.968042     -1.883900
  C       4.372897      0.773663      0.269411
  O       2.240974      0.629252     -0.804935
  O       3.089052     -0.679982      1.669146
  H       5.524329      0.736929      2.875927
  H       4.663691      1.491956     -2.470983
  H       3.002841      2.161519     -2.541527
  H       6.210299     -0.567141      1.881523
  H      -0.567985     -4.619227      2.842499
  H       3.342150     -3.857499     -1.776755
  C       0.742361     -3.112095      2.004094
  C       2.089556     -3.418281     -0.084439
  C       2.776091     -4.402914     -1.007119
  C       0.090444     -3.804088      3.182975
  C       1.510634     -3.886676      1.103264
  O       0.528621     -1.868115      1.903831
  O       2.073591     -2.207247     -0.498372
  H       2.025623     -5.044399     -1.504919
  H       0.860664     -4.252023      3.831978
  H      -0.494076     -3.079660      3.764557
  H       3.455360     -5.063441     -0.441452
  H       1.598257     -4.953588      1.314623
  H       5.358147      1.235512      0.176270
  H      -1.960623      2.190578      0.128365
43
Coordinates from ORCA-job opt E -1129.237500904833
  C      -1.145906      1.467922      0.247470
  C      -1.157397      0.326687     -0.587988
  C      -0.234167      1.710569      1.285271
  O      -0.302608     -0.608464     -0.568077
  O       0.762093      0.969212      1.595852
  C      -0.423968      2.932835      2.160180
  C      -2.290632      0.165312     -1.580050
  H      -1.354364      2.841590      2.746320
  H      -0.507329      3.841159      1.541243
  H       0.424367      3.032872      2.850758
  H      -2.336124      1.037923     -2.252070
  H      -3.256081      0.101227     -1.051625
  H      -2.140967     -0.745000     -2.174683
  Ru      1.411906     -0.622209      0.540855
  H       4.289774      2.925945     -1.480741
  H       5.026540     -1.012918      3.109929
  C       3.441471      1.073184     -0.742985
  C       4.169196     -0.058330      1.384307
  C       5.297308     -0.238565      2.379858
  C       3.861315      1.989568     -1.874068
  C       4.377757      0.776328      0.268555
  O       2.246387      0.632203     -0.810820
  O       3.094108     -0.689737      1.657533
  H       5.485003      0.708149      2.915925
  H       4.636865      1.500991     -2.488758
  H       2.994702      2.218005     -2.508802
  H       6.231399     -0.521374      1.867010
  H      -0.557017     -4.611732      2.855459
  H       3.387482     -3.879849     -1.733026
  C       0.745859     -3.103044      2.011517
  C       2.088856     -3.421911     -0.080131
  C       2.766860     -4.415522     -1.000971
  C       0.095882     -3.791144      3.194235
  C       1.521488     -3.879077      1.118169
  O       0.522424     -1.860879      1.902475
  O       2.062052     -2.216667     -0.510968
  H       2.004449     -4.999040     -1.548608
  H       0.868907     -4.229135      3.847281
  H      -0.494702     -3.067369      3.770698
  H       3.386608     -5.124306     -0.427800
  H       1.616983     -4.943280      1.340862
  H       5.361855      1.242077      0.180208
  H      -1.956765      2.187184      0.118211
43
Coordinates from ORCA-job opt E -1129.237646609775
  C      -1.144276      1.465370      0.240517
  C      -1.155588      0.325693     -0.597084
  C      -0.235004      1.707832      1.280456
  O      -0.300116     -0.609457     -0.580460
  O       0.763194      0.968543      1.591591
  C      -0.433243      2.923711      2.162752
  C      -2.291020      0.163238     -1.586594
  H      -1.340172      2.800192      2.779699
  H      -0.566685      3.829805      1.549150
  H       0.432780      3.048755      2.826775
  H      -2.350198      1.043152     -2.248061
  H      -3.252854      0.080930     -1.053468
  H      -2.134166     -0.738724     -2.192386
  Ru      1.414573     -0.621742      0.532602
  H       4.334502      2.916778     -1.476350
  H       5.050098     -1.059537      3.070819
  C       3.448036      1.078475     -0.744399
  C       4.174786     -0.062452      1.378595
  C       5.299761     -0.245790      2.376918
  C       3.867490      1.999830     -1.871892
  C       4.383875      0.777078      0.266356
  O       2.254207      0.633811     -0.817085
  O       3.098419     -0.693305      1.649413
  H       5.443272      0.682961      2.956511
  H       4.611829      1.495722     -2.512709
  H       2.993521      2.262302     -2.482932
  H       6.249484     -0.469265      1.864273
  H      -0.548521     -4.602154      2.867924
  H       3.431572     -3.899688     -1.687399
  C       0.749617     -3.093974      2.017149
  C       2.086841     -3.424388     -0.077137
  C       2.756014     -4.423858     -0.997392
  C       0.101027     -3.777237      3.203227
  C       1.529519     -3.872192      1.129084
  O       0.519861     -1.853269      1.900009
  O       2.053278     -2.222642     -0.519929
  H       1.989276     -4.945898     -1.596421
  H       0.875370     -4.208193      3.859668
  H      -0.493070     -3.052482      3.775035
  H       3.311942     -5.180493     -0.423555
  H       1.631531     -4.933889      1.361264
  H       5.367627      1.244177      0.180959
  H      -1.956520      2.183666      0.112516
43
Coordinates from ORCA-job opt E -1129.237886741766
  C      -1.138511      1.470259      0.232548
  C      -1.154123      0.330099     -0.604410
  C      -0.233753      1.710200      1.275604
  O      -0.301439     -0.608056     -0.585729
  O       0.762885      0.968311      1.589966
  C      -0.437648      2.918595      2.165622
  C      -2.291283      0.166053     -1.590807
  H      -1.318982      2.767687      2.811526
  H      -0.618294      3.822331      1.562432
  H       0.443629      3.066538      2.803145
  H      -2.363591      1.049836     -2.245302
  H      -3.250876      0.070667     -1.055583
  H      -2.128623     -0.730110     -2.203865
  Ru      1.413504     -0.622074      0.528655
  H       4.377761      2.895169     -1.487239
  H       5.068987     -1.096747      3.037272
  C       3.450010      1.078255     -0.746885
  C       4.174901     -0.064578      1.376726
  C       5.295085     -0.247479      2.379209
  C       3.869355      1.997925     -1.875879
  C       4.383787      0.774335      0.264131
  O       2.257087      0.631187     -0.822109
  O       3.097201     -0.692766      1.647774
  H       5.392943      0.659794      2.999116
  H       4.578387      1.476511     -2.541807
  H       2.989608      2.293359     -2.462460
  H       6.259810     -0.410560      1.874465
  H      -0.538121     -4.601362      2.878883
  H       3.477186     -3.914344     -1.640316
  C       0.754950     -3.091473      2.022083
  C       2.089302     -3.426814     -0.072718
  C       2.751650     -4.426432     -0.995430
  C       0.107744     -3.771157      3.209518
  C       1.539647     -3.869437      1.137168
  O       0.517391     -1.852316      1.897477
  O       2.047748     -2.225742     -0.523609
  H       1.990966     -4.887141     -1.644921
  H       0.882337     -4.196626      3.869641
  H      -0.489909     -3.045374      3.776792
  H       3.245037     -5.227557     -0.431191
  H       1.649588     -4.929427      1.376407
  H       5.367597      1.240980      0.179230
  H      -1.949062      2.190874      0.102880
43
Coordinates from ORCA-job opt E -1129.238180380504
  C      -1.133747      1.475715      0.228540
  C      -1.151860      0.334829     -0.607627
  C      -0.232380      1.713553      1.273186
  O      -0.300745     -0.604631     -0.585568
  O       0.763282      0.969381      1.588977
  C      -0.441453      2.913779      2.171159
  C      -2.289543      0.168412     -1.591706
  H      -1.293046      2.734992      2.848432
  H      -0.672981      3.814407      1.582092
  H       0.455803      3.086598      2.778777
  H      -2.376058      1.055541     -2.239259
  H      -3.247734      0.059414     -1.056410
  H      -2.119146     -0.721707     -2.211623
  Ru      1.413686     -0.621099      0.528236
  H       4.422656      2.861898     -1.512897
  H       5.086026     -1.116894      3.013467
  C       3.452132      1.073088     -0.751298
  C       4.173299     -0.062005      1.378347
  C       5.287801     -0.238591      2.386703
  C       3.873319      1.983553     -1.886778
  C       4.382832      0.770728      0.261782
  O       2.259412      0.626472     -0.825914
  O       3.094685     -0.686793      1.651114
  H       5.340508      0.647636      3.039896
  H       4.545594      1.441927     -2.573466
  H       2.990063      2.308999     -2.451116
  H       6.265903     -0.345321      1.895556
  H      -0.531327     -4.601591      2.887018
  H       3.526672     -3.926505     -1.588328
  C       0.758980     -3.091122      2.024494
  C       2.091926     -3.427644     -0.069328
  C       2.747617     -4.423970     -0.997202
  C       0.113050     -3.768158      3.212450
  C       1.544568     -3.869373      1.139699
  O       0.518323     -1.853101      1.895405
  O       2.048094     -2.224806     -0.521641
  H       1.999873     -4.815274     -1.701753
  H       0.886923     -4.191858      3.874433
  H      -0.485243     -3.040780      3.776917
  H       3.171627     -5.273002     -0.451013
  H       1.658335     -4.928621      1.381791
  H       5.367153      1.235311      0.175333
  H      -1.943008      2.198000      0.097136
43
Coordinates from ORCA-job opt E -1129.238527800348
  C      -1.129553      1.482005      0.229102
  C      -1.149146      0.339078     -0.604588
  C      -0.229479      1.718048      1.273635
  O      -0.299457     -0.600530     -0.576687
  O       0.764911      0.971478      1.589253
  C      -0.438645      2.913001      2.175752
  C      -2.285717      0.170464     -1.588131
  H      -1.255489      2.710476      2.887558
  H      -0.721855      3.807449      1.602036
  H       0.475916      3.112332      2.748424
  H      -2.385063      1.060288     -2.229295
  H      -3.243611      0.049074     -1.055200
  H      -2.106697     -0.713833     -2.213804
  Ru      1.413735     -0.620341      0.533380
  H       4.464273      2.814980     -1.552279
  H       5.100394     -1.116607      3.002680
  C       3.451299      1.061408     -0.756551
  C       4.167609     -0.053628      1.385275
  C       5.276140     -0.215394      2.401217
  C       3.876102      1.954013     -1.903889
  C       4.378418      0.767299      0.261139
  O       2.257994      0.618202     -0.826836
  O       3.089540     -0.676483      1.660768
  H       5.283611      0.652069      3.080309
  H       4.511301      1.388436     -2.605441
  H       2.991319      2.305425     -2.449599
  H       6.265888     -0.269733      1.927168
  H      -0.529649     -4.605953      2.890611
  H       3.581201     -3.934875     -1.531606
  C       0.760995     -3.095562      2.023984
  C       2.094817     -3.426981     -0.067762
  C       2.746018     -4.414951     -1.004759
  C       0.116670     -3.772525      3.211514
  C       1.542633     -3.874318      1.135016
  O       0.522824     -1.858057      1.895210
  O       2.055670     -2.219624     -0.512037
  H       2.019851     -4.727991     -1.768606
  H       0.889611     -4.199810      3.871858
  H      -0.478211     -3.043352      3.776989
  H       3.095272     -5.314274     -0.486997
  H       1.653802     -4.934685      1.373229
  H       5.363214      1.229302      0.171317
  H      -1.936581      2.206071      0.094652
43
Coordinates from ORCA-job opt E -1129.238885498056
  C      -1.128511      1.484934      0.230270
  C      -1.147491      0.340182     -0.601353
  C      -0.227138      1.721001      1.273640
  O      -0.298063     -0.598686     -0.570070
  O       0.767083      0.974180      1.588095
  C      -0.435666      2.913941      2.177604
  C      -2.283334      0.170233     -1.585217
  H      -1.212792      2.687107      2.926687
  H      -0.773547      3.797707      1.616942
  H       0.496157      3.144000      2.710528
  H      -2.393970      1.064922     -2.217565
  H      -3.239639      0.033999     -1.052951
  H      -2.096006     -0.706522     -2.218917
  Ru      1.413815     -0.619898      0.537392
  H       4.505720      2.769963     -1.583583
  H       5.120058     -1.120889      2.986338
  C       3.450815      1.051874     -0.760080
  C       4.163206     -0.047321      1.390709
  C       5.267248     -0.196172      2.413110
  C       3.879748      1.929138     -1.916968
  C       4.376312      0.765188      0.261274
  O       2.256435      0.612530     -0.826667
  O       3.085853     -0.670391      1.667355
  H       5.229994      0.649027      3.119564
  H       4.476757      1.340321     -2.633099
  H       2.994690      2.308919     -2.443223
  H       6.264810     -0.196486      1.952936
  H      -0.529344     -4.607599      2.893197
  H       3.631841     -3.950117     -1.472888
  C       0.761297     -3.097545      2.023584
  C       2.095695     -3.425368     -0.067550
  C       2.744851     -4.406961     -1.011727
  C       0.119153     -3.775335      3.211873
  C       1.539230     -3.877279      1.131319
  O       0.526160     -1.860407      1.896226
  O       2.061723     -2.215548     -0.504456
  H       2.045997     -4.641846     -1.829242
  H       0.892798     -4.205442      3.869228
  H      -0.472362     -3.045520      3.779766
  H       3.019418     -5.348621     -0.523024
  H       1.646116     -4.938580      1.365526
  H       5.361466      1.225548      0.169354
  H      -1.934712      2.209210      0.094068
43
Coordinates from ORCA-job opt E -1129.239300172936
  C      -1.129178      1.490546      0.234085
  C      -1.149598      0.340558     -0.590760
  C      -0.222149      1.727460      1.274496
  O      -0.303363     -0.599836     -0.553600
  O       0.768583      0.978604      1.588963
  C      -0.417176      2.929930      2.168765
  C      -2.284544      0.172359     -1.577000
  H      -1.145961      2.690152      2.962634
  H      -0.808261      3.795623      1.614272
  H       0.535269      3.192596      2.650168
  H      -2.398638      1.072824     -2.200934
  H      -3.239210      0.025516     -1.044778
  H      -2.092832     -0.697935     -2.217755
  Ru      1.407160     -0.622657      0.548276
  H       4.535973      2.714908     -1.614533
  H       5.139374     -1.123404      2.969808
  C       3.439965      1.037351     -0.760826
  C       4.151475     -0.041673      1.399058
  C       5.254616     -0.176359      2.424921
  C       3.872568      1.895980     -1.929117
  C       4.367402      0.761734      0.263507
  O       2.242677      0.606067     -0.819549
  O       3.076548     -0.668714      1.677846
  H       5.176174      0.645211      3.158021
  H       4.428094      1.280791     -2.657653
  H       2.987693      2.305143     -2.434936
  H       6.254900     -0.124525      1.971943
  H      -0.535927     -4.619574      2.883891
  H       3.698629     -3.950025     -1.401010
  C       0.756120     -3.106906      2.020075
  C       2.097345     -3.421185     -0.069476
  C       2.764135     -4.389398     -1.015769
  C       0.116248     -3.792422      3.207124
  C       1.529201     -3.885066      1.121490
  O       0.526596     -1.869251      1.901662
  O       2.072452     -2.208634     -0.490376
  H       2.105637     -4.553887     -1.887165
  H       0.892389     -4.229054      3.857029
  H      -0.470736     -3.065555      3.783177
  H       2.973777     -5.364538     -0.553652
  H       1.626952     -4.948688      1.344612
  H       5.352881      1.220368      0.167808
  H      -1.931391      2.216959      0.093267
43
Coordinates from ORCA-job opt E -1129.239634433255
  C      -1.128882      1.491314      0.229825
  C      -1.149984      0.339986     -0.593428
  C      -0.222104      1.729178      1.271167
  O      -0.304548     -0.601758     -0.556370
  O       0.768217      0.980696      1.587500
  C      -0.418509      2.931801      2.166170
  C      -2.286495      0.171178     -1.578568
  H      -1.102255      2.669490      2.993438
  H      -0.862528      3.780298      1.624174
  H       0.544577      3.227978      2.605950
  H      -2.410520      1.077801     -2.191840
  H      -3.236753      0.008091     -1.042679
  H      -2.089550     -0.690657     -2.229328
  Ru      1.406105     -0.622596      0.547192
  H       4.574973      2.685560     -1.625315
  H       5.172188     -1.152776      2.928476
  C       3.440408      1.038408     -0.761300
  C       4.153157     -0.044688      1.396156
  C       5.254638     -0.179812      2.424159
  C       3.872883      1.895676     -1.930945
  C       4.369897      0.760331      0.261351
  O       2.242165      0.608373     -0.819362
  O       3.077397     -0.671395      1.675228
  H       5.135129      0.605278      3.191686
  H       4.383497      1.266578     -2.681102
  H       2.989967      2.342007     -2.408563
  H       6.255000     -0.068619      1.981969
  H      -0.535552     -4.616933      2.885191
  H       3.737004     -3.980783     -1.337016
  C       0.755274     -3.104027      2.022603
  C       2.097741     -3.420903     -0.066780
  C       2.767107     -4.389938     -1.011089
  C       0.115658     -3.789604      3.210340
  C       1.530635     -3.882612      1.126164
  O       0.524179     -1.866233      1.903676
  O       2.070707     -2.210012     -0.491534
  H       2.145702     -4.491264     -1.918572
  H       0.893188     -4.224192      3.860230
  H      -0.472833     -3.063803      3.786354
  H       2.910921     -5.386854     -0.572221
  H       1.629184     -4.945598      1.351712
  H       5.355617      1.218496      0.165497
  H      -1.930733      2.217930      0.087816
43
Coordinates from ORCA-job opt E -1129.239838922073
  C      -1.131495      1.495159      0.223520
  C      -1.156464      0.337844     -0.591767
  C      -0.223325      1.737088      1.266136
  O      -0.315434     -0.610215     -0.552333
  O       0.761542      0.986020      1.590965
  C      -0.406746      2.956164      2.145928
  C      -2.296340      0.168803     -1.575934
  H      -1.028666      2.685007      3.019255
  H      -0.906901      3.774691      1.604317
  H       0.570811      3.291927      2.522957
  H      -2.421670      1.082877     -2.179147
  H      -3.239646     -0.007711     -1.030750
  H      -2.100161     -0.686594     -2.236193
  Ru      1.397487     -0.624107      0.553187
  H       4.598481      2.665864     -1.619936
  H       5.213598     -1.213338      2.857585
  C       3.429876      1.046656     -0.755408
  C       4.155370     -0.055583      1.388172
  C       5.264383     -0.211290      2.406633
  C       3.853006      1.914243     -1.921649
  C       4.370137      0.758589      0.257678
  O       2.227757      0.622185     -0.806831
  O       3.078583     -0.683417      1.670323
  H       5.119759      0.526666      3.216348
  H       4.305085      1.276500     -2.702860
  H       2.971296      2.407979     -2.354860
  H       6.256122     -0.046385      1.960017
  H      -0.554482     -4.621109      2.861364
  H       3.796686     -3.982092     -1.249582
  C       0.743869     -3.107182      2.022781
  C       2.098771     -3.418830     -0.063248
  C       2.807261     -4.386363     -0.984190
  C       0.097401     -3.800902      3.204615
  C       1.522399     -3.882639      1.127601
  O       0.515844     -1.865336      1.915630
  O       2.072315     -2.210280     -0.489215
  H       2.231475     -4.469647     -1.921391
  H       0.875438     -4.238923      3.852527
  H      -0.494234     -3.081347      3.786018
  H       2.920459     -5.381791     -0.534825
  H       1.616220     -4.946978      1.349468
  H       5.356522      1.215149      0.158712
  H      -1.930519      2.224036      0.076393
43
Coordinates from ORCA-job opt E -1129.240177464490
  C      -1.125184      1.498818      0.218916
  C      -1.152486      0.340955     -0.595146
  C      -0.221410      1.737682      1.263743
  O      -0.313010     -0.606978     -0.551393
  O       0.762099      0.984431      1.589683
  C      -0.407873      2.948698      2.149806
  C      -2.292058      0.169404     -1.577244
  H      -0.988114      2.659731      3.044393
  H      -0.951113      3.754869      1.635555
  H       0.572286      3.310906      2.493533
  H      -2.432583      1.084593     -2.174107
  H      -3.233540     -0.019853     -1.034028
  H      -2.087961     -0.679361     -2.243022
  Ru      1.399439     -0.623989      0.552585
  H       4.632992      2.625972     -1.649604
  H       5.238920     -1.213441      2.834389
  C       3.432348      1.040800     -0.759432
  C       4.153127     -0.049758      1.391846
  C       5.256114     -0.196429      2.416341
  C       3.856615      1.899531     -1.930725
  C       4.367962      0.757939      0.257965
  O       2.231795      0.614650     -0.811653
  O       3.076604     -0.676286      1.673885
  H       5.070617      0.504804      3.249196
  H       4.268108      1.252449     -2.725582
  H       2.981489      2.421342     -2.343022
  H       6.247689      0.023006      1.996226
  H      -0.547531     -4.619881      2.874015
  H       3.815529     -4.022624     -1.199048
  C       0.748617     -3.106664      2.026111
  C       2.098014     -3.421269     -0.061225
  C       2.795616     -4.384798     -0.991246
  C       0.103964     -3.796422      3.209499
  C       1.525429     -3.883690      1.129656
  O       0.519129     -1.866677      1.913486
  O       2.070845     -2.210757     -0.487201
  H       2.262780     -4.393884     -1.955821
  H       0.880676     -4.233547      3.859142
  H      -0.486578     -3.073808      3.787888
  H       2.839114     -5.405399     -0.592056
  H       1.621310     -4.947331      1.353704
  H       5.353972      1.214436      0.158906
  H      -1.921887      2.229222      0.069096
43
Coordinates from ORCA-job opt E -1129.240397424363
  C      -1.124456      1.502654      0.214821
  C      -1.153328      0.342100     -0.595778
  C      -0.221399      1.741959      1.259964
  O      -0.315348     -0.607158     -0.548619
  O       0.759601      0.986239      1.589085
  C      -0.403961      2.954709      2.144323
  C      -2.294024      0.167865     -1.575892
  H      -0.924197      2.652812      3.071401
  H      -0.999723      3.738713      1.653879
  H       0.580267      3.351877      2.435078
  H      -2.447466      1.087450     -2.163018
  H      -3.231121     -0.038187     -1.030462
  H      -2.083164     -0.672536     -2.250536
  Ru      1.397617     -0.623732      0.554585
  H       4.666096      2.587488     -1.671043
  H       5.272040     -1.233300      2.790761
  C       3.430666      1.039763     -0.759779
  C       4.151923     -0.049149      1.392197
  C       5.253900     -0.198803      2.417047
  C       3.853051      1.895306     -1.933786
  C       4.366795      0.757336      0.257577
  O       2.229556      0.614995     -0.810077
  O       3.075064     -0.675299      1.674892
  H       5.034797      0.455571      3.279228
  H       4.211013      1.240702     -2.748280
  H       2.986692      2.455360     -2.313598
  H       6.239513      0.075167      2.015614
  H      -0.551116     -4.620507      2.871495
  H       3.845378     -4.049797     -1.133784
  C       0.746566     -3.107490      2.026839
  C       2.098380     -3.420841     -0.059299
  C       2.804978     -4.381509     -0.985870
  C       0.100417     -3.798061      3.208922
  C       1.523085     -3.884008      1.129803
  O       0.518640     -1.867187      1.915964
  O       2.071351     -2.210105     -0.484469
  H       2.320175     -4.341924     -1.973709
  H       0.876001     -4.236404      3.858818
  H      -0.490276     -3.076005      3.787591
  H       2.797723     -5.413699     -0.615929
  H       1.617013     -4.947967      1.352426
  H       5.352983      1.212906      0.157480
  H      -1.919831      2.234084      0.062147
43
Coordinates from ORCA-job opt E -1129.240537346820
  C      -1.124560      1.509881      0.212728
  C      -1.153147      0.345126     -0.592499
  C      -0.224689      1.749213      1.255999
  O      -0.313739     -0.600833     -0.535299
  O       0.750739      0.985040      1.590124
  C      -0.396820      2.962930      2.137687
  C      -2.292579      0.159607     -1.568104
  H      -0.838182      2.657430      3.102624
  H      -1.048961      3.725653      1.686888
  H       0.589554      3.398987      2.357287
  H      -2.471449      1.077835     -2.149345
  H      -3.226394     -0.066903     -1.024551
  H      -2.066887     -0.672816     -2.248274
  Ru      1.401002     -0.619859      0.561835
  H       4.703486      2.539939     -1.709850
  H       5.295403     -1.237164      2.762736
  C       3.433180      1.037376     -0.759204
  C       4.149711     -0.036530      1.401685
  C       5.249161     -0.190309      2.427710
  C       3.852955      1.883095     -1.940406
  C       4.362893      0.761799      0.263487
  O       2.233800      0.611599     -0.807306
  O       3.072533     -0.659930      1.684582
  H       5.009276      0.421304      3.313261
  H       4.148335      1.224756     -2.775158
  H       3.000019      2.484328     -2.284442
  H       6.233068      0.120334      2.049209
  H      -0.563259     -4.621957      2.865029
  H       3.853249     -4.052061     -1.115949
  C       0.743716     -3.113751      2.022519
  C       2.100109     -3.419644     -0.058740
  C       2.810106     -4.376332     -0.989531
  C       0.092026     -3.802952      3.199903
  C       1.514015     -3.888234      1.119665
  O       0.528867     -1.872878      1.917725
  O       2.075521     -2.205096     -0.474574
  H       2.343719     -4.339965     -1.983675
  H       0.857981     -4.251011      3.852324
  H      -0.493475     -3.077367      3.777555
  H       2.804294     -5.412378     -0.627306
  H       1.597869     -4.954489      1.331915
  H       5.349022      1.216238      0.162282
  H      -1.919598      2.241380      0.055467
43
Coordinates from ORCA-job opt E -1129.240794996365
  C      -1.121695      1.509824      0.205031
  C      -1.154045      0.341412     -0.594794
  C      -0.223784      1.749672      1.251862
  O      -0.318402     -0.608063     -0.535657
  O       0.747313      0.984415      1.592448
  C      -0.388029      2.972059      2.123742
  C      -2.296100      0.156371     -1.569321
  H      -0.773590      2.665276      3.109992
  H      -1.077625      3.707946      1.690395
  H       0.594747      3.436939      2.294408
  H      -2.481666      1.079338     -2.139945
  H      -3.222886     -0.083868     -1.020927
  H      -2.069385     -0.667763     -2.258278
  Ru      1.397687     -0.622269      0.563362
  H       4.723745      2.516560     -1.714860
  H       5.341196     -1.265043      2.698519
  C       3.427187      1.044386     -0.755391
  C       4.151837     -0.041989      1.396268
  C       5.255459     -0.204641      2.416669
  C       3.840602      1.899760     -1.932009
  C       4.362887      0.764223      0.262057
  O       2.227525      0.617109     -0.802795
  O       3.074989     -0.667393      1.680224
  H       4.987261      0.350225      3.331559
  H       4.078041      1.245677     -2.788778
  H       3.000223      2.541104     -2.234499
  H       6.225305      0.162756      2.054352
  H      -0.574503     -4.621854      2.858492
  H       3.884461     -4.081954     -1.034802
  C       0.737396     -3.114405      2.024929
  C       2.096992     -3.421672     -0.056066
  C       2.824917     -4.377814     -0.972620
  C       0.083154     -3.806452      3.200713
  C       1.508308     -3.889794      1.122972
  O       0.523303     -1.871647      1.923785
  O       2.073139     -2.208743     -0.475422
  H       2.411268     -4.298042     -1.988640
  H       0.850670     -4.256894      3.851326
  H      -0.502227     -3.082117      3.781669
  H       2.766846     -5.419450     -0.631954
  H       1.593242     -4.956023      1.337256
  H       5.348251      1.220456      0.160572
  H      -1.912147      2.243771      0.042164
43
Coordinates from ORCA-job opt E -1129.240931580652
  C      -1.124382      1.508608      0.203375
  C      -1.154302      0.338830     -0.595699
  C      -0.225585      1.750271      1.249347
  O      -0.317266     -0.609526     -0.536112
  O       0.744810      0.984732      1.591956
  C      -0.385797      2.976246      2.117730
  C      -2.296653      0.150942     -1.569812
  H      -0.695035      2.664749      3.130546
  H      -1.128442      3.682032      1.719495
  H       0.588076      3.480105      2.223129
  H      -2.500498      1.080902     -2.123496
  H      -3.216569     -0.116245     -1.020637
  H      -2.058714     -0.658152     -2.273769
  Ru      1.398911     -0.620978      0.564214
  H       4.754581      2.479175     -1.735164
  H       5.383104     -1.281274      2.642864
  C       3.428330      1.046888     -0.755148
  C       4.154596     -0.041696      1.394593
  C       5.260785     -0.211979      2.410727
  C       3.837712      1.906059     -1.930101
  C       4.365754      0.766249      0.261031
  O       2.228574      0.619344     -0.801829
  O       3.077362     -0.666713      1.679156
  H       4.969031      0.287796      3.349805
  H       4.010337      1.258099     -2.806861
  H       3.016009      2.589966     -2.189569
  H       6.217972      0.204384      2.069278
  H      -0.589316     -4.616447      2.851100
  H       3.902385     -4.101729     -0.979016
  C       0.731132     -3.112516      2.024954
  C       2.095614     -3.421615     -0.052965
  C       2.835383     -4.377177     -0.959913
  C       0.070705     -3.804726      3.197774
  C       1.501554     -3.889765      1.124075
  O       0.521922     -1.868590      1.925689
  O       2.073622     -2.209469     -0.473563
  H       2.459215     -4.272587     -1.988047
  H       0.835091     -4.259412      3.849537
  H      -0.513688     -3.079391      3.778696
  H       2.746178     -5.421702     -0.636035
  H       1.583832     -4.956424      1.338317
  H       5.351101      1.222211      0.159028
  H      -1.915558      2.241917      0.039331
43
Coordinates from ORCA-job opt E -1129.241036685547
  C      -1.122968      1.508110      0.198984
  C      -1.153844      0.336446     -0.597807
  C      -0.226166      1.748796      1.246773
  O      -0.318766     -0.612798     -0.534901
  O       0.740301      0.980396      1.594020
  C      -0.374781      2.982279      2.105133
  C      -2.295796      0.147599     -1.572129
  H      -0.610827      2.677626      3.138184
  H      -1.158857      3.659572      1.741403
  H       0.587345      3.518122      2.144863
  H      -2.517967      1.083164     -2.108531
  H      -3.208556     -0.145644     -1.024418
  H      -2.047361     -0.645364     -2.290546
  Ru      1.397710     -0.622798      0.566111
  H       4.776743      2.444347     -1.753065
  H       5.424814     -1.293268      2.586402
  C       3.425068      1.049615     -0.752207
  C       4.153773     -0.041196      1.395299
  C       5.263670     -0.218654      2.406129
  C       3.828231      1.917007     -1.922918
  C       4.363357      0.770118      0.263468
  O       2.226728      0.618059     -0.800324
  O       3.077232     -0.667225      1.679819
  H       4.951371      0.222602      3.367510
  H       3.932229      1.283641     -2.820597
  H       3.029187      2.644143     -2.133463
  H       6.206501      0.246173      2.087999
  H      -0.599693     -4.617042      2.846999
  H       3.914551     -4.114766     -0.941179
  C       0.725123     -3.114458      2.025687
  C       2.095899     -3.423593     -0.048057
  C       2.844255     -4.378945     -0.948315
  C       0.060509     -3.806724      3.196133
  C       1.497906     -3.892043      1.127170
  O       0.518404     -1.870220      1.927137
  O       2.071818     -2.212624     -0.471331
  H       2.491602     -4.262216     -1.984157
  H       0.822152     -4.263195      3.849607
  H      -0.524251     -3.081026      3.775989
  H       2.737889     -5.425914     -0.634643
  H       1.580823     -4.958313      1.342461
  H       5.347674      1.228266      0.162280
  H      -1.911163      2.243340      0.031038
43
Coordinates from ORCA-job opt E -1129.241120130621
  C      -1.124575      1.505353      0.197345
  C      -1.153727      0.334085     -0.600841
  C      -0.226891      1.745916      1.244532
  O      -0.318596     -0.614919     -0.537848
  O       0.737942      0.976104      1.593769
  C      -0.367481      2.985877      2.095503
  C      -2.294870      0.145449     -1.576313
  H      -0.526684      2.689245      3.146068
  H      -1.194887      3.632736      1.770888
  H       0.576258      3.555640      2.066020
  H      -2.542008      1.089595     -2.086665
  H      -3.197942     -0.185169     -1.032932
  H      -2.031219     -0.622925     -2.316145
  Ru      1.396927     -0.623993      0.565137
  H       4.802513      2.405147     -1.771628
  H       5.462057     -1.303166      2.534474
  C       3.424742      1.050377     -0.750272
  C       4.152389     -0.041783      1.396595
  C       5.266224     -0.226844      2.401986
  C       3.823964      1.927070     -1.915387
  C       4.362514      0.772360      0.266054
  O       2.227704      0.614622     -0.801938
  O       3.076131     -0.667858      1.680246
  H       4.939264      0.161080      3.381177
  H       3.857163      1.314555     -2.832610
  H       3.054073      2.698482     -2.073955
  H       6.194865      0.279111      2.105132
  H      -0.610570     -4.614396      2.844041
  H       3.920786     -4.109516     -0.931931
  C       0.719317     -3.113802      2.025983
  C       2.096600     -3.425397     -0.042952
  C       2.852068     -4.381120     -0.936387
  C       0.049900     -3.804759      3.194676
  C       1.496351     -3.892842      1.132078
  O       0.513236     -1.869737      1.924988
  O       2.069721     -2.216140     -0.470387
  H       2.497859     -4.274298     -1.973405
  H       0.809178     -4.262197      3.850408
  H      -0.535445     -3.077772      3.772606
  H       2.751935     -5.427071     -0.616671
  H       1.581538     -4.958378      1.350541
  H       5.346338      1.231780      0.166446
  H      -1.912791      2.240886      0.029584
43
Coordinates from ORCA-job opt E -1129.241181675795
  C      -1.124419      1.504516      0.194313
  C      -1.153811      0.333933     -0.604897
  C      -0.227460      1.743901      1.242221
  O      -0.319955     -0.616017     -0.541095
  O       0.735330      0.972112      1.593494
  C      -0.361371      2.989248      2.086438
  C      -2.293722      0.146411     -1.581800
  H      -0.469487      2.702489      3.145258
  H      -1.214017      3.615121      1.788897
  H       0.566523      3.580234      2.009351
  H      -2.564085      1.096926     -2.067539
  H      -3.187308     -0.218623     -1.044606
  H      -2.016265     -0.597962     -2.341004
  Ru      1.394049     -0.625624      0.563784
  H       4.821782      2.369879     -1.786981
  H       5.484167     -1.309507      2.502197
  C       3.423751      1.048875     -0.747826
  C       4.148468     -0.044045      1.399501
  C       5.263871     -0.234059      2.402603
  C       3.820841      1.933509     -1.907802
  C       4.359788      0.771349      0.269568
  O       2.227708      0.609894     -0.803368
  O       3.071923     -0.668893      1.682159
  H       4.927140      0.116295      3.392248
  H       3.796139      1.342641     -2.839098
  H       3.079251      2.740131     -2.022724
  H       6.182367      0.299676      2.122795
  H      -0.609775     -4.615272      2.847325
  H       3.918082     -4.093680     -0.953180
  C       0.718327     -3.113714      2.027679
  C       2.098940     -3.426734     -0.038402
  C       2.854328     -4.382987     -0.931700
  C       0.048471     -3.803364      3.196638
  C       1.500972     -3.892605      1.138298
  O       0.508041     -1.870949      1.921923
  O       2.066476     -2.218973     -0.469959
  H       2.478672     -4.297436     -1.963700
  H       0.807648     -4.258067      3.854227
  H      -0.538922     -3.076355      3.772254
  H       2.776159     -5.426676     -0.597855
  H       1.590908     -4.956916      1.360488
  H       5.343436      1.231412      0.171881
  H      -1.911091      2.241296      0.026005
43
Coordinates from ORCA-job opt E -1129.241236208133
  C      -1.124593      1.503565      0.191218
  C      -1.153430      0.334967     -0.610586
  C      -0.227582      1.742243      1.239433
  O      -0.320397     -0.616002     -0.547488
  O       0.734630      0.969923      1.591071
  C      -0.358979      2.991046      2.079677
  C      -2.291890      0.149167     -1.589491
  H      -0.433647      2.711717      3.142997
  H      -1.228746      3.601437      1.799596
  H       0.555895      3.597063      1.970287
  H      -2.588702      1.105996     -2.045970
  H      -3.173246     -0.255972     -1.060931
  H      -1.999038     -0.565908     -2.370808
  Ru      1.390741     -0.627006      0.560643
  H       4.839201      2.337413     -1.797669
  H       5.494117     -1.316064      2.485443
  C       3.424258      1.045306     -0.745783
  C       4.143940     -0.048246      1.402853
  C       5.259671     -0.241850      2.405267
  C       3.820683      1.938619     -1.899471
  C       4.357969      0.767210      0.272977
  O       2.228512      0.604887     -0.805467
  O       3.066430     -0.670952      1.684094
  H       4.917807      0.086921      3.400257
  H       3.746564      1.370843     -2.841874
  H       3.107134      2.775169     -1.974612
  H       6.171979      0.307544      2.135414
  H      -0.603375     -4.615161      2.854311
  H       3.903450     -4.063013     -1.007762
  C       0.720252     -3.111977      2.030037
  C       2.101849     -3.427588     -0.034578
  C       2.851952     -4.385315     -0.930740
  C       0.052306     -3.799947      3.201009
  C       1.509049     -3.890791      1.145664
  O       0.502496     -1.871043      1.917174
  O       2.063778     -2.221301     -0.470351
  H       2.430311     -4.340750     -1.948045
  H       0.813376     -4.250189      3.859596
  H      -0.537405     -3.073135      3.774608
  H       2.818365     -5.421750     -0.568315
  H       1.604975     -4.953603      1.372778
  H       5.341982      1.226910      0.177567
  H      -1.910773      2.241009      0.023979
43
Coordinates from ORCA-job opt E -1129.241277875532
  C      -1.124115      1.504176      0.188252
  C      -1.152202      0.337621     -0.615850
  C      -0.227507      1.742406      1.237073
  O      -0.319240     -0.613881     -0.553666
  O       0.735620      0.970860      1.587300
  C      -0.361424      2.990023      2.078891
  C      -2.289685      0.152113     -1.595775
  H      -0.435382      2.710328      3.141698
  H      -1.232687      3.597861      1.799241
  H       0.551145      3.598821      1.968654
  H      -2.609246      1.112324     -2.028622
  H      -3.159579     -0.286164     -1.074801
  H      -1.984431     -0.538329     -2.394402
  Ru      1.388916     -0.627330      0.557389
  H       4.851822      2.316347     -1.803322
  H       5.487965     -1.317231      2.494462
  C       3.426336      1.041734     -0.744462
  C       4.140381     -0.050783      1.406707
  C       5.253212     -0.243300      2.412626
  C       3.825060      1.936836     -1.896289
  C       4.357369      0.762858      0.276215
  O       2.230429      0.601823     -0.806942
  O       3.061705     -0.671865      1.686057
  H       4.908798      0.086515      3.406261
  H       3.728163      1.379561     -2.842476
  H       3.127361      2.788082     -1.954277
  H       6.165963      0.306390      2.144788
  H      -0.591336     -4.614263      2.864034
  H       3.877838     -4.035296     -1.074692
  C       0.725766     -3.109700      2.032127
  C       2.103650     -3.427665     -0.034180
  C       2.842284     -4.387320     -0.937773
  C       0.062733     -3.795984      3.206684
  C       1.517456     -3.888299      1.149935
  O       0.500584     -1.870559      1.913103
  O       2.063023     -2.221558     -0.471232
  H       2.371981     -4.382648     -1.934790
  H       0.827022     -4.241951      3.864455
  H      -0.527900     -3.069406      3.779664
  H       2.854920     -5.414550     -0.549279
  H       1.617523     -4.950037      1.380375
  H       5.342105      1.221296      0.182509
  H      -1.910525      2.241536      0.022340
43
Coordinates from ORCA-job opt E -1129.241313894620
  C      -1.123482      1.505231      0.184250
  C      -1.149702      0.341130     -0.622628
  C      -0.227477      1.743535      1.233990
  O      -0.315896     -0.610286     -0.562291
  O       0.738619      0.974862      1.581063
  C      -0.368573      2.986194      2.081901
  C      -2.286251      0.154730     -1.603408
  H      -0.463521      2.698873      3.140939
  H      -1.231836      3.599841      1.791177
  H       0.549185      3.590313      1.993265
  H      -2.634222      1.117148     -2.007686
  H      -3.140071     -0.324075     -1.091757
  H      -1.966608     -0.504910     -2.422352
  Ru      1.388847     -0.626854      0.552774
  H       4.863737      2.303368     -1.803238
  H       5.470719     -1.317162      2.519397
  C       3.431037      1.038749     -0.743497
  C       4.138264     -0.052580      1.410831
  C       5.246090     -0.242507      2.422472
  C       3.833388      1.933793     -1.894140
  C       4.358925      0.758980      0.279808
  O       2.234532      0.600708     -0.808556
  O       3.058437     -0.673235      1.686828
  H       4.900910      0.103251      3.410357
  H       3.727607      1.380378     -2.841183
  H       3.144126      2.792293     -1.946115
  H       6.163897      0.296601      2.151180
  H      -0.574706     -4.610544      2.876982
  H       3.834558     -4.006342     -1.163639
  C       0.734456     -3.105494      2.034708
  C       2.104451     -3.427344     -0.035892
  C       2.824365     -4.391252     -0.949906
  C       0.078637     -3.789546      3.214551
  C       1.526903     -3.884371      1.153572
  O       0.500949     -1.868236      1.909106
  O       2.063332     -2.221282     -0.473507
  H       2.293152     -4.437700     -1.915030
  H       0.847352     -4.231021      3.870193
  H      -0.511893     -3.062990      3.787670
  H       2.896220     -5.403434     -0.530067
  H       1.630155     -4.945130      1.387418
  H       5.344445      1.216184      0.188279
  H      -1.911190      2.241525      0.020189
43
Coordinates from ORCA-job opt E -1129.241333023067
  C      -1.123056      1.506821      0.182508
  C      -1.148013      0.342876     -0.624459
  C      -0.227793      1.745541      1.232862
  O      -0.313286     -0.607801     -0.564162
  O       0.740248      0.978832      1.578372
  C      -0.373924      2.983575      2.086136
  C      -2.284679      0.154028     -1.604549
  H      -0.482725      2.688370      3.141641
  H      -1.231113      3.602564      1.790167
  H       0.547929      3.583609      2.015499
  H      -2.647100      1.116002     -1.996651
  H      -3.129779     -0.343291     -1.096088
  H      -1.958808     -0.491880     -2.432063
  Ru      1.390785     -0.625465      0.551974
  H       4.868984      2.298837     -1.807240
  H       5.464071     -1.313213      2.532357
  C       3.434234      1.038720     -0.743942
  C       4.139440     -0.051148      1.411917
  C       5.243992     -0.238465      2.427203
  C       3.838705      1.928996     -1.897463
  C       4.361259      0.758900      0.280324
  O       2.237168      0.602650     -0.808395
  O       3.059358     -0.672398      1.686724
  H       4.896018      0.114074      3.411720
  H       3.734269      1.370366     -2.841690
  H       3.149026      2.786662     -1.955394
  H       6.164286      0.296264      2.156423
  H      -0.570624     -4.607031      2.881210
  H       3.822366     -4.004819     -1.181530
  C       0.737647     -3.103592      2.035119
  C       2.102738     -3.426626     -0.038395
  C       2.815544     -4.392122     -0.955818
  C       0.084847     -3.786959      3.217014
  C       1.526939     -3.883093      1.152028
  O       0.503781     -1.866317      1.909451
  O       2.065070     -2.219762     -0.474074
  H       2.273576     -4.444627     -1.914540
  H       0.854866     -4.229429      3.870444
  H      -0.503270     -3.059665      3.791731
  H       2.894987     -5.401856     -0.531391
  H       1.628735     -4.944123      1.385404
  H       5.347087      1.215425      0.188922
  H      -1.911914      2.241959      0.018702
43
Coordinates from ORCA-job opt E -1129.241353473495
  C      -1.123410      1.507753      0.180820
  C      -1.145748      0.343750     -0.626111
  C      -0.228687      1.747627      1.231669
  O      -0.308985     -0.605173     -0.566300
  O       0.743114      0.984906      1.574811
  C      -0.381531      2.979936      2.091042
  C      -2.282427      0.150715     -1.605499
  H      -0.506197      2.673773      3.141986
  H      -1.232168      3.605038      1.789777
  H       0.545040      3.575368      2.042954
  H      -2.671560      1.111483     -1.973924
  H      -3.110618     -0.381271     -1.103955
  H      -1.945280     -0.468331     -2.449287
  Ru      1.395164     -0.623266      0.551152
  H       4.875341      2.297242     -1.811452
  H       5.461702     -1.308722      2.541281
  C       3.439901      1.039997     -0.745293
  C       4.143358     -0.048592      1.411854
  C       5.244923     -0.233916      2.430141
  C       3.845824      1.926238     -1.900879
  C       4.366344      0.760684      0.280109
  O       2.241979      0.606661     -0.808538
  O       3.063433     -0.671755      1.685008
  H       4.892596      0.122402      3.411830
  H       3.743205      1.361369     -2.841610
  H       3.154119      2.781756     -1.965951
  H       6.166964      0.298283      2.161534
  H      -0.570795     -4.599210      2.885408
  H       3.811845     -4.011732     -1.189548
  C       0.739787     -3.100055      2.035841
  C       2.098923     -3.425822     -0.041436
  C       2.803934     -4.394713     -0.960978
  C       0.089240     -3.782282      3.219892
  C       1.523501     -3.881387      1.149879
  O       0.507983     -1.862135      1.911410
  O       2.067399     -2.218466     -0.475290
  H       2.257331     -4.446873     -1.917158
  H       0.859818     -4.228278      3.870239
  H      -0.494235     -3.053221      3.797106
  H       2.881294     -5.403514     -0.533449
  H       1.621610     -4.942975      1.382368
  H       5.352203      1.217341      0.189164
  H      -1.914361      2.240760      0.017395
43
Coordinates from ORCA-job opt E -1129.241367242260
  C      -1.123799      1.508274      0.180138
  C      -1.144576      0.344168     -0.626589
  C      -0.229178      1.748774      1.231117
  O      -0.306527     -0.603515     -0.566668
  O       0.744626      0.988361      1.573116
  C      -0.385704      2.978200      2.093562
  C      -2.280907      0.147827     -1.605673
  H      -0.514214      2.666702      3.142657
  H      -1.235468      3.604605      1.792689
  H       0.541427      3.573552      2.053483
  H      -2.697725      1.106223     -1.948442
  H      -3.091061     -0.419764     -1.113826
  H      -1.932538     -0.441518     -2.466157
  Ru      1.398200     -0.621829      0.551043
  H       4.882240      2.290740     -1.818470
  H       5.466445     -1.305516      2.539956
  C       3.443707      1.040742     -0.746443
  C       4.146109     -0.046891      1.411457
  C       5.246472     -0.231080      2.431082
  C       3.850524      1.924737     -1.903309
  C       4.369824      0.761760      0.279514
  O       2.245382      0.608799     -0.809113
  O       3.066189     -0.670708      1.684198
  H       4.890020      0.120788      3.412950
  H       3.741088      1.359331     -2.843104
  H       3.162253      2.783141     -1.967392
  H       6.167559      0.304769      2.166645
  H      -0.575122     -4.592752      2.887472
  H       3.808212     -4.017248     -1.188758
  C       0.739316     -3.097762      2.036197
  C       2.095774     -3.425505     -0.042784
  C       2.798198     -4.396157     -0.962268
  C       0.089160     -3.778932      3.221160
  C       1.519500     -3.880541      1.148533
  O       0.510115     -1.859299      1.912908
  O       2.068502     -2.217895     -0.475796
  H       2.252519     -4.447052     -1.919139
  H       0.859211     -4.228960      3.869335
  H      -0.490034     -3.048018      3.800347
  H       2.871582     -5.405041     -0.533995
  H       1.614940     -4.942468      1.380363
  H       5.355712      1.218453      0.188787
  H      -1.916083      2.239894      0.017228
43
Coordinates from ORCA-job opt E -1129.241399111020
  C      -1.125365      1.507861      0.180820
  C      -1.144027      0.343716     -0.625646
  C      -0.229461      1.749774      1.230930
  O      -0.303554     -0.601852     -0.566128
  O       0.747620      0.993223      1.570937
  C      -0.390023      2.976885      2.095552
  C      -2.279019      0.141930     -1.605128
  H      -0.525644      2.660654      3.142654
  H      -1.237822      3.605341      1.793351
  H       0.538260      3.571386      2.064889
  H      -2.752699      1.091658     -1.892536
  H      -3.049021     -0.498744     -1.139142
  H      -1.909045     -0.381128     -2.499297
  Ru      1.402922     -0.619849      0.550859
  H       4.892157      2.283232     -1.826221
  H       5.477779     -1.301876      2.531650
  C       3.449521      1.041701     -0.748689
  C       4.150426     -0.044338      1.410344
  C       5.250626     -0.228083      2.430153
  C       3.857425      1.924899     -1.905569
  C       4.375101      0.763746      0.278269
  O       2.250881      0.610952     -0.811366
  O       3.070746     -0.669155      1.682713
  H       4.889781      0.114211      3.413861
  H       3.738145      1.361651     -2.845507
  H       3.174705      2.788179     -1.965559
  H       6.168967      0.315128      2.171380
  H      -0.586829     -4.580599      2.889311
  H       3.804198     -4.026682     -1.184242
  C       0.736618     -3.093763      2.036922
  C       2.090836     -3.425290     -0.043478
  C       2.790885     -4.398983     -0.961660
  C       0.085278     -3.773034      3.222452
  C       1.512159     -3.879087      1.147486
  O       0.512381     -1.854381      1.915304
  O       2.069474     -2.217823     -0.476538
  H       2.248310     -4.448427     -1.920723
  H       0.853385     -4.231260      3.867159
  H      -0.486091     -3.038733      3.805040
  H       2.857359     -5.408302     -0.532615
  H       1.603255     -4.941490      1.378516
  H       5.360955      1.220697      0.188014
  H      -1.919683      2.237445      0.019486
43
Coordinates from ORCA-job opt E -1129.241450279075
  C      -1.127503      1.507040      0.184102
  C      -1.145101      0.342594     -0.621279
  C      -0.228658      1.750923      1.232077
  O      -0.302069     -0.600924     -0.561983
  O       0.750899      0.997665      1.570038
  C      -0.391879      2.977372      2.097457
  C      -2.276834      0.135014     -1.602943
  H      -0.540059      2.659680      3.142788
  H      -1.234787      3.610129      1.789866
  H       0.539012      3.568183      2.076741
  H      -2.825894      1.063170     -1.813531
  H      -2.985968     -0.600238     -1.183170
  H      -1.882317     -0.289879     -2.538171
  Ru      1.407261     -0.617988      0.551802
  H       4.900274      2.276746     -1.833489
  H       5.492347     -1.297153      2.519675
  C       3.454238      1.041542     -0.752243
  C       4.154655     -0.041572      1.408217
  C       5.255870     -0.224386      2.427334
  C       3.863272      1.923956     -1.909391
  C       4.379834      0.764895      0.275315
  O       2.255500      0.611710     -0.814528
  O       3.074971     -0.666184      1.681969
  H       4.892551      0.107363      3.413766
  H       3.737505      1.363162     -2.850047
  H       3.185092      2.791170     -1.965957
  H       6.170476      0.327410      2.172876
  H      -0.605839     -4.565839      2.888759
  H       3.805775     -4.038150     -1.168741
  C       0.731274     -3.089911      2.037716
  C       2.085465     -3.425103     -0.042777
  C       2.786500     -4.400944     -0.958193
  C       0.076849     -3.767453      3.222517
  C       1.502424     -3.877862      1.146547
  O       0.514132     -1.849318      1.918786
  O       2.070231     -2.217628     -0.475986
  H       2.254521     -4.443481     -1.923780
  H       0.841497     -4.237962      3.862422
  H      -0.483863     -3.029182      3.810324
  H       2.839789     -5.412842     -0.532877
  H       1.588356     -4.940914      1.376029
  H       5.365702      1.221741      0.184777
  H      -1.923632      2.234839      0.025198
43
Coordinates from ORCA-job opt E -1129.241502952295
  C      -1.130117      1.505439      0.190046
  C      -1.148129      0.341197     -0.614738
  C      -0.227487      1.751070      1.235208
  O      -0.303940     -0.601907     -0.555854
  O       0.752747      0.998917      1.571460
  C      -0.389456      2.979935      2.098179
  C      -2.273426      0.133019     -1.602947
  H      -0.554098      2.666537      3.142514
  H      -1.223936      3.618895      1.779800
  H       0.546030      3.563245      2.085051
  H      -2.890236      1.031443     -1.738309
  H      -2.919440     -0.686382     -1.242432
  H      -1.859239     -0.187103     -2.571604
  Ru      1.407710     -0.617849      0.553633
  H       4.899483      2.275985     -1.835300
  H       5.502245     -1.295710      2.507553
  C       3.453808      1.039595     -0.755697
  C       4.155833     -0.040592      1.405600
  C       5.259682     -0.223642      2.422114
  C       3.862605      1.922644     -1.912772
  C       4.380443      0.763888      0.271368
  O       2.255349      0.609528     -0.817201
  O       3.075935     -0.663694      1.682281
  H       4.898709      0.102276      3.411253
  H       3.738365      1.363691     -2.854713
  H       3.184728      2.790254     -1.967848
  H       6.171246      0.333101      2.166889
  H      -0.622879     -4.555174      2.886856
  H       3.811292     -4.044772     -1.150915
  C       0.726271     -3.087966      2.039825
  C       2.083189     -3.425239     -0.039054
  C       2.787786     -4.401531     -0.951605
  C       0.068179     -3.764983      3.222781
  C       1.496853     -3.877066      1.148816
  O       0.513444     -1.846782      1.922242
  O       2.069467     -2.218093     -0.473704
  H       2.266624     -4.436517     -1.923414
  H       0.829506     -4.246318      3.858462
  H      -0.484098     -3.024457      3.815550
  H       2.830462     -5.416221     -0.531886
  H       1.580551     -4.940337      1.377666
  H       5.366449      1.220034      0.179372
  H      -1.926640      2.233031      0.033483
43
Coordinates from ORCA-job opt E -1129.241549995734
  C      -1.132159      1.504143      0.196658
  C      -1.152165      0.340516     -0.608063
  C      -0.225979      1.750945      1.238958
  O      -0.309347     -0.604555     -0.548624
  O       0.752402      0.996703      1.574614
  C      -0.383049      2.984057      2.097775
  C      -2.269719      0.137912     -1.605556
  H      -0.563455      2.678907      3.141932
  H      -1.207353      3.630049      1.766379
  H       0.558153      3.557403      2.088990
  H      -2.934992      1.008019     -1.681068
  H      -2.864408     -0.741257     -1.305012
  H      -1.841905     -0.089985     -2.594674
  Ru      1.403499     -0.619552      0.556093
  H       4.888932      2.279608     -1.833384
  H       5.504489     -1.297682      2.498872
  C       3.447614      1.035747     -0.758566
  C       4.153366     -0.041898      1.402841
  C       5.260215     -0.225792      2.416289
  C       3.854639      1.919456     -1.916186
  C       4.376161      0.760416      0.266907
  O       2.249596      0.604637     -0.818367
  O       3.072909     -0.662091      1.683552
  H       4.904364      0.099460      3.407337
  H       3.739304      1.359980     -2.858832
  H       3.172465      2.783452     -1.973179
  H       6.170257      0.331865      2.156742
  H      -0.633991     -4.550953      2.884111
  H       3.821999     -4.045917     -1.130035
  C       0.723541     -3.088785      2.043181
  C       2.084736     -3.425793     -0.033066
  C       2.795337     -4.400125     -0.943186
  C       0.062252     -3.766774      3.223585
  C       1.497322     -3.877177      1.153940
  O       0.510953     -1.847716      1.925291
  O       2.067268     -2.218990     -0.469684
  H       2.285750     -4.425114     -1.921003
  H       0.821167     -4.256070      3.855950
  H      -0.485065     -3.026025      3.820659
  H       2.829448     -5.417984     -0.531370
  H       1.582550     -4.940220      1.383256
  H       5.362381      1.215400      0.172356
  H      -1.927610      2.233169      0.041601
43
Coordinates from ORCA-job opt E -1129.241573671275
  C      -1.132707      1.503919      0.198911
  C      -1.153642      0.340926     -0.606435
  C      -0.225835      1.751054      1.240515
  O      -0.313104     -0.606473     -0.545635
  O       0.750710      0.994388      1.576454
  C      -0.379251      2.986291      2.097120
  C      -2.267115      0.143909     -1.609655
  H      -0.567376      2.685394      3.140962
  H      -1.197059      3.636652      1.758240
  H       0.565747      3.553008      2.091348
  H      -2.950170      1.002319     -1.659393
  H      -2.841115     -0.758255     -1.339946
  H      -1.832961     -0.040409     -2.605386
  Ru      1.399101     -0.620884      0.557466
  H       4.878906      2.283571     -1.831123
  H       5.499623     -1.301818      2.497691
  C       3.441959      1.033544     -0.758999
  C       4.150611     -0.043768      1.401736
  C       5.258720     -0.229373      2.413425
  C       3.847078      1.917188     -1.917463
  C       4.371916      0.757698      0.264964
  O       2.244039      0.601807     -0.817140
  O       3.069617     -0.661957      1.684436
  H       4.906284      0.098867      3.404565
  H       3.738829      1.355387     -2.859461
  H       3.160405      2.777250     -1.977564
  H       6.169536      0.325286      2.150362
  H      -0.634917     -4.550776      2.883709
  H       3.826596     -4.042910     -1.122753
  C       0.724950     -3.089912      2.046348
  C       2.087369     -3.426052     -0.028983
  C       2.799909     -4.398776     -0.939219
  C       0.062964     -3.768987      3.225643
  C       1.501828     -3.877172      1.158742
  O       0.509500     -1.849339      1.926907
  O       2.065312     -2.219424     -0.466669
  H       2.292608     -4.419302     -1.917890
  H       0.821370     -4.261201      3.856323
  H      -0.483169     -3.028973      3.824834
  H       2.833316     -5.417491     -0.530265
  H       1.590002     -4.939813      1.389308
  H       5.358394      1.211712      0.168518
  H      -1.926906      2.234282      0.043461
43
Coordinates from ORCA-job opt E -1129.241584938725
  C      -1.131807      1.505028      0.198090
  C      -1.153423      0.342029     -0.607195
  C      -0.226096      1.751743      1.240604
  O      -0.315481     -0.607550     -0.544225
  O       0.748650      0.992917      1.577623
  C      -0.378339      2.986766      2.097518
  C      -2.263722      0.149435     -1.615023
  H      -0.570588      2.685599      3.140504
  H      -1.192177      3.640412      1.755314
  H       0.569102      3.549374      2.096325
  H      -2.956227      1.000869     -1.650089
  H      -2.825956     -0.765273     -1.365208
  H      -1.825125     -0.007882     -2.613488
  Ru      1.395815     -0.621755      0.558738
  H       4.870683      2.286825     -1.830735
  H       5.494137     -1.305426      2.498819
  C       3.437532      1.032763     -0.758496
  C       4.148906     -0.045466      1.400938
  C       5.257520     -0.232343      2.411635
  C       3.840683      1.915722     -1.918070
  C       4.368762      0.756192      0.264012
  O       2.239460      0.600940     -0.814717
  O       3.067618     -0.662613      1.684715
  H       4.906567      0.099086      3.402221
  H       3.736576      1.350718     -2.858596
  H       3.150105      2.772303     -1.981528
  H       6.169830      0.318776      2.146639
  H      -0.633375     -4.550139      2.886111
  H       3.827301     -4.040747     -1.120405
  C       0.727561     -3.090873      2.049524
  C       2.088575     -3.426392     -0.026538
  C       2.800961     -4.398234     -0.937687
  C       0.066605     -3.770508      3.229086
  C       1.505741     -3.877418      1.162496
  O       0.509209     -1.850753      1.928793
  O       2.063416     -2.219799     -0.464447
  H       2.292927     -4.416952     -1.915712
  H       0.825132     -4.265174      3.857658
  H      -0.477755     -3.030707      3.830330
  H       2.835400     -5.416808     -0.528785
  H       1.596387     -4.939687      1.394252
  H       5.355323      1.209808      0.166165
  H      -1.924542      2.236582      0.040845
43
Coordinates from ORCA-job opt E -1129.241589286498
  C      -1.131157      1.506259      0.196627
  C      -1.152735      0.343105     -0.608700
  C      -0.227112      1.752092      1.240565
  O      -0.316651     -0.607920     -0.543893
  O       0.746661      0.992055      1.578686
  C      -0.379324      2.986321      2.098110
  C      -2.260593      0.153370     -1.619996
  H      -0.572231      2.683452      3.140485
  H      -1.191892      3.641373      1.755808
  H       0.569077      3.547560      2.099681
  H      -2.958503      1.000833     -1.647138
  H      -2.816480     -0.768294     -1.381937
  H      -1.818739      0.011577     -2.619546
  Ru      1.393987     -0.622056      0.559857
  H       4.865424      2.289752     -1.830803
  H       5.490501     -1.308619      2.499289
  C       3.434806      1.033152     -0.757579
  C       4.148334     -0.046868      1.400247
  C       5.257607     -0.234943      2.409840
  C       3.836523      1.915619     -1.917891
  C       4.367106      0.755693      0.263610
  O       2.236501      0.601485     -0.812321
  O       3.067020     -0.663634      1.684610
  H       4.907756      0.099034      3.400009
  H       3.734449      1.348038     -2.857182
  H       3.143116      2.769662     -1.983947
  H       6.171360      0.312988      2.143578
  H      -0.632493     -4.548547      2.889363
  H       3.826765     -4.040038     -1.119266
  C       0.729643     -3.091403      2.052057
  C       2.088582     -3.426603     -0.025169
  C       2.800529     -4.398151     -0.936874
  C       0.070014     -3.771130      3.232381
  C       1.508056     -3.877674      1.165090
  O       0.509169     -1.851666      1.930410
  O       2.061594     -2.220181     -0.463256
  H       2.291579     -4.416811     -1.914338
  H       0.828573     -4.268361      3.858857
  H      -0.471915     -3.030960      3.835423
  H       2.835792     -5.416289     -0.526906
  H       1.600372     -4.939638      1.397792
  H       5.353696      1.209136      0.164821
  H      -1.922899      2.238623      0.037560
43
Coordinates from ORCA-job opt E -1129.241592051619
  C      -1.129824      1.507909      0.194510
  C      -1.151903      0.344346     -0.610526
  C      -0.227733      1.752216      1.240248
  O      -0.318071     -0.608301     -0.543568
  O       0.744653      0.990798      1.580122
  C      -0.380238      2.985684      2.098516
  C      -2.257395      0.157459     -1.625057
  H      -0.570938      2.681126      3.140895
  H      -1.193779      3.640650      1.758288
  H       0.567903      3.547617      2.100067
  H      -2.956834      1.003695     -1.649429
  H      -2.811719     -0.766555     -1.393493
  H      -1.812797      0.022793     -2.624307
  Ru      1.392333     -0.622595      0.561018
  H       4.860219      2.293256     -1.830122
  H       5.488065     -1.311317      2.499040
  C       3.432011      1.033751     -0.756483
  C       4.147642     -0.048283      1.399657
  C       5.257975     -0.237186      2.407939
  C       3.832358      1.916382     -1.916998
  C       4.365225      0.755741      0.263589
  O       2.233599      0.601840     -0.810328
  O       3.066695     -0.665216      1.684421
  H       4.909574      0.098992      3.397977
  H       3.732143      1.347119     -2.855554
  H       3.136341      2.768135     -1.985004
  H       6.172873      0.308124      2.140291
  H      -0.632468     -4.546968      2.893259
  H       3.826341     -4.039782     -1.118499
  C       0.731251     -3.092424      2.054319
  C       2.088194     -3.427186     -0.024039
  C       2.800287     -4.398453     -0.935964
  C       0.073173     -3.772036      3.235646
  C       1.509809     -3.878458      1.167324
  O       0.508775     -1.853104      1.931778
  O       2.059292     -2.221092     -0.462565
  H       2.290641     -4.418265     -1.913099
  H       0.831742     -4.272346      3.859629
  H      -0.465489     -3.031126      3.840758
  H       2.836728     -5.416199     -0.524816
  H       1.603787     -4.940093      1.400894
  H       5.351667      1.209416      0.164195
  H      -1.920233      2.241328      0.033481
