13
Coordinates from ORCA-job opt E -1819.727146045710
  Fe     -2.530418      1.635003     -0.011191
  C      -2.488120      3.573522     -0.060841
  C      -0.595590      1.590038     -0.141575
  C      -2.569949     -0.303246      0.039780
  C      -4.464508      1.678952      0.118528
  N      -5.627648      1.706044      0.196329
  N      -2.462866      4.738899     -0.092398
  N       0.567526      1.563111     -0.219593
  N      -2.592245     -1.468633      0.070496
  C      -2.664039      1.587232     -1.946284
  N      -2.744013      1.555112     -3.109144
  C      -2.399732      1.681978      1.922940
  N      -2.319867      1.709518      3.085933
13
Coordinates from ORCA-job opt E -1819.729709992642
  Fe     -2.530525      1.634911     -0.011225
  C      -2.493822      3.583799     -0.055524
  C      -0.585367      1.584508     -0.136524
  C      -2.565149     -0.313730      0.033861
  C      -4.475007      1.684712      0.113551
  N      -5.644982      1.714866      0.190231
  N      -2.470100      4.756082     -0.084380
  N       0.584725      1.556255     -0.212036
  N      -2.586457     -1.486078      0.061642
  C      -2.670145      1.581157     -1.955810
  N      -2.751929      1.545974     -3.125285
  C      -2.393065      1.687879      1.932476
  N      -2.309648      1.717194      3.102004
13
Coordinates from ORCA-job opt E -1819.732424673518
  Fe     -2.530769      1.634698     -0.011338
  C      -2.506467      3.607119     -0.043683
  C      -0.562162      1.572216     -0.125275
  C      -2.554487     -0.337533      0.020722
  C      -4.498836      1.697544      0.102480
  N      -5.673392      1.734094      0.176048
  N      -2.486300      4.784147     -0.066330
  N       0.612814      1.541356     -0.194605
  N      -2.573515     -1.514649      0.041884
  C      -2.683783      1.567567     -1.977490
  N      -2.768770      1.526055     -3.151092
  C      -2.378128      1.701016      1.954095
  N      -2.287675      1.733900      3.127565
13
Coordinates from ORCA-job opt E -1819.733765107865
  Fe     -2.530969      1.634519     -0.011485
  C      -2.517100      3.628520     -0.033635
  C      -0.540868      1.561781     -0.115773
  C      -2.545489     -0.359347      0.009652
  C      -4.520669      1.708479      0.093136
  N      -5.694161      1.749965      0.163918
  N      -2.499862      4.804617     -0.051125
  N       0.633288      1.529034     -0.179806
  N      -2.562744     -1.535506      0.025471
  C      -2.695512      1.555927     -1.997499
  N      -2.782676      1.509607     -3.169690
  C      -2.365229      1.712211      1.973960
  N      -2.269479      1.747723      3.145859
13
Coordinates from ORCA-job opt E -1819.734093870301
  Fe     -2.531011      1.634469     -0.011584
  C      -2.520469      3.638904     -0.030349
  C      -0.530537      1.558273     -0.112763
  C      -2.542591     -0.369864      0.006109
  C      -4.531179      1.712191      0.090167
  N      -5.701853      1.754765      0.160048
  N      -2.504039      4.812215     -0.046384
  N       0.640860      1.525223     -0.175238
  N      -2.559549     -1.543200      0.020586
  C      -2.699697      1.551905     -2.007368
  N      -2.787179      1.504635     -3.176664
  C      -2.360561      1.716018      1.983732
  N      -2.263664      1.751997      3.152689
13
Coordinates from ORCA-job opt E -1819.734124064559
  Fe     -2.530954      1.634497     -0.011614
  C      -2.519189      3.640423     -0.031456
  C      -0.529023      1.559286     -0.113921
  C      -2.543621     -0.371336      0.007399
  C      -4.532626      1.711151      0.091296
  N      -5.702269      1.752668      0.161548
  N      -2.502291      4.812673     -0.048328
  N       0.641294      1.526704     -0.177249
  N      -2.561075     -1.543598      0.022907
  C      -2.698807      1.552945     -2.008958
  N      -2.785771      1.506836     -3.177293
  C      -2.361468      1.714965      1.985314
  N      -2.265670      1.750314      3.153335
13
Coordinates from ORCA-job opt E -1819.734135169482
  Fe     -2.530868      1.634535     -0.011626
  C      -2.517150      3.640773     -0.033264
  C      -0.528660      1.560990     -0.115758
  C      -2.545277     -0.371618      0.009467
  C      -4.532865      1.709366      0.093092
  N      -5.702173      1.749411      0.163944
  N      -2.499572      4.812646     -0.051410
  N       0.641250      1.528989     -0.180426
  N      -2.563374     -1.543497      0.026460
  C      -2.697129      1.554790     -2.009457
  N      -2.783464      1.510289     -3.177554
  C      -2.363233      1.713154      1.985846
  N      -2.268955      1.747702      3.153665
13
Coordinates from ORCA-job opt E -1819.734143420654
  Fe     -2.530734      1.634580     -0.011623
  C      -2.514428      3.641118     -0.035659
  C      -0.528276      1.563212     -0.118202
  C      -2.547465     -0.371888      0.012210
  C      -4.533050      1.706999      0.095484
  N      -5.702354      1.745001      0.167144
  N      -2.495955      4.812925     -0.055584
  N       0.641524      1.531934     -0.184779
  N      -2.566402     -1.543699      0.031257
  C      -2.694885      1.557262     -2.009985
  N      -2.780432      1.515042     -3.178203
  C      -2.365589      1.710758      1.986462
  N      -2.273424      1.744286      3.154458
13
Coordinates from ORCA-job opt E -1819.734145745723
  Fe     -2.530650      1.634590     -0.011602
  C      -2.513300      3.641360     -0.036611
  C      -0.527990      1.564035     -0.119197
  C      -2.548329     -0.372122      0.013314
  C      -4.533212      1.706064      0.096461
  N      -5.702725      1.743060      0.168451
  N      -2.494469      4.813342     -0.057393
  N       0.641959      1.533011     -0.186737
  N      -2.567603     -1.544108      0.033339
  C      -2.693991      1.558270     -2.010275
  N      -2.779238      1.517244     -3.178754
  C      -2.366515      1.709819      1.986848
  N      -2.275407      1.742965      3.155135
13
Coordinates from ORCA-job opt E -1819.734146401867
  Fe     -2.530606      1.634580     -0.011576
  C      -2.513129      3.641469     -0.036700
  C      -0.527842      1.564039     -0.119319
  C      -2.548406     -0.372256      0.013440
  C      -4.533293      1.705978      0.096585
  N      -5.702934      1.742621      0.168611
  N      -2.494262      4.813565     -0.057753
  N       0.642206      1.532999     -0.187203
  N      -2.567707     -1.544356      0.033768
  C      -2.693898      1.558402     -2.010359
  N      -2.779122      1.517867     -3.178977
  C      -2.366596      1.709742      1.987013
  N      -2.275880      1.742879      3.155450
