5
Coordinates from ORCA-job optfreq
  C   -2.72076234252158      2.17855279396518     -0.05604836451683
  F   -1.37066140285040      2.16311487454748     -0.03567576726460
  F   -3.15460321307410      2.89354524228244      1.00420582191410
  F   -3.16365765069944      0.90964916483466      0.07532846513151
  H   -3.08471539085447      2.61630792437024     -0.98780015526418
