5
Coordinates from ORCA-job optfreq
  C   -2.71919795521837      2.17680975165277     -0.05223436907308
  F   -1.38601707207663      2.16285226249953     -0.03357027819430
  F   -3.14812177978906      2.88405526888164      0.99357180283601
  F   -3.15802445467635      0.92382115933032      0.07541247871180
  H   -3.08303873823960      2.61363155763573     -0.98316963428043
