5

C         -2.69888        2.15224        0.00000
H         -1.62888        2.15224        0.00000
H         -3.05554        2.73205        0.82553
H         -3.05555        1.14740        0.08937
H         -3.05555        2.57725       -0.91490
