5
Coordinates from ORCA-job optfreq E -238.851808521048
  C      -2.735340      2.122810     -0.041890
  F      -1.353840      2.120060     -0.045810
  F      -3.191330      2.872350      1.025280
  H      -3.106940      1.081710      0.051850
  H      -3.106950      2.564250     -0.989430
5
Coordinates from ORCA-job optfreq E -238.852499037056
  C      -2.740672      2.118534     -0.047961
  F      -1.370145      2.121344     -0.043982
  F      -3.183881      2.863970      1.013312
  H      -3.099843      1.083049      0.062986
  H      -3.099858      2.574283     -0.984356
5
Coordinates from ORCA-job optfreq E -238.852573488035
  C      -2.742813      2.116829     -0.050382
  F      -1.374357      2.119960     -0.045946
  F      -3.184768      2.861257      1.009432
  H      -3.096218      1.081263      0.070401
  H      -3.096244      2.581871     -0.983505
5
Coordinates from ORCA-job optfreq E -238.852587278343
  C      -2.743653      2.116163     -0.051330
  F      -1.374351      2.118562     -0.047931
  F      -3.187061      2.860808      1.008787
  H      -3.094651      1.080280      0.073760
  H      -3.094683      2.585367     -0.983286
5
Coordinates from ORCA-job optfreq E -238.852589320521
  C      -2.743968      2.115914     -0.051686
  F      -1.373756      2.117979     -0.048758
  F      -3.188209      2.860939      1.008973
  H      -3.094216      1.079987      0.074711
  H      -3.094251      2.586362     -0.983240
5
Coordinates from ORCA-job optfreq E -238.852589381482
  C      -2.744010      2.115881     -0.051733
  F      -1.373625      2.117992     -0.048741
  F      -3.188231      2.861012      1.009079
  H      -3.094250      1.079989      0.074653
  H      -3.094284      2.586306     -0.983258
