5
Coordinates from ORCA-job optfreq E -139.766412333469
  C      -2.680740      2.122740     -0.041990
  H      -1.571340      2.122750     -0.041990
  F      -3.141240      2.871370      1.023880
  H      -3.050540      1.080900      0.050680
  H      -3.050540      2.563420     -0.990580
5
Coordinates from ORCA-job optfreq E -139.767087598041
  C      -2.678948      2.119872     -0.046147
  H      -1.588233      2.122545     -0.042323
  F      -3.137817      2.866272      1.016742
  H      -3.044733      1.096564      0.048424
  H      -3.044670      2.555927     -0.976696
5
Coordinates from ORCA-job optfreq E -139.767095362827
  C      -2.678403      2.119026     -0.047366
  H      -1.588079      2.123105     -0.041538
  F      -3.137515      2.865983      1.016367
  H      -3.045242      1.096654      0.048987
  H      -3.045161      2.556412     -0.976450
5
Coordinates from ORCA-job optfreq E -139.767099198179
  C      -2.677658      2.117893     -0.048991
  H      -1.587454      2.123860     -0.040487
  F      -3.137245      2.865778      1.016113
  H      -3.046075      1.096396      0.049808
  H      -3.045967      2.557254     -0.976442
5
Coordinates from ORCA-job optfreq E -139.767099220671
  C      -2.677655      2.117895     -0.048985
  H      -1.587453      2.123840     -0.040518
  F      -3.137277      2.865805      1.016148
  H      -3.046062      1.096395      0.049797
  H      -3.045953      2.557245     -0.976443
