
$orca_opt_file

$trust
    0.300000000000

$epredict
    0.000000000000

$ediffsc
  1000.000000000000

$ctyp
  3

$coordinates
 3 15
  -5.10014407   4.06714417   0.00000000  -3.07813711   4.06714417   0.00000000
  -5.77413379   5.16282628   1.56002562  -5.77415269   2.16827177   0.16888482
  -5.77415269   4.87029668  -1.72891044
  -5.09999290   4.06727092  -0.00006163  -3.04520447   4.06724299   0.00019040
  -5.78495588   5.18049666   1.58546498  -5.78528852   2.13771112   0.17141238
  -5.78527857   4.88296139  -1.75700612
  -5.09989701   4.06735326  -0.00010064  -3.04388645   4.06731213   0.00032231
  -5.78528430   5.18109072   1.58650239  -5.78583388   2.13667483   0.17140490
  -5.78581870   4.88325214  -1.75812897

# redundant internal coordinates
#  nbonds nangles ndihedrals nimpropers ncartesians
# bond  definitions A B
# angle definitions A B C
# dihedral definitions A B C D
# improper torsion definitions A B C D
# cartesian definitions A x/y/z
$redundant_internals
 4 6 0 0 0
   1   0   0
   2   0   0
   3   0   0
   4   0   0
   1   0   3   0   0
   2   0   3   0   0
   1   0   4   0   0
   2   0   4   0   0
   3   0   4   0   0
   1   0   2   0   0
$energies
 3
 -40.5203989045710955
 -40.5212541142910041
 -40.5212553721733073

$gradients
 3 15
  -0.0001108470256920  -0.0001091732717565   0.0000982686109069  -0.0127610433126517
  -0.0000552580896093   0.0000310694565848   0.0042205317772194  -0.0068947905732432
  -0.0098836685649785   0.0042855435229029   0.0119632624365170  -0.0010194738246663
   0.0043577723473430  -0.0049798774766308   0.0109119303056326
  -0.0000721675099248  -0.0000765193806067   0.0000614810520113  -0.0004593545229001
  -0.0000458866373778   0.0000508003162325   0.0001185293688117  -0.0002367426376950
  -0.0003696733480439   0.0001668661569734   0.0004284830079538  -0.0000099677504557
   0.0002398162632027  -0.0001392627920500   0.0004123295302789
  -0.0000434217454740  -0.0000495349387234   0.0000460609355578  -0.0000203350049955
  -0.0000415589425529   0.0000641978012531  -0.0000242418523185  -0.0000056270577335
  -0.0000184586694323   0.0000019532284277   0.0000146526618966   0.0000184300422191
   0.0000797527937079   0.0000125350803756   0.0000350102381948

$redundant_coords
 3 10
   2.0220069632957389   2.0219943997568963   2.0220104172529756   2.0219972488438058
   1.9106359365492187   1.9106305756589785   1.9106382391129895   1.9106455560599669
   1.9106202855813550   1.9106288245192296
   2.0547884432977810   2.0548334351005919   2.0548076385560914   2.0547071191230595
   1.9107945394808210   1.9104643724074628   1.9109480725476802   1.9108540640546956
   1.9101881018030118   1.9105502088875637
   2.0560105965114071   2.0560826922535660   2.0560746012341906   2.0559287870984306
   1.9108936297720693   1.9103502696447825   1.9111440579029364   1.9109897422741959
   1.9099315898904412   1.9104899770792618

$redundant_gradients
 3 10
  -0.0127594348841528  -0.0127821478110169  -0.0127654764724240  -0.0127318018407401
  -0.0000474789350156   0.0000497485737942  -0.0000927485706253  -0.0000624179999729
   0.0001293672325875   0.0000235300549860
  -0.0004580925547209  -0.0004682282179230  -0.0004748231500242  -0.0004579162162901
  -0.0000284300669978   0.0000327343511874  -0.0000562293226238  -0.0000389270072807
   0.0000735937512150   0.0000172786265271
  -0.0000190738488613  -0.0000245144564432  -0.0000287762728808  -0.0000216244442681
  -0.0000153275306833   0.0000201516723104  -0.0000326077689619  -0.0000214650227200
   0.0000408590042179   0.0000084099136708

$hessian_approx
 15 15
                  0          1          2          3          4          5    
      0       0.903150  -0.001650   0.000834  -0.396585  -0.000178  -0.000807
      1      -0.001650   0.903600   0.000726  -0.007635  -0.145763  -0.000701
      2       0.000834   0.000726   0.904687   0.003664   0.000076  -0.145259
      3      -0.396585  -0.007635   0.003664   0.382541  -0.000622  -0.003716
      4      -0.000178  -0.145763   0.000076  -0.000622   0.109191  -0.000075
      5      -0.000807  -0.000701  -0.145259  -0.003716  -0.000075   0.108865
      6      -0.169632   0.046121   0.061065   0.001105   0.039647   0.057349
      7       0.039285  -0.220380  -0.099378  -0.000396   0.007725   0.009603
      8       0.054526  -0.107678  -0.286489  -0.007166   0.010866   0.013074
      9      -0.168352  -0.072209   0.005018   0.006949  -0.068058   0.007802
     10      -0.067162  -0.351730   0.015496   0.005138   0.024671   0.001388
     11       0.006419   0.018719  -0.147183   0.001491  -0.002153   0.000066
     12      -0.168581   0.035370  -0.070580   0.005995   0.029212  -0.060627
     13       0.029702  -0.185728   0.083080   0.003597   0.004177  -0.010215
     14      -0.060977   0.088930  -0.325754   0.005784  -0.008715   0.023251
                  6          7          8          9         10         11    
      0      -0.169632   0.039285   0.054526  -0.168352  -0.067162   0.006419
      1       0.046121  -0.220380  -0.107678  -0.072209  -0.351730   0.018719
      2       0.061065  -0.099378  -0.286489   0.005018   0.015496  -0.147183
      3       0.001105  -0.000396  -0.007166   0.006949   0.005138   0.001491
      4       0.039647   0.007725   0.010866  -0.068058   0.024671  -0.002153
      5       0.057349   0.009603   0.013074   0.007802   0.001388   0.000066
      6       0.139948  -0.050415  -0.069688   0.014138  -0.009505  -0.029610
      7      -0.050415   0.191867   0.114463   0.030317  -0.013635  -0.048769
      8      -0.069688   0.114463   0.266547  -0.005507   0.013483   0.023350
      9       0.014138   0.030317  -0.005507   0.135385   0.080409  -0.008067
     10      -0.009505  -0.013635   0.013483   0.080409   0.349450  -0.023218
     11      -0.029610  -0.048769   0.023350  -0.008067  -0.023218   0.111334
     12       0.014441  -0.018789   0.027839   0.011880  -0.008882   0.029767
     13      -0.025875   0.034468  -0.031075   0.029515  -0.008830   0.055428
     14      -0.019134   0.024112  -0.016439   0.000738  -0.007200   0.012439
                 12         13         14    
      0      -0.168581   0.029702  -0.060977
      1       0.035370  -0.185728   0.088930
      2      -0.070580   0.083080  -0.325754
      3       0.005995   0.003597   0.005784
      4       0.029212   0.004177  -0.008715
      5      -0.060627  -0.010215   0.023251
      6       0.014441  -0.025875  -0.019134
      7      -0.018789   0.034468   0.024112
      8       0.027839  -0.031075  -0.016439
      9       0.011880   0.029515   0.000738
     10      -0.008882  -0.008830  -0.007200
     11       0.029767   0.055428   0.012439
     12       0.136264  -0.036938   0.073586
     13      -0.036938   0.155947  -0.097193
     14       0.073586  -0.097193   0.306456

$bmatrix
 10 15
                  0          1          2          3          4          5    
      0      -1.000000   0.000020  -0.000206   1.000000  -0.000020   0.000206
      1       0.333346  -0.541679  -0.771663   0.000000   0.000000   0.000000
      2       0.333615   0.939012  -0.083414   0.000000   0.000000   0.000000
      3       0.333631  -0.396852   0.855102   0.000000   0.000000   0.000000
      4       0.458481  -0.646080   0.057533   0.000019   0.484468  -0.043071
      5      -0.458612  -0.273211   0.587964   0.000000   0.000000   0.000000
      6       0.458624   0.273109  -0.588359  -0.000095  -0.204762   0.441176
      7      -0.458951   0.645810  -0.057394   0.000000   0.000000   0.000000
      8      -0.458621  -0.372662  -0.530396   0.000000   0.000000   0.000000
      9       0.458468   0.372517   0.530840   0.000076  -0.279425  -0.398103
                  6          7          8          9         10         11    
      0       0.000000   0.000000   0.000000   0.000000   0.000000   0.000000
      1      -0.333346   0.541679   0.771663   0.000000   0.000000   0.000000
      2       0.000000   0.000000   0.000000  -0.333615  -0.939012   0.083414
      3       0.000000   0.000000   0.000000   0.000000   0.000000   0.000000
      4       0.000000   0.000000   0.000000  -0.458500   0.161612  -0.014462
      5       0.229352   0.391294  -0.175598   0.229260  -0.118083  -0.412366
      6       0.000000   0.000000   0.000000   0.000000   0.000000   0.000000
      7       0.229516  -0.297998   0.308331   0.000000   0.000000   0.000000
      8       0.000000   0.000000   0.000000   0.229305  -0.043564   0.426698
      9      -0.458544  -0.093092  -0.132737   0.000000   0.000000   0.000000
                 12         13         14    
      0       0.000000   0.000000   0.000000
      1       0.000000   0.000000   0.000000
      2       0.000000   0.000000   0.000000
      3      -0.333631   0.396852  -0.855102
      4       0.000000   0.000000   0.000000
      5       0.000000   0.000000   0.000000
      6      -0.458529  -0.068346   0.147183
      7       0.229435  -0.347812  -0.250937
      8       0.229316   0.416226   0.103699
      9       0.000000   0.000000   0.000000

