! opt freq rks b3lyp 6-31G*
%maxcore 4000
%pal
  nprocs 4
end
*xyz 0 1
   C        0.31807        0.23609        0.18203
   C        1.28414        1.11531        0.56247
   C        0.49397       -0.85632       -0.84933
   C       -1.09256        0.20478        0.72714
   C        2.69477        1.14663        0.01736
   C        1.10824        2.20773        1.59383
   H        0.11765        2.26149        2.04320
   H        1.31061        3.18356        1.13666
   H        1.82722        2.06524        2.40929
   H        2.91425        0.39108       -0.73567
   H        3.41047        1.00633        0.83608
   H        2.89386        2.12465       -0.43656
   H        1.48456       -0.91009       -1.29869
   H       -0.22501       -0.71383       -1.66479
   H        0.29160       -1.83215       -0.39215
   H       -1.31204        0.96033        1.48018
   H       -1.29165       -0.77324        1.18106
   H       -1.80826        0.34508       -0.09157
*