
$orca_opt_file

$trust
    0.300000000000

$epredict
    0.000000000000

$ediffsc
  1000.000000000000

$ctyp
  3

$coordinates
 3 15
  -5.10014407   4.06714417   0.00000000  -3.07813711   4.06714417   0.00000000
  -5.77413379   5.16282628   1.56002562  -5.77415269   2.16827177   0.16888482
  -5.77415269   4.87029668  -1.72891044
  -5.10013249   4.06727047  -0.00013062  -3.04666575   4.06723890   0.00006246
  -5.78453655   5.17969220   1.58444218  -5.78476308   2.13888832   0.17151545
  -5.78462248   4.88259318  -1.75588947
  -5.10012938   4.06732439  -0.00022786  -3.04556800   4.06727646   0.00013473
  -5.78483884   5.18010798   1.58539732  -5.78517395   2.13803390   0.17166178
  -5.78501017   4.88294035  -1.75696598

# redundant internal coordinates
#  nbonds nangles ndihedrals nimpropers ncartesians
# bond  definitions A B
# angle definitions A B C
# dihedral definitions A B C D
# improper torsion definitions A B C D
# cartesian definitions A x/y/z
$redundant_internals
 4 6 0 0 0
   1   0   0
   2   0   0
   3   0   0
   4   0   0
   1   0   3   0   0
   2   0   3   0   0
   1   0   4   0   0
   2   0   4   0   0
   3   0   4   0   0
   1   0   2   0   0
$energies
 3
 -40.5012606060782190
 -40.5020455095339074
 -40.5020464460027370

$gradients
 3 15
   0.0000041617770951  -0.0001310812965699   0.0001730373952291  -0.0122386155208033
  -0.0000528831943674   0.0000404580140597   0.0040551926611592  -0.0065969289224135
  -0.0094690669352755   0.0040901581783405   0.0114794629203835  -0.0010118557935890
   0.0040996150137847  -0.0048013587194603   0.0104557619174928
   0.0000059685475683  -0.0000363668272202   0.0001091429534755  -0.0004097319114724
  -0.0000420586230434   0.0000502640661526   0.0001117812267756  -0.0002014194348643
  -0.0003259211172510   0.0001275301851436   0.0003356715564807  -0.0000241417212241
   0.0001736899175961  -0.0001513621802483   0.0003876992530260
  -0.0000007672510497  -0.0000464042153915   0.0000835989738542  -0.0000152910207916
  -0.0000393647459608   0.0000596390881758  -0.0000156875743558  -0.0000027863095417
  -0.0000051575157807  -0.0000010660322597  -0.0000002655157282   0.0000143483992344
   0.0000419440030319  -0.0000064633661667   0.0000449259612629

$redundant_coords
 3 10
   2.0220069632957389   2.0219943997568963   2.0220104172529756   2.0219972488438058
   1.9106359365492187   1.9106305756589785   1.9106382391129895   1.9106455560599669
   1.9106202855813550   1.9106288245192296
   2.0534667505461695   2.0534755863912086   2.0534943693836842   2.0532819631728865
   1.9106780046058875   1.9103878469452500   1.9107573656656471   1.9109407784798951
   1.9105156166124315   1.9105197676557242
   2.0545614077469923   2.0545855021857888   2.0545057590518319   2.0543660592695900
   1.9107023979202862   1.9101862987555798   1.9108506870984985   1.9111416120457676
   1.9104947777537593   1.9104235192471426

$redundant_gradients
 3 10
  -0.0122407180334712  -0.0122493423201571  -0.0122500384412661  -0.0121728277172302
  -0.0000125886621680   0.0000726237691423  -0.0000356449625424  -0.0000883339913846
   0.0000313156423248   0.0000326285762089
  -0.0004115813883159  -0.0004173104037887  -0.0003803766108896  -0.0004076237872072
  -0.0000070240189199   0.0000580196723089  -0.0000268665311430  -0.0000578190433014
   0.0000060013976772   0.0000277061037175
  -0.0000171186954947  -0.0000197913146503  -0.0000187819108161  -0.0000130372123283
  -0.0000037837477078   0.0000330034535969  -0.0000157119327228  -0.0000316411607563
   0.0000013978643203   0.0000167543149897

$hessian_approx
 15 15
                  0          1          2          3          4          5    
      0       0.905058   0.000079  -0.000055  -0.388189   0.000003   0.000015
      1       0.000079   0.904891   0.000923  -0.006858  -0.145691  -0.000306
      2      -0.000055   0.000923   0.902527   0.011238   0.000207  -0.144803
      3      -0.388189  -0.006858   0.011238   0.381566  -0.000770  -0.003408
      4       0.000003  -0.145691   0.000207  -0.000770   0.109190  -0.000066
      5       0.000015  -0.000306  -0.144803  -0.003408  -0.000066   0.108950
      6      -0.172276   0.045847   0.058862   0.000249   0.039677   0.057184
      7       0.043341  -0.219904  -0.096279   0.001750   0.007699   0.009955
      8       0.061750  -0.106941  -0.279703  -0.009697   0.010717   0.013220
      9      -0.172311  -0.073383   0.002624   0.004623  -0.068082   0.007338
     10      -0.075194  -0.353150   0.009432   0.004626   0.024725   0.000751
     11       0.006704   0.018164  -0.145656  -0.003855  -0.002263  -0.000321
     12      -0.172283   0.034315  -0.072668   0.001726   0.029172  -0.061129
     13       0.031771  -0.186151   0.085723   0.001311   0.004077  -0.010334
     14      -0.068414   0.088156  -0.332358   0.005796  -0.008595   0.022952
                  6          7          8          9         10         11    
      0      -0.172276   0.043341   0.061750  -0.172311  -0.075194   0.006704
      1       0.045847  -0.219904  -0.106941  -0.073383  -0.353150   0.018164
      2       0.058862  -0.096279  -0.279703   0.002624   0.009432  -0.145656
      3       0.000249   0.001750  -0.009697   0.004623   0.004626  -0.003855
      4       0.039677   0.007699   0.010717  -0.068082   0.024725  -0.002263
      5       0.057184   0.009955   0.013220   0.007338   0.000751  -0.000321
      6       0.140579  -0.051623  -0.069892   0.015277  -0.008385  -0.028068
      7      -0.051623   0.194018   0.115574   0.028264  -0.015950  -0.050991
      8      -0.069892   0.115574   0.262880  -0.006948   0.014264   0.018554
      9       0.015277   0.028264  -0.006948   0.137688   0.083352  -0.006148
     10      -0.008385  -0.015950   0.014264   0.083352   0.351176  -0.018596
     11      -0.028068  -0.050991   0.018554  -0.006148  -0.018596   0.110352
     12       0.016181  -0.021747   0.024769   0.014731  -0.004377   0.031365
     13      -0.025538   0.034172  -0.033573   0.029831  -0.006856   0.053691
     14      -0.018112   0.021782  -0.014895   0.003112  -0.005918   0.017075
                 12         13         14    
      0      -0.172283   0.031771  -0.068414
      1       0.034315  -0.186151   0.088156
      2      -0.072668   0.085723  -0.332358
      3       0.001726   0.001311   0.005796
      4       0.029172   0.004077  -0.008595
      5      -0.061129  -0.010334   0.022952
      6       0.016181  -0.025538  -0.018112
      7      -0.021747   0.034172   0.021782
      8       0.024769  -0.033573  -0.014895
      9       0.014731   0.029831   0.003112
     10      -0.004377  -0.006856  -0.005918
     11       0.031365   0.053691   0.017075
     12       0.139653  -0.037384   0.077640
     13      -0.037384   0.154784  -0.095474
     14       0.077640  -0.095474   0.307165

$bmatrix
 10 15
                  0          1          2          3          4          5    
      0      -1.000000   0.000023  -0.000176   1.000000  -0.000023   0.000176
      1       0.333259  -0.541610  -0.771749   0.000000   0.000000   0.000000
      2       0.333435   0.939053  -0.083665   0.000000   0.000000   0.000000
      3       0.333378  -0.397016   0.855124   0.000000   0.000000   0.000000
      4       0.458862  -0.646445   0.057715   0.000019   0.484799  -0.043223
      5      -0.458691  -0.273434   0.588536   0.000000   0.000000   0.000000
      6       0.459004   0.273331  -0.588635  -0.000083  -0.204970   0.441458
      7      -0.459132   0.646461  -0.057393   0.000000   0.000000   0.000000
      8      -0.458947  -0.373084  -0.530961   0.000000   0.000000   0.000000
      9       0.458829   0.372705   0.531219   0.000064  -0.279579  -0.398414
                  6          7          8          9         10         11    
      0       0.000000   0.000000   0.000000   0.000000   0.000000   0.000000
      1      -0.333259   0.541610   0.771749   0.000000   0.000000   0.000000
      2       0.000000   0.000000   0.000000  -0.333435  -0.939053   0.083665
      3       0.000000   0.000000   0.000000   0.000000   0.000000   0.000000
      4       0.000000   0.000000   0.000000  -0.458881   0.161646  -0.014492
      5       0.229371   0.391633  -0.175798   0.229320  -0.118199  -0.412738
      6       0.000000   0.000000   0.000000   0.000000   0.000000   0.000000
      7       0.229574  -0.298344   0.308511   0.000000   0.000000   0.000000
      8       0.000000   0.000000   0.000000   0.229456  -0.043426   0.427054
      9      -0.458893  -0.093126  -0.132805   0.000000   0.000000   0.000000
                 12         13         14    
      0       0.000000   0.000000   0.000000
      1       0.000000   0.000000   0.000000
      2       0.000000   0.000000   0.000000
      3      -0.333378   0.397016  -0.855124
      4       0.000000   0.000000   0.000000
      5       0.000000   0.000000   0.000000
      6      -0.458922  -0.068361   0.147176
      7       0.229558  -0.348117  -0.251119
      8       0.229491   0.416510   0.103907
      9       0.000000   0.000000   0.000000

