18
Coordinates from ORCA-job optfreq
  C   -2.22536933807184     -0.46585805169682     -0.54954764561995
  C   -0.74422254526963     -0.42793620122392     -0.18476503538072
  C   -3.06766854355005     -1.41221958724645     -0.11885839587898
  C   -2.71061581025088      0.64810877859635     -1.45054706747144
  H   -2.14613940834949      0.66510938534052     -2.39364409524400
  H   -2.57722253441104      1.63574873350020     -0.98959351438358
  H   -3.77196566519978      0.53423233453842     -1.69284476847569
  H   -2.75222896989554     -2.23243285636975      0.51859212662181
  H   -4.11963260335341     -1.39788194198138     -0.39494762917864
  H   -0.19477803412687     -0.23187767695780     -1.12008287965892
  C   -0.43536199783827      0.74482667864427      0.77309848766648
  H   -0.73798404919109      1.71119740404802      0.35573018745472
  H   0.63971017526498      0.79655121840444      0.98349319736806
  H   -0.96152410180447      0.60950888752678      1.72595968160324
  C   -0.20301383359752     -1.74045533647760      0.39922648136158
  H   0.88069637554068     -1.66976539796529      0.54864527135650
  H   -0.40063414906647     -2.58873525488938     -0.26536585211990
  H   -0.65432496682929     -1.96155111579060      1.37422144997942
