5
Coordinates from ORCA-job optfreq E -40.462831507590
  C      -2.698880      2.152240      0.000000
  H      -1.628880      2.152240      0.000000
  H      -3.055540      2.732050      0.825530
  H      -3.055550      1.147400      0.089370
  H      -3.055550      2.577250     -0.914900
5
Coordinates from ORCA-job optfreq E -40.464493641804
  C      -2.698880      2.152236      0.000001
  H      -1.605038      2.152236     -0.000003
  H      -3.063493      2.744975      0.843928
  H      -3.063493      1.125004      0.091365
  H      -3.063497      2.586728     -0.935290
5
Coordinates from ORCA-job optfreq E -40.464501982878
  C      -2.698879      2.152235      0.000003
  H      -1.603305      2.152235     -0.000005
  H      -3.064072      2.745916      0.845262
  H      -3.064070      1.123374      0.091511
  H      -3.064074      2.587420     -0.936770
5
Coordinates from ORCA-job optfreq E -40.464502022512
  C      -2.698879      2.152234      0.000003
  H      -1.603176      2.152234     -0.000007
  H      -3.064117      2.745987      0.845360
  H      -3.064112      1.123251      0.091522
  H      -3.064116      2.587473     -0.936879
