5
Coordinates from ORCA-job optfreq
  C   -2.69888789449108      2.15225047575546     -0.00005889353329
  H   -1.61004472802832      2.15227770084481      0.00000557359904
  H   -3.06180093369161      2.74219335575593      0.84009875310344
  H   -3.06186439718593      1.12972140488699      0.09100241607654
  H   -3.06180204660305      2.58473706275681     -0.93104784924573
