5

C         -2.68074        2.12274       -0.04199
H         -1.57134        2.12275       -0.04199
F         -3.14124        2.87137        1.02388
H         -3.05054        1.08090        0.05068
H         -3.05054        2.56342       -0.99058
