5
Coordinates from ORCA-job optfreq E -237.460834260352
  C      -2.735340      2.122810     -0.041890
  F      -1.353840      2.120060     -0.045810
  F      -3.191330      2.872350      1.025280
  H      -3.106940      1.081710      0.051850
  H      -3.106950      2.564250     -0.989430
5
Coordinates from ORCA-job optfreq E -237.462895638029
  C      -2.739312      2.119634     -0.046400
  F      -1.384158      2.124550     -0.039421
  F      -3.174033      2.857401      1.003971
  H      -3.098443      1.081738      0.066317
  H      -3.098454      2.577856     -0.984468
5
Coordinates from ORCA-job optfreq E -237.462994418088
  C      -2.739514      2.119499     -0.046585
  F      -1.391122      2.123786     -0.040504
  F      -3.173001      2.853398      0.998254
  H      -3.095373      1.079871      0.072834
  H      -3.095390      2.584627     -0.983998
5
Coordinates from ORCA-job optfreq E -237.462999128027
  C      -2.739452      2.119558     -0.046498
  F      -1.390623      2.122849     -0.041835
  F      -3.174699      2.853368      0.998205
  H      -3.094802      1.079583      0.073997
  H      -3.094824      2.585822     -0.983869
5
Coordinates from ORCA-job optfreq E -237.463000370013
  C      -2.739629      2.119425     -0.046686
  F      -1.390427      2.122235     -0.042706
  F      -3.175766      2.853278      0.998070
  H      -3.094276      1.079395      0.075017
  H      -3.094302      2.586847     -0.983694
5
Coordinates from ORCA-job optfreq E -237.463000466580
  C      -2.739752      2.119328     -0.046823
  F      -1.390457      2.122209     -0.042741
  F      -3.175796      2.853254      0.998034
  H      -3.094184      1.079338      0.075212
  H      -3.094211      2.587051     -0.983682
