43
Coordinates from ORCA-job opt
  C   -1.49570270739160      1.47317974282090      0.40851537460359
  C   -1.30180666110572      0.51592155779617     -0.60809231464334
  C   -0.56616444417465      1.74017885668365      1.43484027363811
  O   -0.27923877903436     -0.23033324048512     -0.71741571621461
  O   0.55421415885515      1.15721892629314      1.57062171811513
  C   -0.88092155129983      2.79499840947176      2.47345857394306
  C   -2.36410436220318      0.32299479786850     -1.66888356874092
  H   -0.86604515321534      2.32877522043048      3.47231562301901
  H   -1.85252076653474      3.28182420219237      2.31262571593250
  H   -0.08367693960892      3.55601298441424      2.46716181351885
  H   -3.21203020884224      1.01259814201229     -1.55808125337078
  H   -2.73156949155701     -0.71569858970165     -1.62542530787275
  H   -1.90761340701259      0.45618476701125     -2.66311314006729
  Ru  1.52268427955374     -0.50202524196515      0.50373877295862
  H   5.55368145484387      1.91748924499765     -2.10148780029333
  H   5.60944945418660     -0.70944271950341      2.95881382229197
  C   4.00529832581917      0.93471367868012     -0.90578346885681
  C   4.46611789720128      0.32246485062199      1.46644763861088
  C   5.44878172487694      0.32639708464698      2.61776833723945
  C   4.52553084080540      1.54082842441473     -2.19105571920691
  C   4.84573367248594      0.87111277180823      0.22346448347604
  O   2.80623536093737      0.51403571258099     -0.94536998698716
  O   3.33404870201154     -0.19427334114508      1.71584667589147
  H   5.00457740934769      0.87364231992610      3.46533866162558
  H   4.48385906914204      0.78021673744806     -2.98811142212663
  H   3.85897698486894      2.36197542144229     -2.50082052386327
  H   6.41518407971011      0.77939883414677      2.35751426842540
  H   0.19174069512876     -4.90969066243990      3.28797800035692
  H   3.38238200747333     -4.46377099655933     -1.40089343389480
  C   0.77465445013597     -3.21334931909407      2.03102734823645
  C   1.82685014657687     -3.61454435922828     -0.19370527459286
  C   2.30874972386995     -4.62660474936359     -1.21117142029073
  C   0.17966162837030     -3.81115712150333      3.28775401996908
  C   1.26191919123864     -4.06361782170570      1.01842692722658
  O   0.78607813861962     -1.94351842096410      1.98230417160272
  O   1.97571379642111     -2.39645301271978     -0.52018592865390
  H   1.78758543875132     -4.45215905703049     -2.16654805101583
  H   0.73741888951705     -3.43832628268966      4.16231111948585
  H   -0.85833031168735     -3.45710173795509      3.39922275763317
  H   2.14922520460889     -5.66576507969462     -0.89228273367647
  H   1.19294698922796     -5.13956062893766      1.18055278666277
  H   5.85342596219782      1.27715888589847      0.13209962039541
  H   -2.42113089311597      2.04946080907892      0.39628855950969
