5

C         -2.73534        2.12281       -0.04189
F         -1.35384        2.12006       -0.04581
F         -3.19133        2.87235        1.02528
H         -3.10694        1.08171        0.05185
H         -3.10695        2.56425       -0.98943
