5

C         -2.71702        2.17406       -0.04644
F         -1.33551        2.16893       -0.04870
F         -3.17300        2.92122        1.02240
F         -3.18215        0.87805        0.06587
H         -3.08672        2.61891       -0.99312
