5
Coordinates from ORCA-job optfreq E -437.712390467141
  C      -2.698880      2.152230      0.000000
  F      -1.317370      2.147110     -0.002260
  F      -3.154870      2.899400      1.068840
  F      -3.164020      0.856230      0.112310
  F      -3.159260      2.706200     -1.178880
5
Coordinates from ORCA-job optfreq E -437.724804065506
  C      -2.698914      2.152239     -0.000058
  F      -1.369120      2.147543     -0.002011
  F      -3.137531      2.871297      1.028891
  F      -3.146801      0.904768      0.108067
  F      -3.142035      2.685323     -1.134879
5
Coordinates from ORCA-job optfreq E -437.724928440018
  C      -2.698911      2.152237     -0.000109
  F      -1.375752      2.147687     -0.001986
  F      -3.135278      2.867582      1.023762
  F      -3.144680      0.911022      0.107598
  F      -3.139779      2.682643     -1.129255
5
Coordinates from ORCA-job optfreq E -437.724934018463
  C      -2.698914      2.152246     -0.000111
  F      -1.374606      2.147693     -0.002004
  F      -3.135661      2.868189      1.024677
  F      -3.145078      0.909955      0.107697
  F      -3.140141      2.683087     -1.130249
5
Coordinates from ORCA-job optfreq E -437.724934019245
  C      -2.698915      2.152248     -0.000114
  F      -1.374626      2.147704     -0.002009
  F      -3.135652      2.868169      1.024669
  F      -3.145083      0.909977      0.107699
  F      -3.140124      2.683072     -1.130235
