18
Coordinates from ORCA-job optfreq E -235.667247622297
  C      -2.208440     -0.544420     -0.615560
  C      -0.730100     -0.552510     -0.213250
  C      -2.921790     -1.676000     -0.776530
  C      -2.872600      0.779140     -0.899060
  H      -2.410040      1.257920     -1.767920
  H      -2.796460      1.449940     -0.037830
  H      -3.941290      0.666490     -1.113720
  H      -2.492340     -2.661070     -0.633900
  H      -3.962010     -1.651980     -1.087750
  H      -0.156700     -0.783690     -1.121290
  C      -0.209880      0.798530      0.301930
  H      -0.317900      1.584260     -0.453110
  H       0.857320      0.735800      0.543590
  H      -0.738770      1.113080      1.208350
  C      -0.391990     -1.619370      0.841200
  H       0.669250     -1.577080      1.111120
  H      -0.582180     -2.633180      0.476190
  H      -0.976360     -1.469290      1.756310
18
Coordinates from ORCA-job optfreq E -235.668275511600
  C      -2.209505     -0.538514     -0.605352
  C      -0.728506     -0.541760     -0.208467
  C      -2.916650     -1.671708     -0.722426
  C      -2.864778      0.784725     -0.937608
  H      -2.383760      1.251814     -1.808173
  H      -2.801776      1.489851     -0.100038
  H      -3.926237      0.658193     -1.174344
  H      -2.492135     -2.651236     -0.518904
  H      -3.957187     -1.658926     -1.036475
  H      -0.156715     -0.750697     -1.127239
  C      -0.223185      0.812293      0.328137
  H      -0.354559      1.619489     -0.401328
  H       0.847149      0.754444      0.555541
  H      -0.742840      1.097503      1.251128
  C      -0.388386     -1.648444      0.807998
  H       0.676559     -1.618681      1.068232
  H      -0.594362     -2.650525      0.416669
  H      -0.965407     -1.521252      1.731418
18
Coordinates from ORCA-job optfreq E -235.669041682379
  C      -2.218526     -0.531702     -0.589924
  C      -0.730397     -0.530056     -0.201858
  C      -2.940883     -1.655095     -0.634790
  C      -2.845145      0.784596     -1.006650
  H      -2.330984      1.218730     -1.878378
  H      -2.796417      1.538657     -0.210463
  H      -3.896715      0.645854     -1.275640
  H      -2.541071     -2.625581     -0.354842
  H      -3.980524     -1.642172     -0.954835
  H      -0.162287     -0.691193     -1.135055
  C      -0.251802      0.816436      0.379640
  H      -0.415704      1.653185     -0.307613
  H       0.822592      0.768580      0.591206
  H      -0.763340      1.049754      1.322894
  C      -0.358384     -1.678700      0.756357
  H       0.709933     -1.637369      1.002629
  H      -0.555492     -2.665082      0.325271
  H      -0.927132     -1.602270      1.690819
18
Coordinates from ORCA-job optfreq E -235.669778598110
  C      -2.226198     -0.525257     -0.577385
  C      -0.734292     -0.518644     -0.196956
  C      -2.971815     -1.632204     -0.547269
  C      -2.821674      0.776853     -1.076300
  H      -2.277806      1.171104     -1.949851
  H      -2.781247      1.573960     -0.322548
  H      -3.865175      0.629485     -1.369944
  H      -2.600404     -2.589708     -0.196309
  H      -4.011252     -1.614514     -0.869297
  H      -0.171543     -0.628416     -1.141707
  C      -0.281862      0.814041      0.434579
  H      -0.470971      1.676190     -0.212086
  H       0.794805      0.777043      0.638136
  H      -0.791392      0.995695      1.390962
  C      -0.325357     -1.699954      0.702494
  H       0.744239     -1.639583      0.937773
  H      -0.504420     -2.669846      0.229302
  H      -0.885917     -1.679672      1.645174
18
Coordinates from ORCA-job optfreq E -235.670555201309
  C      -2.232403     -0.518603     -0.565499
  C      -0.740074     -0.506777     -0.193127
  C      -3.004705     -1.603593     -0.461057
  C      -2.796343      0.761960     -1.144438
  H      -2.223793      1.112019     -2.017716
  H      -2.763402      1.596353     -0.432613
  H      -3.832524      0.607903     -1.459911
  H      -2.661194     -2.544389     -0.046001
  H      -4.044176     -1.579104     -0.782937
  H      -0.185382     -0.563997     -1.146911
  C      -0.311223      0.806396      0.490858
  H      -0.520584      1.690652     -0.116808
  H       0.766707      0.780440      0.690872
  H      -0.822020      0.936840      1.455062
  C      -0.292917     -1.713018      0.647854
  H       0.776894     -1.632369      0.872611
  H      -0.453058     -2.664013      0.131450
  H      -0.842083     -1.750132      1.597081
18
Coordinates from ORCA-job optfreq E -235.671321157385
  C      -2.234904     -0.510638     -0.555761
  C      -0.746907     -0.493153     -0.192514
  C      -3.034851     -1.569692     -0.377125
  C      -2.770941      0.740424     -1.210727
  H      -2.171494      1.041017     -2.081796
  H      -2.747771      1.604917     -0.536921
  H      -3.801163      0.583538     -1.545082
  H      -2.713006     -2.492462      0.090289
  H      -4.075316     -1.538489     -0.693997
  H      -0.202976     -0.497219     -1.152447
  C      -0.337489      0.793631      0.547890
  H      -0.562234      1.698091     -0.022287
  H       0.740723      0.779736      0.748282
  H      -0.852992      0.871554      1.514526
  C      -0.265247     -1.717451      0.594037
  H       0.804733     -1.622158      0.807494
  H      -0.412749     -2.647200      0.035591
  H      -0.797694     -1.807874      1.549318
18
Coordinates from ORCA-job optfreq E -235.671934732588
  C      -2.235503     -0.497433     -0.546481
  C      -0.748724     -0.475920     -0.190572
  C      -3.049073     -1.529204     -0.292256
  C      -2.755075      0.718206     -1.279268
  H      -2.133254      0.971906     -2.150222
  H      -2.747242      1.616635     -0.649674
  H      -3.777643      0.547627     -1.629608
  H      -2.736406     -2.423799      0.234209
  H      -4.091233     -1.503476     -0.604140
  H      -0.211085     -0.427106     -1.153440
  C      -0.358384      0.784508      0.606956
  H      -0.597547      1.710473      0.077281
  H       0.719556      0.780062      0.808295
  H      -0.877149      0.809410      1.574583
  C      -0.247112     -1.729244      0.537075
  H       0.824304     -1.633729      0.744675
  H      -0.393489     -2.634083     -0.061831
  H      -0.767220     -1.868263      1.493186
18
Coordinates from ORCA-job optfreq E -235.672325479817
  C      -2.224003     -0.486845     -0.551889
  C      -0.747285     -0.460347     -0.198913
  C      -3.052878     -1.487374     -0.218626
  C      -2.737443      0.695787     -1.340470
  H      -2.105264      0.887991     -2.216910
  H      -2.737211      1.611706     -0.735128
  H      -3.762882      0.538632     -1.690299
  H      -2.731120     -2.362148      0.337987
  H      -4.101997     -1.463611     -0.503317
  H      -0.211617     -0.359340     -1.156580
  C      -0.381521      0.770091      0.659086
  H      -0.631032      1.711736      0.157443
  H       0.693223      0.788025      0.873640
  H      -0.916768      0.741963      1.615599
  C      -0.237321     -1.733636      0.489051
  H       0.837248     -1.654328      0.688811
  H      -0.396125     -2.617115     -0.140255
  H      -0.738284     -1.904615      1.449542
18
Coordinates from ORCA-job optfreq E -235.672527629499
  C      -2.228233     -0.475408     -0.543093
  C      -0.745657     -0.446116     -0.190466
  C      -3.064542     -1.440923     -0.147365
  C      -2.724128      0.670687     -1.400903
  H      -2.078962      0.819956     -2.278722
  H      -2.725378      1.621943     -0.851001
  H      -3.743967      0.492716     -1.755796
  H      -2.751616     -2.277165      0.470084
  H      -4.114635     -1.423601     -0.431548
  H      -0.208902     -0.296199     -1.143072
  C      -0.405406      0.759753      0.714902
  H      -0.677609      1.716092      0.255439
  H       0.669839      0.787885      0.927203
  H      -0.936985      0.682167      1.671798
  C      -0.217677     -1.746113      0.433342
  H       0.860433     -1.667794      0.616577
  H      -0.387708     -2.606284     -0.224054
  H      -0.701149     -1.955029      1.395445
18
Coordinates from ORCA-job optfreq E -235.672576902025
  C      -2.227103     -0.476540     -0.547637
  C      -0.744129     -0.446409     -0.191094
  C      -3.063956     -1.442658     -0.152684
  C      -2.723967      0.671910     -1.400498
  H      -2.087633      0.814151     -2.285206
  H      -2.712679      1.622754     -0.850734
  H      -3.749282      0.501310     -1.743632
  H      -2.748367     -2.281498      0.459775
  H      -4.114607     -1.424951     -0.434152
  H      -0.202832     -0.295948     -1.140276
  C      -0.407504      0.758821      0.715544
  H      -0.681366      1.713905      0.254828
  H       0.667586      0.789971      0.928979
  H      -0.940237      0.680368      1.671540
  C      -0.217550     -1.744789      0.435740
  H       0.862411     -1.671033      0.609119
  H      -0.398090     -2.607983     -0.214559
  H      -0.692976     -1.944811      1.403717
18
Coordinates from ORCA-job optfreq E -235.672620443693
  C      -2.225953     -0.474602     -0.551601
  C      -0.742930     -0.442915     -0.190431
  C      -3.064175     -1.436960     -0.148787
  C      -2.720272      0.668283     -1.411631
  H      -2.100494      0.783434     -2.311371
  H      -2.681134      1.626742     -0.877370
  H      -3.755641      0.509856     -1.729973
  H      -2.744979     -2.273359      0.465080
  H      -4.115596     -1.421100     -0.426739
  H      -0.194930     -0.281408     -1.133168
  C      -0.415975      0.754611      0.728846
  H      -0.697009      1.711098      0.275704
  H       0.658923      0.792462      0.942988
  H      -0.948858      0.663696      1.683393
  C      -0.214809     -1.743244      0.429174
  H       0.868906     -1.677510      0.580453
  H      -0.416235     -2.606994     -0.213886
  H      -0.671121     -1.935521      1.408090
18
Coordinates from ORCA-job optfreq E -235.672633517302
  C      -2.225705     -0.472695     -0.552104
  C      -0.743271     -0.439999     -0.189478
  C      -3.064556     -1.431901     -0.143181
  C      -2.717985      0.664565     -1.420364
  H      -2.107506      0.761606     -2.328675
  H      -2.662132      1.629486     -0.899325
  H      -3.758542      0.512769     -1.724655
  H      -2.745147     -2.264202      0.476183
  H      -4.116299     -1.416983     -0.419926
  H      -0.193559     -0.270557     -1.129794
  C      -0.420836      0.752191      0.738632
  H      -0.705979      1.710878      0.292619
  H       0.654004      0.792880      0.952667
  H      -0.952956      0.652099      1.692615
  C      -0.212517     -1.742933      0.422931
  H       0.872356     -1.678761      0.566580
  H      -0.419775     -2.604861     -0.220696
  H      -0.661874     -1.937010      1.404741
18
Coordinates from ORCA-job optfreq E -235.672650154108
  C      -2.225610     -0.469459     -0.551581
  C      -0.744332     -0.435075     -0.187623
  C      -3.065225     -1.424157     -0.134076
  C      -2.715050      0.658247     -1.433452
  H      -2.120604      0.725389     -2.355363
  H      -2.631094      1.633288     -0.935336
  H      -3.763670      0.518494     -1.714694
  H      -2.746531     -2.250369      0.493883
  H      -4.117132     -1.410610     -0.410358
  H      -0.193696     -0.254088     -1.125356
  C      -0.427119      0.748953      0.753519
  H      -0.717961      1.711460      0.319297
  H       0.647715      0.792948      0.966864
  H      -0.957490      0.634757      1.706833
  C      -0.209059     -1.742185      0.413364
  H       0.876560     -1.677730      0.551360
  H      -0.419106     -2.600104     -0.234775
  H      -0.652876     -1.943188      1.396265
18
Coordinates from ORCA-job optfreq E -235.672659963923
  C      -2.225528     -0.467574     -0.550854
  C      -0.744891     -0.431738     -0.186271
  C      -3.065895     -1.419102     -0.127840
  C      -2.713298      0.653761     -1.441519
  H      -2.131837      0.698983     -2.373246
  H      -2.607558      1.635136     -0.960194
  H      -3.767738      0.524606     -1.705315
  H      -2.748396     -2.241960      0.505180
  H      -4.117786     -1.405872     -0.404278
  H      -0.194474     -0.243672     -1.122812
  C      -0.430829      0.747089      0.762865
  H      -0.725654      1.711981      0.336535
  H       0.644034      0.793343      0.975476
  H      -0.959828      0.623534      1.715771
  C      -0.206573     -1.741429      0.407171
  H       0.878719     -1.674859      0.546730
  H      -0.413631     -2.595747     -0.246741
  H      -0.651118     -1.949909      1.388113
18
Coordinates from ORCA-job optfreq E -235.672666660578
  C      -2.225426     -0.466274     -0.550043
  C      -0.744875     -0.429035     -0.185164
  C      -3.066810     -1.414730     -0.122214
  C      -2.711759      0.649910     -1.447756
  H      -2.142165      0.675933     -2.387637
  H      -2.586727      1.635895     -0.980772
  H      -3.771065      0.531079     -1.696380
  H      -2.750615     -2.235552      0.514116
  H      -4.118680     -1.401162     -0.398740
  H      -0.195012     -0.235464     -1.120890
  C      -0.433790      0.745621      0.770099
  H      -0.732663      1.712020      0.350020
  H       0.641129      0.794467      0.981809
  H      -0.961447      0.614298      1.722711
  C      -0.204288     -1.740674      0.401986
  H       0.880172     -1.671430      0.546541
  H      -0.405956     -2.591263     -0.258479
  H      -0.652304     -1.957070      1.379563
18
Coordinates from ORCA-job optfreq E -235.672668810932
  C      -2.225367     -0.465875     -0.549644
  C      -0.744492     -0.428016     -0.184776
  C      -3.067453     -1.412647     -0.119441
  C      -2.710890      0.648293     -1.450238
  H      -2.146056      0.666303     -2.393149
  H      -2.578154      1.635850     -0.988854
  H      -3.772070      0.533932     -1.692969
  H      -2.751902     -2.232859      0.517976
  H      -4.119374     -1.398552     -0.395726
  H      -0.194959     -0.232217     -1.120151
  C      -0.435134      0.744954      0.772852
  H      -0.736592      1.711570      0.355177
  H       0.639856      0.795723      0.983820
  H      -0.961892      0.610270      1.725482
  C      -0.203186     -1.740420      0.399640
  H       0.880703     -1.669892      0.547800
  H      -0.401637     -2.589110     -0.264210
  H      -0.653682     -1.960735      1.375182
18
Coordinates from ORCA-job optfreq E -235.672669120550
  C      -2.225369     -0.465858     -0.549548
  C      -0.744223     -0.427936     -0.184765
  C      -3.067669     -1.412220     -0.118858
  C      -2.710616      0.648109     -1.450547
  H      -2.146139      0.665109     -2.393644
  H      -2.577223      1.635749     -0.989594
  H      -3.771966      0.534232     -1.692845
  H      -2.752229     -2.232433      0.518592
  H      -4.119633     -1.397882     -0.394948
  H      -0.194778     -0.231878     -1.120083
  C      -0.435362      0.744827      0.773098
  H      -0.737984      1.711197      0.355730
  H       0.639710      0.796551      0.983493
  H      -0.961524      0.609509      1.725960
  C      -0.203014     -1.740455      0.399226
  H       0.880696     -1.669765      0.548645
  H      -0.400634     -2.588735     -0.265366
  H      -0.654325     -1.961551      1.374221
