-------------------------------------------------------------
----------------------- !PROPERTIES! ------------------------
-------------------------------------------------------------
# -----------------------------------------------------------
$ PAL_Flags
   description: The PAL Flags
   geom. index: 1
   prop. index: 1
        Diskflag:     2
# -----------------------------------------------------------
$ SCF_Energy
   description: The SCF energy
   geom. index: 1
   prop. index: 1
        SCF Energy:     -235.6672476223
# -----------------------------------------------------------
$ DFT_Energy
   description: The DFT energy
   geom. index: 1
   prop. index: 1
   Number of Alpha Electrons                 24.0000576679 
   Number of Beta  Electrons                 24.0000576679 
   Total number of  Electrons                48.0001153359 
   Exchange energy                          -28.0195382005 
   Correlation energy                        -1.8097320613 
   Correlation energy NL                      0.0000000000 
   Exchange-Correlation energy              -29.8292702617 
   Embedding correction                       0.0000000000 
   Total DFT Energy (No VdW correction)    -235.6672476223 
# -----------------------------------------------------------
$ Mayer_Pop
   description: The Mayer population analysis
   geom. index: 1
   prop. index: 1
     Number of atoms                     : 18
     Threshold for printing              : 0.1000000
     Number of bond orders printed       : 17
  NA   - Mulliken gross atomic population
  ZA   - Total nuclear charge
  QA   - Mulliken gross atomic charge
  VA   - Mayer's total valence
  BVA  - Mayer's bonded valence
  FA   - Mayer's free valence
  ATOM       NA         ZA         QA         VA         BVA        FA
  0   0     5.7786     6.0000     0.2214     3.9113     3.9113     0.0000
  1   0     6.1279     6.0000    -0.1279     3.9232     3.9232    -0.0000
  2   0     6.3972     6.0000    -0.3972     3.8970     3.8970    -0.0000
  3   0     6.5142     6.0000    -0.5142     3.8677     3.8677    -0.0000
  4   0     0.8465     1.0000     0.1535     0.9282     0.9282     0.0000
  5   0     0.8459     1.0000     0.1541     0.9301     0.9301    -0.0000
  6   0     0.8509     1.0000     0.1491     0.9371     0.9371    -0.0000
  7   0     0.8715     1.0000     0.1285     0.9447     0.9447    -0.0000
  8   0     0.8720     1.0000     0.1280     0.9448     0.9448    -0.0000
  9   0     0.8591     1.0000     0.1409     0.9229     0.9229     0.0000
 10   0     6.4505     6.0000    -0.4505     3.8509     3.8509    -0.0000
 11   0     0.8571     1.0000     0.1429     0.9356     0.9356    -0.0000
 12   0     0.8587     1.0000     0.1413     0.9371     0.9371    -0.0000
 13   0     0.8563     1.0000     0.1437     0.9364     0.9364    -0.0000
 14   0     6.4387     6.0000    -0.4387     3.8562     3.8562    -0.0000
 15   0     0.8640     1.0000     0.1360     0.9367     0.9367    -0.0000
 16   0     0.8567     1.0000     0.1433     0.9364     0.9364    -0.0000
 17   0     0.8542     1.0000     0.1458     0.9383     0.9383    -0.0000
      Bond orders larger than 0.1000000
           Atom A     A.N. of A          Atom B    A.N. of B              Bond order
                0             6               1            6                0.995662
                0             6               2            6                1.931915
                0             6               3            6                1.019784
                1             6               9            1                0.923703
                1             6              10            6                1.009353
                1             6              14            6                1.010074
                2             6               7            1                0.932054
                2             6               8            1                0.930129
                3             6               4            1                0.934822
                3             6               5            1                0.932558
                3             6               6            1                0.945798
               10             6              11            1                0.945538
               10             6              12            1                0.947981
               10             6              13            1                0.948204
               14             6              15            1                0.946212
               14             6              16            1                0.945830
               14             6              17            1                0.949860
# -----------------------------------------------------------
$ PAL_Flags
   description: The PAL Flags
   geom. index: 2
   prop. index: 1
        Diskflag:     2
# -----------------------------------------------------------
$ SCF_Energy
   description: The SCF energy
   geom. index: 2
   prop. index: 1
        SCF Energy:     -235.6682755116
# -----------------------------------------------------------
$ DFT_Energy
   description: The DFT energy
   geom. index: 2
   prop. index: 1
   Number of Alpha Electrons                 24.0000668924 
   Number of Beta  Electrons                 24.0000668924 
   Total number of  Electrons                48.0001337848 
   Exchange energy                          -28.0134206141 
   Correlation energy                        -1.8093786453 
   Correlation energy NL                      0.0000000000 
   Exchange-Correlation energy              -29.8227992594 
   Embedding correction                       0.0000000000 
   Total DFT Energy (No VdW correction)    -235.6682755116 
# -----------------------------------------------------------
$ PAL_Flags
   description: The PAL Flags
   geom. index: 3
   prop. index: 1
        Diskflag:     2
# -----------------------------------------------------------
$ SCF_Energy
   description: The SCF energy
   geom. index: 3
   prop. index: 1
        SCF Energy:     -235.6690416824
# -----------------------------------------------------------
$ DFT_Energy
   description: The DFT energy
   geom. index: 3
   prop. index: 1
   Number of Alpha Electrons                 24.0000130334 
   Number of Beta  Electrons                 24.0000130334 
   Total number of  Electrons                48.0000260668 
   Exchange energy                          -28.0107550673 
   Correlation energy                        -1.8092221140 
   Correlation energy NL                      0.0000000000 
   Exchange-Correlation energy              -29.8199771813 
   Embedding correction                       0.0000000000 
   Total DFT Energy (No VdW correction)    -235.6690416824 
# -----------------------------------------------------------
$ PAL_Flags
   description: The PAL Flags
   geom. index: 4
   prop. index: 1
        Diskflag:     2
# -----------------------------------------------------------
$ SCF_Energy
   description: The SCF energy
   geom. index: 4
   prop. index: 1
        SCF Energy:     -235.6697785981
# -----------------------------------------------------------
$ DFT_Energy
   description: The DFT energy
   geom. index: 4
   prop. index: 1
   Number of Alpha Electrons                 23.9999856414 
   Number of Beta  Electrons                 23.9999856414 
   Total number of  Electrons                47.9999712827 
   Exchange energy                          -28.0105504522 
   Correlation energy                        -1.8092147393 
   Correlation energy NL                      0.0000000000 
   Exchange-Correlation energy              -29.8197651915 
   Embedding correction                       0.0000000000 
   Total DFT Energy (No VdW correction)    -235.6697785981 
# -----------------------------------------------------------
$ PAL_Flags
   description: The PAL Flags
   geom. index: 5
   prop. index: 1
        Diskflag:     2
# -----------------------------------------------------------
$ SCF_Energy
   description: The SCF energy
   geom. index: 5
   prop. index: 1
        SCF Energy:     -235.6705552013
# -----------------------------------------------------------
$ DFT_Energy
   description: The DFT energy
   geom. index: 5
   prop. index: 1
   Number of Alpha Electrons                 23.9999855456 
   Number of Beta  Electrons                 23.9999855456 
   Total number of  Electrons                47.9999710913 
   Exchange energy                          -28.0126103711 
   Correlation energy                        -1.8093506297 
   Correlation energy NL                      0.0000000000 
   Exchange-Correlation energy              -29.8219610008 
   Embedding correction                       0.0000000000 
   Total DFT Energy (No VdW correction)    -235.6705552013 
# -----------------------------------------------------------
$ PAL_Flags
   description: The PAL Flags
   geom. index: 6
   prop. index: 1
        Diskflag:     2
# -----------------------------------------------------------
$ SCF_Energy
   description: The SCF energy
   geom. index: 6
   prop. index: 1
        SCF Energy:     -235.6713211574
# -----------------------------------------------------------
$ DFT_Energy
   description: The DFT energy
   geom. index: 6
   prop. index: 1
   Number of Alpha Electrons                 24.0000022307 
   Number of Beta  Electrons                 24.0000022307 
   Total number of  Electrons                48.0000044613 
   Exchange energy                          -28.0170120166 
   Correlation energy                        -1.8096650609 
   Correlation energy NL                      0.0000000000 
   Exchange-Correlation energy              -29.8266770775 
   Embedding correction                       0.0000000000 
   Total DFT Energy (No VdW correction)    -235.6713211574 
# -----------------------------------------------------------
$ PAL_Flags
   description: The PAL Flags
   geom. index: 7
   prop. index: 1
        Diskflag:     2
# -----------------------------------------------------------
$ SCF_Energy
   description: The SCF energy
   geom. index: 7
   prop. index: 1
        SCF Energy:     -235.6719347326
# -----------------------------------------------------------
$ DFT_Energy
   description: The DFT energy
   geom. index: 7
   prop. index: 1
   Number of Alpha Electrons                 24.0000147878 
   Number of Beta  Electrons                 24.0000147878 
   Total number of  Electrons                48.0000295755 
   Exchange energy                          -28.0158844111 
   Correlation energy                        -1.8094892647 
   Correlation energy NL                      0.0000000000 
   Exchange-Correlation energy              -29.8253736758 
   Embedding correction                       0.0000000000 
   Total DFT Energy (No VdW correction)    -235.6719347326 
# -----------------------------------------------------------
$ PAL_Flags
   description: The PAL Flags
   geom. index: 8
   prop. index: 1
        Diskflag:     2
# -----------------------------------------------------------
$ SCF_Energy
   description: The SCF energy
   geom. index: 8
   prop. index: 1
        SCF Energy:     -235.6723254798
# -----------------------------------------------------------
$ DFT_Energy
   description: The DFT energy
   geom. index: 8
   prop. index: 1
   Number of Alpha Electrons                 24.0000450870 
   Number of Beta  Electrons                 24.0000450870 
   Total number of  Electrons                48.0000901740 
   Exchange energy                          -28.0170784420 
   Correlation energy                        -1.8095980167 
   Correlation energy NL                      0.0000000000 
   Exchange-Correlation energy              -29.8266764587 
   Embedding correction                       0.0000000000 
   Total DFT Energy (No VdW correction)    -235.6723254798 
# -----------------------------------------------------------
$ PAL_Flags
   description: The PAL Flags
   geom. index: 9
   prop. index: 1
        Diskflag:     2
# -----------------------------------------------------------
$ SCF_Energy
   description: The SCF energy
   geom. index: 9
   prop. index: 1
        SCF Energy:     -235.6725276295
# -----------------------------------------------------------
$ DFT_Energy
   description: The DFT energy
   geom. index: 9
   prop. index: 1
   Number of Alpha Electrons                 24.0000507214 
   Number of Beta  Electrons                 24.0000507214 
   Total number of  Electrons                48.0001014429 
   Exchange energy                          -28.0134490152 
   Correlation energy                        -1.8091168425 
   Correlation energy NL                      0.0000000000 
   Exchange-Correlation energy              -29.8225658577 
   Embedding correction                       0.0000000000 
   Total DFT Energy (No VdW correction)    -235.6725276295 
# -----------------------------------------------------------
$ PAL_Flags
   description: The PAL Flags
   geom. index: 10
   prop. index: 1
        Diskflag:     2
# -----------------------------------------------------------
$ SCF_Energy
   description: The SCF energy
   geom. index: 10
   prop. index: 1
        SCF Energy:     -235.6725769020
# -----------------------------------------------------------
$ DFT_Energy
   description: The DFT energy
   geom. index: 10
   prop. index: 1
   Number of Alpha Electrons                 24.0000459166 
   Number of Beta  Electrons                 24.0000459166 
   Total number of  Electrons                48.0000918332 
   Exchange energy                          -28.0139122766 
   Correlation energy                        -1.8091589018 
   Correlation energy NL                      0.0000000000 
   Exchange-Correlation energy              -29.8230711784 
   Embedding correction                       0.0000000000 
   Total DFT Energy (No VdW correction)    -235.6725769020 
# -----------------------------------------------------------
$ PAL_Flags
   description: The PAL Flags
   geom. index: 11
   prop. index: 1
        Diskflag:     2
# -----------------------------------------------------------
$ SCF_Energy
   description: The SCF energy
   geom. index: 11
   prop. index: 1
        SCF Energy:     -235.6726204437
# -----------------------------------------------------------
$ DFT_Energy
   description: The DFT energy
   geom. index: 11
   prop. index: 1
   Number of Alpha Electrons                 24.0000364723 
   Number of Beta  Electrons                 24.0000364723 
   Total number of  Electrons                48.0000729446 
   Exchange energy                          -28.0145530224 
   Correlation energy                        -1.8092067865 
   Correlation energy NL                      0.0000000000 
   Exchange-Correlation energy              -29.8237598089 
   Embedding correction                       0.0000000000 
   Total DFT Energy (No VdW correction)    -235.6726204437 
# -----------------------------------------------------------
$ PAL_Flags
   description: The PAL Flags
   geom. index: 12
   prop. index: 1
        Diskflag:     2
# -----------------------------------------------------------
$ SCF_Energy
   description: The SCF energy
   geom. index: 12
   prop. index: 1
        SCF Energy:     -235.6726335173
# -----------------------------------------------------------
$ DFT_Energy
   description: The DFT energy
   geom. index: 12
   prop. index: 1
   Number of Alpha Electrons                 24.0000330418 
   Number of Beta  Electrons                 24.0000330418 
   Total number of  Electrons                48.0000660835 
   Exchange energy                          -28.0145045062 
   Correlation energy                        -1.8091925015 
   Correlation energy NL                      0.0000000000 
   Exchange-Correlation energy              -29.8236970076 
   Embedding correction                       0.0000000000 
   Total DFT Energy (No VdW correction)    -235.6726335173 
# -----------------------------------------------------------
$ PAL_Flags
   description: The PAL Flags
   geom. index: 13
   prop. index: 1
        Diskflag:     2
# -----------------------------------------------------------
$ SCF_Energy
   description: The SCF energy
   geom. index: 13
   prop. index: 1
        SCF Energy:     -235.6726501541
# -----------------------------------------------------------
$ DFT_Energy
   description: The DFT energy
   geom. index: 13
   prop. index: 1
   Number of Alpha Electrons                 24.0000290708 
   Number of Beta  Electrons                 24.0000290708 
   Total number of  Electrons                48.0000581416 
   Exchange energy                          -28.0143207402 
   Correlation energy                        -1.8091582538 
   Correlation energy NL                      0.0000000000 
   Exchange-Correlation energy              -29.8234789940 
   Embedding correction                       0.0000000000 
   Total DFT Energy (No VdW correction)    -235.6726501541 
# -----------------------------------------------------------
$ PAL_Flags
   description: The PAL Flags
   geom. index: 14
   prop. index: 1
        Diskflag:     2
# -----------------------------------------------------------
$ SCF_Energy
   description: The SCF energy
   geom. index: 14
   prop. index: 1
        SCF Energy:     -235.6726599639
# -----------------------------------------------------------
$ DFT_Energy
   description: The DFT energy
   geom. index: 14
   prop. index: 1
   Number of Alpha Electrons                 24.0000289105 
   Number of Beta  Electrons                 24.0000289105 
   Total number of  Electrons                48.0000578211 
   Exchange energy                          -28.0142258000 
   Correlation energy                        -1.8091373825 
   Correlation energy NL                      0.0000000000 
   Exchange-Correlation energy              -29.8233631825 
   Embedding correction                       0.0000000000 
   Total DFT Energy (No VdW correction)    -235.6726599639 
# -----------------------------------------------------------
$ PAL_Flags
   description: The PAL Flags
   geom. index: 15
   prop. index: 1
        Diskflag:     2
# -----------------------------------------------------------
$ SCF_Energy
   description: The SCF energy
   geom. index: 15
   prop. index: 1
        SCF Energy:     -235.6726666606
# -----------------------------------------------------------
$ DFT_Energy
   description: The DFT energy
   geom. index: 15
   prop. index: 1
   Number of Alpha Electrons                 24.0000314151 
   Number of Beta  Electrons                 24.0000314151 
   Total number of  Electrons                48.0000628302 
   Exchange energy                          -28.0142249984 
   Correlation energy                        -1.8091262302 
   Correlation energy NL                      0.0000000000 
   Exchange-Correlation energy              -29.8233512286 
   Embedding correction                       0.0000000000 
   Total DFT Energy (No VdW correction)    -235.6726666606 
# -----------------------------------------------------------
$ PAL_Flags
   description: The PAL Flags
   geom. index: 16
   prop. index: 1
        Diskflag:     2
# -----------------------------------------------------------
$ SCF_Energy
   description: The SCF energy
   geom. index: 16
   prop. index: 1
        SCF Energy:     -235.6726688109
# -----------------------------------------------------------
$ DFT_Energy
   description: The DFT energy
   geom. index: 16
   prop. index: 1
   Number of Alpha Electrons                 24.0000329566 
   Number of Beta  Electrons                 24.0000329566 
   Total number of  Electrons                48.0000659133 
   Exchange energy                          -28.0142644592 
   Correlation energy                        -1.8091246613 
   Correlation energy NL                      0.0000000000 
   Exchange-Correlation energy              -29.8233891205 
   Embedding correction                       0.0000000000 
   Total DFT Energy (No VdW correction)    -235.6726688109 
# -----------------------------------------------------------
$ PAL_Flags
   description: The PAL Flags
   geom. index: 17
   prop. index: 1
        Diskflag:     2
# -----------------------------------------------------------
$ SCF_Energy
   description: The SCF energy
   geom. index: 17
   prop. index: 1
        SCF Energy:     -235.6726691205
# -----------------------------------------------------------
$ DFT_Energy
   description: The DFT energy
   geom. index: 17
   prop. index: 1
   Number of Alpha Electrons                 24.0000331040 
   Number of Beta  Electrons                 24.0000331040 
   Total number of  Electrons                48.0000662080 
   Exchange energy                          -28.0142902635 
   Correlation energy                        -1.8091260759 
   Correlation energy NL                      0.0000000000 
   Exchange-Correlation energy              -29.8234163394 
   Embedding correction                       0.0000000000 
   Total DFT Energy (No VdW correction)    -235.6726691205 
# -----------------------------------------------------------
$ Mayer_Pop
   description: The Mayer population analysis
   geom. index: 17
   prop. index: 1
     Number of atoms                     : 18
     Threshold for printing              : 0.1000000
     Number of bond orders printed       : 17
  NA   - Mulliken gross atomic population
  ZA   - Total nuclear charge
  QA   - Mulliken gross atomic charge
  VA   - Mayer's total valence
  BVA  - Mayer's bonded valence
  FA   - Mayer's free valence
  ATOM       NA         ZA         QA         VA         BVA        FA
  0   0     5.7701     6.0000     0.2299     3.9220     3.9220     0.0000
  1   0     6.1207     6.0000    -0.1207     3.9199     3.9199    -0.0000
  2   0     6.4023     6.0000    -0.4023     3.9094     3.9094     0.0000
  3   0     6.5132     6.0000    -0.5132     3.8560     3.8560     0.0000
  4   0     0.8504     1.0000     0.1496     0.9310     0.9310     0.0000
  5   0     0.8458     1.0000     0.1542     0.9304     0.9304     0.0000
  6   0     0.8492     1.0000     0.1508     0.9377     0.9377    -0.0000
  7   0     0.8675     1.0000     0.1325     0.9449     0.9449     0.0000
  8   0     0.8738     1.0000     0.1262     0.9443     0.9443    -0.0000
  9   0     0.8759     1.0000     0.1241     0.9285     0.9285     0.0000
 10   0     6.4419     6.0000    -0.4419     3.8402     3.8402     0.0000
 11   0     0.8572     1.0000     0.1428     0.9374     0.9374     0.0000
 12   0     0.8590     1.0000     0.1410     0.9359     0.9359    -0.0000
 13   0     0.8531     1.0000     0.1469     0.9376     0.9376     0.0000
 14   0     6.4502     6.0000    -0.4502     3.8591     3.8591     0.0000
 15   0     0.8615     1.0000     0.1385     0.9363     0.9363     0.0000
 16   0     0.8521     1.0000     0.1479     0.9366     0.9366     0.0000
 17   0     0.8561     1.0000     0.1439     0.9371     0.9371     0.0000
      Bond orders larger than 0.1000000
           Atom A     A.N. of A          Atom B    A.N. of B              Bond order
                0             6               1            6                1.006069
                0             6               2            6                1.941232
                0             6               3            6                1.009317
                1             6               9            1                0.923083
                1             6              10            6                0.994325
                1             6              14            6                1.013593
                2             6               7            1                0.926042
                2             6               8            1                0.928416
                3             6               4            1                0.936278
                3             6               5            1                0.932630
                3             6               6            1                0.947502
               10             6              11            1                0.946294
               10             6              12            1                0.947413
               10             6              13            1                0.948711
               14             6              15            1                0.947612
               14             6              16            1                0.947129
               14             6              17            1                0.944121
# -----------------------------------------------------------
$ SCF_Electric_Properties
   description: The SCF Calculated Electric Properties
   geom. index: 17
   prop. index: 1
       Filename                          : optfreq.scfp 
       Do Dipole Moment Calculation      : true 
       Do Quadrupole Moment Calculation  : false 
       Do Polarizability Calculation     : false 
** Dipole moment part of electric properties **
        Magnitude of dipole moment (Debye) :        0.5002887559
        Electronic Contribution:
                  0    
      0      -1.456986
      1      -0.810260
      2      -0.790833
        Nuclear Contribution:
                  0    
      0       1.587781
      1       0.945668
      2       0.733408
        Total Dipole moment:
                  0    
      0       0.130794
      1       0.135408
      2      -0.057425
# -----------------------------------------------------------
$ Hessian
   description: Details about the Hessian
   geom. index: 17
   prop. index: 1
Normal modes:
Number of Rows: 54 Number of Columns: 54
                  0          1          2          3          4          5    
      0       0.000000   0.000000   0.000000   0.000000   0.000000   0.000000
      1       0.000000   0.000000   0.000000   0.000000   0.000000   0.000000
      2       0.000000   0.000000   0.000000   0.000000   0.000000   0.000000
      3       0.000000   0.000000   0.000000   0.000000   0.000000   0.000000
      4       0.000000   0.000000   0.000000   0.000000   0.000000   0.000000
      5       0.000000   0.000000   0.000000   0.000000   0.000000   0.000000
      6       0.000000   0.000000   0.000000   0.000000   0.000000   0.000000
      7       0.000000   0.000000   0.000000   0.000000   0.000000   0.000000
      8       0.000000   0.000000   0.000000   0.000000   0.000000   0.000000
      9       0.000000   0.000000   0.000000   0.000000   0.000000   0.000000
     10       0.000000   0.000000   0.000000   0.000000   0.000000   0.000000
     11       0.000000   0.000000   0.000000   0.000000   0.000000   0.000000
     12       0.000000   0.000000   0.000000   0.000000   0.000000   0.000000
     13       0.000000   0.000000   0.000000   0.000000   0.000000   0.000000
     14       0.000000   0.000000   0.000000   0.000000   0.000000   0.000000
     15       0.000000   0.000000   0.000000   0.000000   0.000000   0.000000
     16       0.000000   0.000000   0.000000   0.000000   0.000000   0.000000
     17       0.000000   0.000000   0.000000   0.000000   0.000000   0.000000
     18       0.000000   0.000000   0.000000   0.000000   0.000000   0.000000
     19       0.000000   0.000000   0.000000   0.000000   0.000000   0.000000
     20       0.000000   0.000000   0.000000   0.000000   0.000000   0.000000
     21       0.000000   0.000000   0.000000   0.000000   0.000000   0.000000
     22       0.000000   0.000000   0.000000   0.000000   0.000000   0.000000
     23       0.000000   0.000000   0.000000   0.000000   0.000000   0.000000
     24       0.000000   0.000000   0.000000   0.000000   0.000000   0.000000
     25       0.000000   0.000000   0.000000   0.000000   0.000000   0.000000
     26       0.000000   0.000000   0.000000   0.000000   0.000000   0.000000
     27       0.000000   0.000000   0.000000   0.000000   0.000000   0.000000
     28       0.000000   0.000000   0.000000   0.000000   0.000000   0.000000
     29       0.000000   0.000000   0.000000   0.000000   0.000000   0.000000
     30       0.000000   0.000000   0.000000   0.000000   0.000000   0.000000
     31       0.000000   0.000000   0.000000   0.000000   0.000000   0.000000
     32       0.000000   0.000000   0.000000   0.000000   0.000000   0.000000
     33       0.000000   0.000000   0.000000   0.000000   0.000000   0.000000
     34       0.000000   0.000000   0.000000   0.000000   0.000000   0.000000
     35       0.000000   0.000000   0.000000   0.000000   0.000000   0.000000
     36       0.000000   0.000000   0.000000   0.000000   0.000000   0.000000
     37       0.000000   0.000000   0.000000   0.000000   0.000000   0.000000
     38       0.000000   0.000000   0.000000   0.000000   0.000000   0.000000
     39       0.000000   0.000000   0.000000   0.000000   0.000000   0.000000
     40       0.000000   0.000000   0.000000   0.000000   0.000000   0.000000
     41       0.000000   0.000000   0.000000   0.000000   0.000000   0.000000
     42       0.000000   0.000000   0.000000   0.000000   0.000000   0.000000
     43       0.000000   0.000000   0.000000   0.000000   0.000000   0.000000
     44       0.000000   0.000000   0.000000   0.000000   0.000000   0.000000
     45       0.000000   0.000000   0.000000   0.000000   0.000000   0.000000
     46       0.000000   0.000000   0.000000   0.000000   0.000000   0.000000
     47       0.000000   0.000000   0.000000   0.000000   0.000000   0.000000
     48       0.000000   0.000000   0.000000   0.000000   0.000000   0.000000
     49       0.000000   0.000000   0.000000   0.000000   0.000000   0.000000
     50       0.000000   0.000000   0.000000   0.000000   0.000000   0.000000
     51       0.000000   0.000000   0.000000   0.000000   0.000000   0.000000
     52       0.000000   0.000000   0.000000   0.000000   0.000000   0.000000
     53       0.000000   0.000000   0.000000   0.000000   0.000000   0.000000
                  6          7          8          9         10         11    
      0      -0.000198   0.003219  -0.020929   0.014274  -0.011164   0.097485
      1      -0.019777  -0.005145   0.012105  -0.051373  -0.018075   0.028465
      2      -0.004391  -0.005785   0.021821  -0.023796  -0.004084  -0.126103
      3       0.000632   0.001703  -0.018706   0.015326  -0.015555   0.084173
      4      -0.040135  -0.006541   0.015178  -0.076859  -0.025458  -0.014018
      5      -0.007655  -0.004914   0.027246  -0.049935  -0.008164  -0.098900
      6       0.024158  -0.015759  -0.020056  -0.063635  -0.035071   0.169356
      7      -0.105133   0.042313  -0.018052   0.049325  -0.001171   0.056703
      8      -0.143031   0.060556  -0.041143   0.041543  -0.016286   0.063834
      9      -0.039071   0.016018  -0.005854   0.083338   0.056618  -0.108829
     10       0.090477  -0.011924  -0.015292   0.059477   0.028819   0.040436
     11       0.150478  -0.022365  -0.022475   0.074859   0.017330  -0.009869
     12       0.080400   0.393847   0.039493   0.038740   0.061567  -0.253808
     13       0.364755   0.344049  -0.025801   0.073491   0.009284   0.178238
     14       0.227294   0.212525   0.004457   0.048682   0.019894  -0.093480
     15      -0.250515  -0.495195  -0.053569   0.207577   0.123891  -0.163790
     16       0.017573  -0.050757   0.001157   0.008894   0.009750   0.022804
     17       0.367107   0.215202  -0.043585   0.141441   0.036069   0.045128
     18       0.009150   0.149460   0.009049   0.058826   0.049172  -0.132256
     19      -0.018115  -0.308137  -0.048026   0.195446   0.109861  -0.067946
     20      -0.009202  -0.467747  -0.072032   0.119703   0.012355   0.142521
     21       0.037828  -0.031374  -0.036953  -0.105934  -0.040573   0.272329
     22      -0.178131   0.086096  -0.021271   0.005880  -0.006612   0.093210
     23      -0.244743   0.125218  -0.037066   0.008699  -0.016968   0.053394
     24       0.028458  -0.015492  -0.004127  -0.083228  -0.035220   0.121313
     25      -0.101921   0.041574  -0.041148   0.176108   0.019759   0.036434
     26      -0.159442   0.059220  -0.103183   0.122512  -0.014869   0.248502
     27       0.003705  -0.001691  -0.044318   0.025188  -0.032814   0.206004
     28      -0.171561   0.009145   0.002947  -0.074614  -0.017050  -0.036127
     29      -0.034886  -0.002687   0.008884  -0.043141  -0.016398  -0.029727
     30       0.070959  -0.018206   0.075241  -0.139460  -0.060990  -0.068169
     31       0.054579  -0.009372   0.003644  -0.008846  -0.012516  -0.078316
     32      -0.146538   0.003220   0.009809  -0.089752  -0.012660   0.016486
     33       0.175662  -0.042017  -0.375110  -0.360243  -0.226787  -0.300903
     34       0.029253  -0.015759  -0.033856  -0.075521  -0.036859  -0.078997
     35      -0.279290   0.004097   0.250051  -0.076546   0.054633   0.184085
     36       0.068658  -0.019680   0.155290  -0.138634  -0.047562  -0.069796
     37      -0.017594   0.014180   0.272768   0.218271   0.121408   0.118172
     38      -0.118783   0.005751  -0.465145  -0.151566  -0.113369  -0.022680
     39       0.030371  -0.018274   0.539258  -0.060985   0.048418   0.000512
     40       0.224331  -0.025711  -0.237135  -0.105579  -0.116730  -0.341969
     41      -0.144288   0.000932   0.232281  -0.060003   0.033001   0.017026
     42      -0.054673   0.014939  -0.022551   0.095474   0.054923  -0.106004
     43       0.003641  -0.013302   0.010856  -0.009684   0.013850  -0.022247
     44       0.139789  -0.032922   0.018746   0.025712   0.018535   0.074470
     45      -0.055859   0.019065  -0.037857   0.035467   0.132138  -0.103219
     46      -0.014599  -0.015257   0.039456   0.205594  -0.101956  -0.162495
     47       0.155074  -0.060595   0.118089   0.362084  -0.485277   0.116476
     48      -0.062903  -0.003335   0.062803   0.474440  -0.354642  -0.207086
     49      -0.060624  -0.002494   0.029630  -0.008772  -0.100378  -0.098017
     50       0.224293  -0.041391  -0.030526  -0.090588   0.286900   0.202332
     51      -0.086489   0.041890  -0.100789  -0.154576   0.456309  -0.179706
     52       0.121443  -0.029619  -0.039284  -0.166875   0.282918   0.205345
     53       0.152075  -0.024192  -0.029101  -0.126660   0.267530   0.090651
                 12         13         14         15         16         17    
      0       0.038363  -0.088001   0.095151  -0.016452   0.060896  -0.075972
      1      -0.003501  -0.027764  -0.160028  -0.139933   0.042509   0.010690
      2       0.065370  -0.008123  -0.041739  -0.234898   0.031826   0.054205
      3       0.006145  -0.096818   0.093050  -0.060719  -0.074911   0.125862
      4       0.031626   0.043031   0.093530   0.003817  -0.010607   0.023674
      5       0.048330  -0.106904  -0.091615   0.094639   0.037804  -0.068559
      6       0.104538   0.054272  -0.116519  -0.015278   0.061476  -0.061379
      7      -0.068436  -0.116157   0.023440  -0.020549   0.060916  -0.063529
      8       0.049947   0.089738  -0.019226   0.054554  -0.026225   0.025787
      9       0.123621   0.122408   0.044309  -0.012324   0.030083  -0.032817
     10      -0.006314   0.046429  -0.140145   0.052178  -0.050504   0.059980
     11       0.046206  -0.007587   0.110549  -0.039453   0.043406  -0.046262
     12       0.170393   0.291290  -0.029095  -0.141192  -0.089655   0.013932
     13      -0.082708  -0.001906   0.019416   0.354604   0.068037   0.077409
     14       0.072175   0.092841   0.069784  -0.108941  -0.024592  -0.016896
     15       0.188707   0.255670   0.080261   0.155809  -0.005519   0.045067
     16      -0.003985  -0.010898  -0.212776  -0.135781  -0.076072   0.018968
     17       0.017709   0.076272   0.259038   0.317212   0.110603   0.022270
     18       0.124967   0.139360   0.024074  -0.069650  -0.000121  -0.043064
     19       0.078003   0.266080  -0.094904   0.273406  -0.099348   0.204216
     20       0.001840  -0.186400   0.185494   0.102639   0.205404  -0.079268
     21       0.159201   0.261368  -0.456180   0.036753  -0.099982  -0.122884
     22      -0.054469  -0.046874  -0.046470   0.249562   0.365799   0.191237
     23       0.035510   0.073236   0.060767   0.377770   0.442499   0.389279
     24       0.102802   0.017134  -0.079284  -0.019442   0.204974   0.043653
     25      -0.140619  -0.286076   0.342140  -0.190829  -0.236652  -0.428336
     26       0.054629   0.221730  -0.146719   0.059360  -0.578195  -0.405356
     27       0.000996  -0.136155   0.084773   0.060373  -0.115284  -0.007075
     28       0.025430   0.049498   0.155808   0.027139  -0.047051  -0.011679
     29       0.042898  -0.127264  -0.080490   0.166959   0.002622  -0.149639
     30      -0.088779   0.018324   0.034977   0.046673  -0.036053   0.032422
     31       0.145633  -0.093592   0.037150   0.079079  -0.084458   0.033890
     32      -0.052087  -0.002089   0.038642   0.052031  -0.060071   0.009216
     33      -0.258123   0.152537   0.057791   0.116156  -0.016075  -0.092619
     34       0.041293   0.026920   0.100380   0.074787  -0.087803   0.024913
     35      -0.168123   0.181168   0.170375  -0.009577  -0.078804   0.076857
     36      -0.087361   0.028114   0.028399   0.086100  -0.029734  -0.021556
     37       0.351885  -0.291071  -0.010633  -0.017111  -0.113429   0.213579
     38      -0.110228  -0.005084   0.085079  -0.121785  -0.092423   0.242843
     39      -0.033671   0.023678   0.006586   0.182600  -0.014070  -0.137038
     40       0.195744  -0.198153  -0.109217   0.241349  -0.043538  -0.159080
     41      -0.014785  -0.013572   0.001303   0.150037  -0.041480  -0.110556
     42      -0.158358  -0.079084  -0.081073   0.011852  -0.031893   0.049750
     43      -0.094961   0.145062   0.111285  -0.035569   0.048028  -0.056781
     44      -0.107942  -0.005589  -0.045871   0.007165  -0.014186   0.010411
     45      -0.139192  -0.101970  -0.080425   0.021910  -0.033760   0.041103
     46      -0.343129   0.240077  -0.125506   0.002928   0.178592  -0.248081
     47      -0.134041   0.108573   0.049536  -0.080861  -0.063412   0.169603
     48      -0.356465   0.047731  -0.236446   0.008053   0.034453  -0.043632
     49       0.065595   0.047821   0.106288   0.038150   0.053385  -0.085179
     50      -0.253861   0.082337   0.008472  -0.085842  -0.037714   0.074750
     51      -0.176461  -0.157777  -0.233308   0.113619   0.050418  -0.127094
     52      -0.181253   0.240217   0.289766  -0.191609  -0.032028   0.107612
     53      -0.137414  -0.020604  -0.075671   0.018999   0.005896  -0.032735
                 18         19         20         21         22         23    
      0      -0.031964   0.011507  -0.006175   0.071590  -0.052276   0.021800
      1       0.064874  -0.026936  -0.000734  -0.042819   0.040765  -0.024490
      2      -0.038759  -0.037909  -0.010470   0.057973  -0.034132   0.019105
      3      -0.114798  -0.002486   0.006099  -0.072190   0.023554  -0.017931
      4      -0.012455  -0.002398   0.038443   0.047654   0.100224  -0.042974
      5      -0.152480   0.001135   0.013101  -0.038861   0.025099  -0.000358
      6       0.030217  -0.032773  -0.005803   0.065518  -0.030032  -0.070411
      7       0.083805   0.091013   0.005724  -0.058660   0.049937  -0.019332
      8      -0.049643   0.136175   0.002509   0.054309  -0.041203  -0.004482
      9       0.034725   0.001988  -0.004641  -0.014376   0.003912   0.116820
     10      -0.115956  -0.004655  -0.011803   0.084842  -0.060138   0.061742
     11       0.086565  -0.008949   0.002158  -0.057294   0.050375  -0.018271
     12       0.083084  -0.012312   0.013714  -0.053958   0.075821  -0.307914
     13      -0.121640   0.044089   0.000237   0.075964  -0.105854   0.163475
     14       0.115213  -0.015907   0.013124  -0.080932   0.091790  -0.265941
     15       0.079863   0.005162   0.027419  -0.065922   0.059427  -0.319561
     16      -0.135201  -0.026483  -0.028120   0.109684  -0.067214   0.174062
     17       0.114140   0.037803   0.028016  -0.096401   0.049260  -0.137559
     18       0.040180  -0.004945  -0.004391  -0.014355   0.014298   0.081888
     19      -0.095478   0.012743   0.019697   0.029975  -0.013156  -0.487029
     20       0.071195   0.013017  -0.012529  -0.040589  -0.007317   0.375464
     21       0.235437   0.139666   0.023356  -0.417896   0.276233   0.167601
     22       0.187039  -0.400323  -0.029136  -0.215507   0.169538   0.059569
     23      -0.027987  -0.582809  -0.056716   0.092556  -0.043203  -0.013861
     24       0.024025   0.138332  -0.009896   0.144143  -0.075140  -0.119261
     25      -0.096194  -0.363094   0.000753   0.339808  -0.214582  -0.264185
     26      -0.017413  -0.539019   0.016679  -0.231980   0.124733   0.163536
     27      -0.174132   0.011517   0.036602  -0.106623   0.025814  -0.150010
     28      -0.056747   0.022408  -0.365351   0.152647   0.315227  -0.054517
     29      -0.194722   0.014640  -0.055486  -0.036593   0.072231  -0.079224
     30       0.010592  -0.002335   0.009668  -0.079039  -0.075886  -0.003047
     31       0.166639  -0.000485   0.026570   0.037859  -0.057967   0.036458
     32       0.066374   0.004615  -0.072013  -0.026283  -0.056313   0.004564
     33       0.104482   0.008864   0.011125   0.201346   0.135483   0.034004
     34       0.330251  -0.006600   0.203961   0.234115   0.026700   0.092266
     35       0.370540  -0.017662   0.341232   0.225946  -0.014005   0.110139
     36       0.011913   0.003896  -0.027802  -0.014023  -0.016908  -0.001556
     37      -0.021627  -0.008617  -0.104929  -0.402220  -0.323967  -0.064360
     38       0.107916  -0.023002   0.146026  -0.243540  -0.285974   0.023404
     39       0.025926   0.012855  -0.084163   0.143369   0.121195   0.011040
     40      -0.061560   0.028909  -0.413716  -0.021683   0.043735  -0.052284
     41       0.044307   0.016395  -0.182694   0.086541   0.064009   0.001506
     42       0.007716  -0.001053  -0.006626   0.044812   0.101970   0.016083
     43      -0.159083   0.001288   0.017105  -0.072366  -0.027161   0.024177
     44       0.007792  -0.002900   0.078832   0.025234   0.043608  -0.015506
     45      -0.014636  -0.000324   0.033756   0.041997   0.108660   0.012200
     46       0.144426  -0.002768  -0.062875  -0.160466  -0.504998  -0.106716
     47       0.042441  -0.007734  -0.168597   0.084231   0.209092   0.059537
     48       0.255514   0.003319  -0.084924  -0.014213  -0.212688  -0.072926
     49      -0.407063  -0.009309   0.316545  -0.086306   0.112028   0.038109
     50       0.247898   0.007733  -0.284147   0.059621  -0.041814  -0.007846
     51       0.085136  -0.006320   0.154309  -0.038263  -0.169521  -0.089942
     52       0.002262   0.019993  -0.434374  -0.014441   0.018477   0.077645
     53       0.081513  -0.001687   0.046886   0.001481  -0.069081  -0.051026
                 24         25         26         27         28         29    
      0      -0.020076  -0.010621   0.003930  -0.062233  -0.183664  -0.020328
      1       0.056025   0.023804  -0.049414   0.039659   0.130151  -0.003569
      2       0.080235   0.034017  -0.094335  -0.029199  -0.105525  -0.032825
      3      -0.030261   0.093233  -0.104602  -0.057456   0.005491   0.061724
      4       0.029257   0.155134   0.165725   0.023097  -0.034407   0.131797
      5       0.029347  -0.042975   0.085022  -0.182634   0.051819   0.041633
      6       0.021818  -0.066459   0.019130   0.033576   0.059220   0.004920
      7      -0.001079  -0.045240  -0.004902  -0.025735  -0.059766  -0.003821
      8      -0.010907   0.009041   0.021786   0.023856   0.053931   0.006215
      9       0.028823   0.051074   0.024785   0.052186   0.071486   0.009788
     10      -0.079678  -0.004080   0.032875  -0.005316  -0.024745  -0.000867
     11      -0.114958  -0.015182   0.050233   0.015360   0.027077   0.011992
     12      -0.142461  -0.101006  -0.012409  -0.054871  -0.030750  -0.024752
     13       0.514663   0.121770  -0.168356  -0.005093  -0.070931  -0.007307
     14      -0.195713  -0.101090   0.020560  -0.045782  -0.024892  -0.011569
     15       0.094798  -0.081626  -0.077008  -0.071681  -0.070822  -0.003888
     16      -0.352024  -0.009883   0.146811   0.012431  -0.041476   0.015404
     17       0.469168   0.042660  -0.174866   0.008360   0.092971  -0.019543
     18      -0.070746   0.022074   0.058585   0.042348   0.050590   0.016765
     19       0.180224  -0.106046  -0.178349  -0.164340  -0.270784  -0.038097
     20       0.201755   0.151238   0.001395   0.134104   0.235158  -0.005871
     21       0.023068  -0.014119  -0.074856  -0.154217  -0.338570  -0.019578
     22      -0.124924  -0.032776  -0.061269  -0.079786  -0.204030  -0.027631
     23      -0.173440   0.008774  -0.008406   0.040554   0.058747  -0.012474
     24      -0.014659  -0.089561   0.026110   0.069365   0.106725   0.002923
     25       0.170134  -0.153788   0.134380   0.138916   0.239997   0.051348
     26       0.139592   0.069853  -0.000423  -0.114134  -0.156295   0.006362
     27      -0.219665   0.401952  -0.349182  -0.061251   0.513983  -0.262841
     28       0.051387   0.285863   0.310718   0.052552  -0.187140  -0.792955
     29      -0.075184   0.167367  -0.032888  -0.178434   0.318075  -0.346109
     30       0.020315  -0.032722   0.104505   0.027207   0.000731  -0.050746
     31      -0.018533  -0.040404  -0.057034  -0.049453   0.013735  -0.036786
     32      -0.018461  -0.031008  -0.069420   0.105266  -0.036482   0.044800
     33      -0.064801   0.047183  -0.241682  -0.053822   0.012711   0.084044
     34      -0.048731  -0.032105  -0.166476  -0.236316   0.084542  -0.070418
     35      -0.026548  -0.071494  -0.071757  -0.293413   0.115151  -0.128194
     36      -0.007320  -0.004977   0.007801   0.038908  -0.014450  -0.008815
     37       0.091137  -0.097677   0.288926   0.272989  -0.020222  -0.036989
     38       0.083550  -0.149243   0.296137  -0.038919   0.063754  -0.169472
     39      -0.070778   0.038106  -0.253390  -0.021753   0.026654   0.056477
     40      -0.062968   0.008030  -0.252564   0.357532  -0.079792   0.140611
     41      -0.073305   0.008391  -0.290433   0.129985  -0.029334   0.124068
     42       0.023766  -0.096262   0.023446   0.027160   0.034003  -0.001182
     43      -0.016065  -0.086453  -0.074737   0.018076   0.014287  -0.020999
     44      -0.002394   0.032083   0.005663   0.121976  -0.056039  -0.039441
     45       0.017237  -0.086844   0.008023   0.075361   0.017645  -0.013213
     46      -0.079848   0.393246  -0.050093  -0.236406  -0.042446   0.007444
     47       0.070144  -0.193226   0.113785  -0.113543   0.094426   0.089984
     48      -0.022623   0.297369   0.051565  -0.105014  -0.037721   0.071093
     49      -0.038195  -0.189228  -0.176994   0.294629  -0.070057  -0.121524
     50       0.040245   0.049084   0.130198  -0.209454   0.074019   0.071257
     51      -0.050934   0.307313   0.008112   0.053085  -0.084281   0.052014
     52       0.057490  -0.220317   0.024162  -0.411026   0.194580   0.096595
     53      -0.017759   0.184794   0.029223   0.029780  -0.064662   0.015803
                 30         31         32         33         34         35    
      0      -0.084816   0.039727   0.035550  -0.003213   0.059959  -0.000819
      1       0.028074   0.000422   0.018715   0.028114   0.081639   0.010985
      2      -0.066009   0.010521  -0.006726  -0.021024  -0.043432   0.012716
      3       0.154634  -0.034828   0.001192  -0.000226  -0.005758  -0.003767
      4      -0.076905   0.032805  -0.003056   0.001271  -0.013029  -0.007465
      5       0.056403  -0.012075   0.002668  -0.001600   0.007574  -0.000731
      6       0.036065  -0.010936  -0.000596   0.003512   0.007213   0.000481
      7      -0.002873   0.003325   0.005329  -0.005702   0.003739   0.001109
      8       0.012946  -0.004322  -0.004159   0.004238  -0.000851  -0.000629
      9       0.014161  -0.017848  -0.043160   0.018793  -0.016580  -0.004216
     10       0.000698   0.023626   0.081136  -0.046849  -0.048700   0.027132
     11       0.013838  -0.018097  -0.070073   0.034342   0.030607   0.043589
     12      -0.033119   0.071986   0.297477  -0.081483   0.054934  -0.443525
     13      -0.075964  -0.070804  -0.390473   0.184116   0.286571  -0.010367
     14      -0.017328   0.036473   0.142507  -0.028913   0.064768  -0.237759
     15       0.001159   0.092738   0.189990  -0.075306   0.167502   0.349866
     16      -0.018764  -0.045805  -0.191777   0.084840   0.067699  -0.101785
     17       0.049041   0.087145   0.410253  -0.197073  -0.246513   0.167958
     18       0.026664  -0.010608  -0.054965   0.014885   0.000538   0.165997
     19      -0.095992  -0.117270  -0.370575   0.174400   0.023310  -0.303094
     20       0.001042   0.038873   0.264506  -0.072070  -0.035760  -0.557979
     21      -0.081220  -0.070319  -0.194798  -0.107219  -0.551928  -0.015800
     22      -0.051682  -0.026049  -0.075589  -0.047837  -0.226390  -0.008667
     23       0.005468  -0.004220   0.003959   0.010459   0.014124  -0.003271
     24       0.048998  -0.037631  -0.046913  -0.010754  -0.100153  -0.001162
     25       0.115830  -0.125135  -0.195551  -0.067602  -0.479135  -0.021311
     26      -0.045107   0.078441   0.123600   0.041975   0.307039   0.004427
     27      -0.642291   0.094497  -0.068748  -0.017350  -0.096699   0.029498
     28       0.427575  -0.103149   0.007543  -0.011326   0.015679   0.020507
     29      -0.307058   0.033459  -0.041189  -0.016973  -0.041272   0.028722
     30      -0.043276  -0.011552   0.006696   0.017769  -0.005179  -0.005708
     31      -0.000178  -0.077107   0.036231   0.060345  -0.010281  -0.004874
     32      -0.031458  -0.050686   0.038163   0.054601  -0.011682   0.016687
     33       0.151579   0.113824  -0.032255  -0.120314   0.010625   0.177937
     34       0.113409   0.139892  -0.083092  -0.140563   0.026480   0.042382
     35       0.094313   0.320000  -0.195070  -0.282631   0.058587  -0.022138
     36      -0.051940  -0.069406   0.049754   0.078002  -0.019346   0.024601
     37      -0.001524   0.328533  -0.130773  -0.265080   0.033763   0.156851
     38       0.082337   0.203975  -0.177356  -0.224446   0.055556  -0.170824
     39       0.182324   0.122899  -0.118614  -0.167984   0.043842  -0.110327
     40       0.015502   0.362127  -0.205753  -0.283423   0.064746  -0.106959
     41       0.099083   0.100004  -0.075312  -0.106519   0.027627  -0.064894
     42      -0.050270   0.045197   0.002238   0.038701  -0.001803   0.008731
     43      -0.013883  -0.085148  -0.004816  -0.081677   0.034671   0.002578
     44       0.034840   0.029884   0.005897   0.037991  -0.006314  -0.008640
     45      -0.039506   0.020721   0.004549   0.023338   0.009802  -0.009670
     46       0.195168   0.361794   0.040387   0.373737  -0.103481   0.068834
     47      -0.134822  -0.104794  -0.033999  -0.144699  -0.018970   0.071023
     48       0.068475  -0.212127  -0.015952  -0.192387   0.030812  -0.117181
     49       0.118061   0.195575   0.007335   0.217520  -0.105491  -0.015404
     50      -0.156033  -0.234370  -0.003167  -0.258656   0.154460   0.052674
     51       0.053134  -0.232874  -0.032411  -0.241105  -0.000959   0.012896
     52       0.033695   0.316606  -0.002898   0.311434  -0.176156  -0.072083
     53       0.084091  -0.021454  -0.010868  -0.013887  -0.052499  -0.018522
                 36         37         38         39         40         41    
      0       0.008449   0.007166   0.012285   0.005561  -0.021358   0.273741
      1      -0.004363   0.001477   0.012970   0.008558  -0.007685   0.308898
      2      -0.000112   0.005646  -0.009163   0.001524  -0.001604  -0.144535
      3      -0.005975  -0.009145   0.007529   0.002580   0.044139  -0.031863
      4       0.010361   0.016436  -0.014556   0.001760   0.003713  -0.028728
      5      -0.005904   0.002349   0.005607  -0.022625   0.010737   0.014332
      6       0.005646   0.007709   0.015091  -0.000371  -0.002690  -0.239647
      7       0.010347   0.011243   0.017481   0.000751  -0.006360  -0.266099
      8      -0.005000  -0.006208  -0.008363   0.000182   0.004074   0.120869
      9       0.026423   0.017390   0.040512  -0.002441  -0.003608  -0.012488
     10      -0.001182   0.014260  -0.004011   0.008788   0.003454  -0.035667
     11      -0.003538   0.011701   0.002032   0.006242  -0.002760   0.021226
     12      -0.067567  -0.225240  -0.155292  -0.079658   0.031207   0.005681
     13      -0.223501  -0.203240  -0.349968  -0.029916   0.040005  -0.194094
     14      -0.053333  -0.135119  -0.106818  -0.043134   0.018049   0.021121
     15      -0.308626  -0.087289  -0.444746   0.083808   0.057479  -0.049090
     16      -0.017785  -0.070590  -0.045141  -0.036960   0.004143  -0.087622
     17       0.126831   0.199843   0.220303   0.068311  -0.021530   0.156890
     18      -0.008923   0.059443   0.004420   0.033300  -0.003070  -0.000709
     19       0.237823   0.046804   0.348263  -0.075506  -0.065644   0.161281
     20      -0.003327  -0.222768  -0.071926  -0.106934   0.033236  -0.102880
     21      -0.054899  -0.073972  -0.186524  -0.043547   0.101990   0.496237
     22      -0.019106  -0.015662  -0.065434  -0.023412   0.034932  -0.018353
     23      -0.008368   0.003113  -0.003549  -0.005862  -0.000449   0.137265
     24      -0.007999  -0.009002  -0.021489  -0.008254   0.018783  -0.161445
     25      -0.061168  -0.079664  -0.162185  -0.039327   0.098471   0.364974
     26       0.044388   0.050304   0.107312   0.020461  -0.062271  -0.287171
     27       0.007912   0.026170  -0.036889  -0.002341  -0.059344  -0.181483
     28      -0.003299  -0.069649   0.018518  -0.003563   0.010517   0.000696
     29      -0.001951   0.006734  -0.013861  -0.032157  -0.050857  -0.083180
     30      -0.033571   0.006353   0.020958   0.018747   0.025354  -0.007373
     31       0.010816   0.015739  -0.021909   0.024982  -0.007138  -0.002461
     32      -0.006694  -0.021700   0.011227  -0.022999  -0.003842  -0.003181
     33       0.241253  -0.252401  -0.055084  -0.438830  -0.294035   0.006077
     34      -0.025797  -0.088767   0.076803  -0.131297   0.003433   0.007648
     35      -0.267516  -0.049382   0.262385  -0.017743   0.241077   0.012394
     36      -0.069718  -0.040546   0.066326  -0.033364   0.047193  -0.011695
     37       0.124581  -0.239797   0.039523  -0.396496  -0.209007   0.000839
     38       0.226893   0.261611  -0.281138   0.316818  -0.124643   0.010327
     39       0.317675   0.185018  -0.318666   0.190617  -0.206481   0.020113
     40      -0.272831   0.072537   0.206556   0.180525   0.288891   0.015836
     41       0.141533   0.097051  -0.144068   0.110177  -0.084225   0.014752
     42       0.034035  -0.007538  -0.009310   0.000763   0.030658   0.006228
     43       0.007864   0.008285   0.000634  -0.016130   0.019671   0.007865
     44      -0.008140   0.036591  -0.013065  -0.028127   0.006630   0.001654
     45      -0.002378   0.076776  -0.026396  -0.066165   0.028220   0.008163
     46       0.245518  -0.216450  -0.018778   0.127956   0.264823  -0.056747
     47       0.047477  -0.451613   0.149802   0.422057  -0.202441   0.000299
     48      -0.347774   0.372820  -0.014496  -0.252896  -0.272710   0.017576
     49      -0.095315  -0.059009   0.035392   0.100464  -0.177541   0.002226
     50       0.232273  -0.008921  -0.048368  -0.081363   0.332598   0.007490
     51      -0.116095  -0.293146   0.151390   0.321350  -0.313071  -0.013562
     52      -0.292374   0.119905   0.028348  -0.014560  -0.360400  -0.003737
     53      -0.134723  -0.089010   0.069640   0.133459  -0.236239  -0.010819
                 42         43         44         45         46         47    
      0       0.000978  -0.000832  -0.000071   0.001014   0.000357  -0.000087
      1       0.000795  -0.000236  -0.000262   0.000096  -0.000224  -0.000321
      2      -0.001130   0.000255   0.000174   0.000096  -0.000523   0.000085
      3       0.040432  -0.003390  -0.000450   0.000509   0.000962  -0.000963
      4       0.014885  -0.001461   0.001034  -0.000018   0.000312  -0.000732
      5      -0.068950   0.004970   0.000221  -0.000451  -0.001788   0.001699
      6       0.000295  -0.000334  -0.000308  -0.000316  -0.000200  -0.000423
      7      -0.000224  -0.000171   0.000632  -0.001001  -0.000245   0.001334
      8       0.000024   0.000072  -0.000485   0.000613  -0.000081  -0.001015
      9      -0.001859  -0.005627  -0.000915  -0.001850   0.024631   0.001353
     10      -0.001798  -0.036996  -0.000642   0.000545  -0.054258  -0.000096
     11       0.004654   0.037423   0.006769   0.005732  -0.067409  -0.000165
     12       0.040772   0.374698   0.048994   0.039355  -0.323773  -0.002353
     13      -0.002385  -0.004190   0.000713   0.000464  -0.017256   0.000294
     14      -0.062156  -0.618968  -0.080456  -0.063546   0.523498   0.004094
     15       0.002883   0.066703   0.001639  -0.000773   0.108048   0.000639
     16       0.025571   0.493005   0.012166  -0.006030   0.689349   0.003463
     17       0.014031   0.250358   0.007434  -0.001291   0.322131   0.000736
     18      -0.021666  -0.368719  -0.036662  -0.017335  -0.076719  -0.014317
     19      -0.002795  -0.049209  -0.004249  -0.000717  -0.022029  -0.001686
     20      -0.001413  -0.075753  -0.006548  -0.002853  -0.033593  -0.003238
     21       0.001578  -0.005003   0.002560  -0.004571  -0.001273   0.007489
     22      -0.004808   0.007688  -0.006401   0.010957   0.002334  -0.015316
     23       0.004234  -0.006854   0.004574  -0.008509  -0.001779   0.011997
     24      -0.007660   0.014450  -0.000384   0.005461   0.003897  -0.001871
     25       0.000420  -0.000818   0.000703  -0.001456  -0.000547   0.001247
     26      -0.002885   0.004421  -0.000306   0.002587   0.000964  -0.001233
     27      -0.493209   0.038352   0.001641  -0.005186  -0.014357   0.010853
     28      -0.177106   0.013327  -0.001774  -0.000506  -0.004806   0.006574
     29       0.834691  -0.061351  -0.002351   0.006092   0.021654  -0.018226
     30      -0.004450   0.001521  -0.010429  -0.008779  -0.005075   0.052866
     31      -0.002858   0.005655  -0.021579  -0.020579   0.003767   0.001884
     32       0.005250   0.001390  -0.027712  -0.024619  -0.007713  -0.020335
     33      -0.011808   0.023356  -0.103187  -0.094896   0.012449  -0.002814
     34       0.023095  -0.071324   0.305546   0.286401  -0.040167   0.049769
     35      -0.011613   0.033255  -0.145364  -0.132460   0.017215  -0.026956
     36       0.030361  -0.064070   0.449452   0.396873   0.080145  -0.435498
     37      -0.002057  -0.000329   0.012385   0.011743   0.005055  -0.014165
     38       0.007218  -0.012065   0.079727   0.071041   0.013218  -0.086738
     39       0.036527   0.021296  -0.224903  -0.200465  -0.035057  -0.191048
     40       0.010531   0.006937  -0.065474  -0.056595  -0.007944  -0.057685
     41      -0.064280  -0.038590   0.392555   0.352007   0.059100   0.356009
     42      -0.005088   0.001043   0.011595  -0.011670  -0.000121  -0.062690
     43       0.000296   0.000869  -0.025719   0.030131   0.000977  -0.007452
     44       0.006057  -0.001205   0.017569  -0.019004   0.001092   0.037319
     45       0.039911   0.000795  -0.380214   0.409877   0.003066   0.550741
     46       0.006513  -0.000489  -0.033839   0.035130   0.000103   0.043395
     47       0.007644   0.000043  -0.046379   0.050340   0.000582   0.083502
     48      -0.009246  -0.001461   0.065721  -0.074282  -0.002951  -0.028480
     49      -0.021890  -0.005523   0.257035  -0.299664  -0.012377  -0.057687
     50      -0.018650  -0.004978   0.213960  -0.245053  -0.009976  -0.036030
     51       0.030424  -0.009615   0.182228  -0.202743   0.001603   0.225134
     52       0.012705  -0.003708   0.077703  -0.089051   0.000140   0.105943
     53      -0.062237   0.019250  -0.375564   0.420072  -0.002398  -0.493488
                 48         49         50         51         52         53    
      0      -0.000182  -0.000614  -0.000358   0.001408   0.004115  -0.002262
      1       0.000152  -0.000279  -0.000378   0.001645   0.005576  -0.000150
      2      -0.000112   0.000157   0.000393  -0.000661  -0.002764  -0.000483
      3       0.005728   0.001091   0.001434   0.000967   0.001060   0.000236
      4       0.001546   0.000968   0.000752   0.000837  -0.000030   0.000301
      5      -0.007885  -0.000901  -0.004961  -0.002885  -0.000160  -0.000183
      6       0.000102   0.001647   0.001380  -0.003515  -0.055313  -0.064288
      7      -0.000956  -0.000141   0.000399  -0.001181  -0.039608   0.052476
      8       0.000845   0.000394   0.000230  -0.000096   0.012883  -0.051926
      9      -0.000774  -0.029652  -0.027505   0.075815  -0.003764  -0.001198
     10      -0.001516  -0.005103  -0.005473   0.028643  -0.000069  -0.000721
     11      -0.002169   0.000022  -0.000509   0.011120  -0.000980   0.000081
     12      -0.008649   0.048194   0.043044  -0.092124   0.000728   0.002714
     13      -0.000856  -0.001343  -0.001367   0.006804  -0.001894   0.000722
     14       0.014731  -0.088250  -0.079496   0.179582  -0.000035  -0.003171
     15       0.002589  -0.001792  -0.000750  -0.023636  -0.000216   0.001281
     16       0.018061   0.027908   0.035269  -0.268985  -0.001920   0.004270
     17       0.008069   0.015316   0.018146  -0.132468   0.001307   0.001532
     18       0.014980   0.304926   0.284349  -0.789555   0.045206   0.015252
     19       0.001548   0.035306   0.032809  -0.091154   0.004404  -0.000711
     20       0.003197   0.068260   0.063641  -0.174628   0.010659   0.005170
     21      -0.005011  -0.000381   0.002229  -0.006056  -0.184507   0.238950
     22       0.010198   0.001288  -0.002995   0.008824   0.429656  -0.616734
     23      -0.008341  -0.000021   0.001821  -0.007605  -0.338067   0.478837
     24       0.000797  -0.016932  -0.014318   0.036818   0.783131   0.550455
     25      -0.001029   0.000622   0.000920  -0.002662  -0.022031  -0.002208
     26       0.000481  -0.005082  -0.004404   0.011267   0.213554   0.140701
     27      -0.052179  -0.007186  -0.023222  -0.018057  -0.006371   0.000102
     28      -0.018105  -0.002418  -0.008974  -0.005415  -0.002366  -0.000422
     29       0.087579   0.013346   0.044812   0.028847   0.006539   0.001273
     30       0.070450  -0.008530  -0.014540  -0.007591  -0.000081  -0.000072
     31      -0.003756   0.041073   0.041290   0.029045   0.000079   0.000225
     32      -0.019746  -0.039650  -0.038496  -0.027348   0.000107  -0.000244
     33      -0.029783   0.153686   0.155189   0.109034   0.000523   0.000735
     34       0.134950  -0.469765  -0.476980  -0.334726  -0.001405  -0.003142
     35      -0.065233   0.207627   0.211072   0.147323   0.000648   0.001200
     36      -0.592502   0.100568   0.161893   0.085008  -0.002289   0.001817
     37      -0.023524   0.011348   0.016458   0.008980  -0.000557   0.000128
     38      -0.117604   0.009804   0.022127   0.010074  -0.000767   0.000398
     39      -0.222778  -0.150789  -0.139334  -0.101172   0.001014  -0.000889
     40      -0.065275  -0.033652  -0.027952  -0.021640   0.000293  -0.000030
     41       0.421082   0.255750   0.233491   0.171729  -0.001662   0.001498
     42       0.045263   0.029397  -0.024783   0.003754  -0.000852   0.001158
     43       0.002565   0.036053  -0.035704   0.001349  -0.000709   0.000648
     44      -0.031861   0.046269  -0.048940  -0.001074   0.001102  -0.000903
     45      -0.397508  -0.328665   0.293337  -0.031048   0.004638  -0.008835
     46      -0.028908  -0.019584   0.015825  -0.002794   0.001305  -0.001959
     47      -0.061268  -0.034547   0.028545  -0.004498   0.000484  -0.000655
     48       0.028568  -0.107516   0.108665  -0.001509   0.001238  -0.000787
     49       0.082103  -0.456487   0.459860  -0.009111   0.004613  -0.005134
     50       0.058733  -0.362423   0.364431  -0.007617   0.004262  -0.004956
     51      -0.175411   0.085248  -0.104045  -0.011783   0.010298  -0.009294
     52      -0.085756   0.042040  -0.053433  -0.007089   0.004117  -0.003673
     53       0.384548  -0.154722   0.195427   0.027546  -0.018315   0.017557
# -----------------------------------------------------------
$ THERMOCHEMISTRY_Energies
   description: The Thermochemistry energies
   geom. index: 17
   prop. index: 1
        Temperature (Kelvin)           :        298.1500000000
        Pressure (atm)                 :          1.0000000000
        Total Mass (AMU)               :         84.1620000000
        Spin Degeneracy                :          1.0000000000
        Electronic Energy (Hartree)    :       -235.6726691205
        Translational Energy (Hartree) :          0.0014162714
        Rotational Energy (Hartree)    :          0.0014162714
        Vibrational Energy (Hartree)   :          0.0049667600
        Number of frequencies          :     54      
        Scaling Factor for frequencies :          1.0000000000
        Vibrational frequencies        :     
                  0    
      0       0.000000
      1       0.000000
      2       0.000000
      3       0.000000
      4       0.000000
      5       0.000000
      6      42.950359
      7     176.095597
      8     222.368818
      9     265.247833
     10     283.927328
     11     308.776056
     12     356.969863
     13     430.955046
     14     497.090151
     15     558.055535
     16     721.396247
     17     755.861385
     18     900.074625
     19     921.857744
     20     939.832120
     21     972.273134
     22     976.099057
     23     1027.748499
     24     1075.788296
     25     1133.519074
     26     1142.413168
     27     1195.222267
     28     1273.563505
     29     1347.273366
     30     1395.026503
     31     1424.166986
     32     1441.012494
     33     1442.546517
     34     1474.066206
     35     1509.379472
     36     1518.763338
     37     1521.741309
     38     1529.459671
     39     1536.238667
     40     1543.980175
     41     1729.398661
     42     2993.276066
     43     3030.834116
     44     3042.671883
     45     3047.245024
     46     3077.044305
     47     3104.811565
     48     3111.063087
     49     3118.001191
     50     3119.196222
     51     3122.993257
     52     3163.722686
     53     3241.048057
        Zero Point Energy (Hartree)    :          0.1657664172
        Inner Energy (Hartree)         :       -235.4991034004
        Enthalpy (Hartree)             :       -235.4981591914
        Electronic entropy             :          0.0000000000
        Rotational entropy             :          0.0127795797
        Vibrational entropy            :          0.0082584948
        Translational entropy          :          0.0127795797
        Entropy                        :          0.0396651136
        Gibbs Energy (Hartree)         :       -235.5378243050
        Is Linear                      :                 false
# -------------------------------------------------------------
----------------------- !GEOMETRIES! ------------------------
# -------------------------------------------------------------
------------------------ !GEOMETRY! -------------------------
    Number of atoms:    18 
    Geometry Index:     1 
    Coordinates:
               0 C     -2.208440000000   -0.544420000000   -0.615560000000
               1 C     -0.730100000000   -0.552510000000   -0.213250000000
               2 C     -2.921790000000   -1.676000000000   -0.776530000000
               3 C     -2.872600000000    0.779140000000   -0.899060000000
               4 H     -2.410040000000    1.257920000000   -1.767920000000
               5 H     -2.796460000000    1.449940000000   -0.037830000000
               6 H     -3.941290000000    0.666490000000   -1.113720000000
               7 H     -2.492340000000   -2.661070000000   -0.633900000000
               8 H     -3.962010000000   -1.651980000000   -1.087750000000
               9 H     -0.156700000000   -0.783690000000   -1.121290000000
              10 C     -0.209880000000    0.798530000000    0.301930000000
              11 H     -0.317900000000    1.584260000000   -0.453110000000
              12 H      0.857320000000    0.735800000000    0.543590000000
              13 H     -0.738770000000    1.113080000000    1.208350000000
              14 C     -0.391990000000   -1.619370000000    0.841200000000
              15 H      0.669250000000   -1.577080000000    1.111120000000
              16 H     -0.582180000000   -2.633180000000    0.476190000000
              17 H     -0.976360000000   -1.469290000000    1.756310000000
------------------------ !GEOMETRY! -------------------------
    Number of atoms:    18 
    Geometry Index:     2 
    Coordinates:
               0 C     -2.209504552206   -0.538514240893   -0.605352040521
               1 C     -0.728506441960   -0.541759878694   -0.208466970836
               2 C     -2.916649553080   -1.671708127281   -0.722425980543
               3 C     -2.864777911351    0.784724691531   -0.937607784599
               4 H     -2.383760189148    1.251814443569   -1.808172623946
               5 H     -2.801776487633    1.489850696551   -0.100038200271
               6 H     -3.926236503902    0.658192855688   -1.174343507972
               7 H     -2.492135274921   -2.651236214252   -0.518904036212
               8 H     -3.957186825153   -1.658925610672   -1.036474560640
               9 H     -0.156715125829   -0.750697405386   -1.127239250083
              10 C     -0.223185305720    0.812293274112    0.328137198221
              11 H     -0.354559044381    1.619489119693   -0.401328083748
              12 H      0.847149201611    0.754444498598    0.555541085454
              13 H     -0.742840223195    1.097503277406    1.251128346479
              14 C     -0.388385514515   -1.648443552748    0.807997646923
              15 H      0.676558746244   -1.618680956175    1.068231932962
              16 H     -0.594361605011   -2.650524545781    0.416668788461
              17 H     -0.965407389851   -1.521252325267    1.731418040871
------------------------ !GEOMETRY! -------------------------
    Number of atoms:    18 
    Geometry Index:     3 
    Coordinates:
               0 C     -2.218526440480   -0.531701739229   -0.589923650289
               1 C     -0.730397489850   -0.530055917987   -0.201858169768
               2 C     -2.940882814653   -1.655095216807   -0.634789823822
               3 C     -2.845144911362    0.784595603451   -1.006649810816
               4 H     -2.330984117328    1.218729869093   -1.878377663794
               5 H     -2.796417489735    1.538656677591   -0.210462612135
               6 H     -3.896715304923    0.645854293412   -1.275640037885
               7 H     -2.541071043467   -2.625581397833   -0.354841836923
               8 H     -3.980524116570   -1.642171815081   -0.954835225479
               9 H     -0.162286953275   -0.691193200307   -1.135055013558
              10 C     -0.251802291755    0.816435582568    0.379639533467
              11 H     -0.415703590239    1.653185154999   -0.307613072173
              12 H      0.822591507183    0.768580450391    0.591206019133
              13 H     -0.763340029494    1.049753592666    1.322894423287
              14 C     -0.358383582928   -1.678700297470    0.756357039722
              15 H      0.709933047898   -1.637368859962    1.002629117427
              16 H     -0.555492000563   -2.665082430453    0.325271384706
              17 H     -0.927132378456   -1.602270349041    1.690819398900
------------------------ !GEOMETRY! -------------------------
    Number of atoms:    18 
    Geometry Index:     4 
    Coordinates:
               0 C     -2.226197571354   -0.525257044247   -0.577384668370
               1 C     -0.734291805005   -0.518644096526   -0.196956042172
               2 C     -2.971815307156   -1.632204237097   -0.547268548666
               3 C     -2.821674307017    0.776852501656   -1.076300200083
               4 H     -2.277805820754    1.171103517315   -1.949850972359
               5 H     -2.781246600109    1.573959757528   -0.322548064207
               6 H     -3.865174576388    0.629484599209   -1.369943564617
               7 H     -2.600403648155   -2.589708166379   -0.196309071445
               8 H     -4.011251789000   -1.614514175364   -0.869296968379
               9 H     -0.171543307595   -0.628416459104   -1.141706684482
              10 C     -0.281862246539    0.814040783574    0.434579493893
              11 H     -0.470970981432    1.676189666006   -0.212085506352
              12 H      0.794805023885    0.777043169045    0.638135854916
              13 H     -0.791392014348    0.995694754717    1.390961769397
              14 C     -0.325356974756   -1.699953990123    0.702493796578
              15 H      0.744238851287   -1.639582956510    0.937773457997
              16 H     -0.504420072377   -2.669845706700    0.229301978661
              17 H     -0.885916853187   -1.679671917001    1.645173939691
------------------------ !GEOMETRY! -------------------------
    Number of atoms:    18 
    Geometry Index:     5 
    Coordinates:
               0 C     -2.232402845446   -0.518602897509   -0.565499385347
               1 C     -0.740073756661   -0.506777014597   -0.193126644502
               2 C     -3.004704567190   -1.603593086443   -0.461056524478
               3 C     -2.796343377859    0.761959829937   -1.144437516448
               4 H     -2.223793260715    1.112019162833   -2.017716221653
               5 H     -2.763401527432    1.596353474512   -0.432613475245
               6 H     -3.832523611874    0.607903013186   -1.459911238215
               7 H     -2.661194489415   -2.544389370577   -0.046000543510
               8 H     -4.044175581186   -1.579103516848   -0.782936961548
               9 H     -0.185382197321   -0.563997451139   -1.146910587344
              10 C     -0.311222923725    0.806396323442    0.490857932703
              11 H     -0.520584125264    1.690652265867   -0.116807710892
              12 H      0.766707393383    0.780440212595    0.690871545167
              13 H     -0.822019973195    0.936840291172    1.455062208814
              14 C     -0.292917363276   -1.713017572258    0.647854455346
              15 H      0.776893727230   -1.632368513410    0.872610554612
              16 H     -0.453058257834   -2.664013434261    0.131449576950
              17 H     -0.842083262219   -1.750131716501    1.597080535590
------------------------ !GEOMETRY! -------------------------
    Number of atoms:    18 
    Geometry Index:     6 
    Coordinates:
               0 C     -2.234904415178   -0.510638492441   -0.555761246390
               1 C     -0.746907476978   -0.493153256318   -0.192513906718
               2 C     -3.034850766607   -1.569691865756   -0.377125171826
               3 C     -2.770940949314    0.740423644701   -1.210726515379
               4 H     -2.171493877566    1.041016610524   -2.081795522857
               5 H     -2.747770901832    1.604916913869   -0.536921433219
               6 H     -3.801163239623    0.583537888822   -1.545082331236
               7 H     -2.713006448200   -2.492462196729    0.090289320530
               8 H     -4.075316315455   -1.538489312603   -0.693997339892
               9 H     -0.202976125447   -0.497219045287   -1.152446524699
              10 C     -0.337489089295    0.793630550258    0.547890153054
              11 H     -0.562233715510    1.698090854272   -0.022286659555
              12 H      0.740722579803    0.779735666567    0.748281600762
              13 H     -0.852992280813    0.871553801540    1.514526233840
              14 C     -0.265246768805   -1.717450641803    0.594037136033
              15 H      0.804732819265   -1.622158001133    0.807493776697
              16 H     -0.412749353121   -2.647199546039    0.035590649514
              17 H     -0.797693675325   -1.807873572442    1.549317781341
------------------------ !GEOMETRY! -------------------------
    Number of atoms:    18 
    Geometry Index:     7 
    Coordinates:
               0 C     -2.235502757884   -0.497432942983   -0.546480824712
               1 C     -0.748724091784   -0.475920065175   -0.190571779283
               2 C     -3.049073102307   -1.529203670124   -0.292255552671
               3 C     -2.755074539212    0.718205751411   -1.279267862840
               4 H     -2.133253588822    0.971905747707   -2.150222202621
               5 H     -2.747242448594    1.616634716629   -0.649673916749
               6 H     -3.777643388686    0.547627351093   -1.629608275228
               7 H     -2.736406270668   -2.423798866782    0.234209196383
               8 H     -4.091232531421   -1.503476174389   -0.604139649342
               9 H     -0.211084973795   -0.427105952198   -1.153439622632
              10 C     -0.358384486780    0.784508343515    0.606956185070
              11 H     -0.597547236494    1.710473178619    0.077281393200
              12 H      0.719555549943    0.780062380580    0.808294657339
              13 H     -0.877148927063    0.809409946078    1.574583296031
              14 C     -0.247111838723   -1.729244299704    0.537074768519
              15 H      0.824303866815   -1.633729317636    0.744675323057
              16 H     -0.393488979934   -2.634083137570   -0.061831057889
              17 H     -0.767220254590   -1.868262989071    1.493185924367
------------------------ !GEOMETRY! -------------------------
    Number of atoms:    18 
    Geometry Index:     8 
    Coordinates:
               0 C     -2.224003310802   -0.486845445804   -0.551889240552
               1 C     -0.747285378969   -0.460347297096   -0.198913198525
               2 C     -3.052877520047   -1.487373950715   -0.218626037128
               3 C     -2.737443205740    0.695786715135   -1.340470484613
               4 H     -2.105263751558    0.887991361972   -2.216909539744
               5 H     -2.737211261408    1.611705630015   -0.735128479878
               6 H     -3.762881536457    0.538631650780   -1.690298990639
               7 H     -2.731120416179   -2.362148101110    0.337986602672
               8 H     -4.101996748779   -1.463610865751   -0.503317107347
               9 H     -0.211616891763   -0.359339775559   -1.156580428518
              10 C     -0.381520974508    0.770090613077    0.659085743655
              11 H     -0.631031987842    1.711735666645    0.157443006323
              12 H      0.693222650298    0.788024562564    0.873640492560
              13 H     -0.916768071196    0.741963289636    1.615599397897
              14 C     -0.237320905262   -1.733635908481    0.489050536812
              15 H      0.837248442162   -1.654327851588    0.688811121770
              16 H     -0.396125064746   -2.617114887028   -0.140255085358
              17 H     -0.738284067207   -1.904615406692    1.449541690614
------------------------ !GEOMETRY! -------------------------
    Number of atoms:    18 
    Geometry Index:     9 
    Coordinates:
               0 C     -2.228233008167   -0.475408125978   -0.543092674322
               1 C     -0.745656529483   -0.446115521974   -0.190465800562
               2 C     -3.064541585478   -1.440922893791   -0.147365250933
               3 C     -2.724127511237    0.670687203959   -1.400902854822
               4 H     -2.078961612866    0.819955704556   -2.278722448848
               5 H     -2.725377669538    1.621943287619   -0.851001281957
               6 H     -3.743967023913    0.492716498910   -1.755795748803
               7 H     -2.751615940376   -2.277164557392    0.470084159919
               8 H     -4.114634597908   -1.423600935486   -0.431547826368
               9 H     -0.208901806868   -0.296199171401   -1.143072180640
              10 C     -0.405406280429    0.759753161776    0.714901586869
              11 H     -0.677609222470    1.716092493079    0.255438654268
              12 H      0.669839161557    0.787884631324    0.927202886437
              13 H     -0.936984676682    0.682167164950    1.671797854776
              14 C     -0.217677125459   -1.746112729767    0.433342325843
              15 H      0.860432701388   -1.667794011335    0.616577035613
              16 H     -0.387708411498   -2.606283620762   -0.224053588149
              17 H     -0.701148860574   -1.955028578286    1.395445151680
------------------------ !GEOMETRY! -------------------------
    Number of atoms:    18 
    Geometry Index:     10 
    Coordinates:
               0 C     -2.227103025222   -0.476539610797   -0.547636748698
               1 C     -0.744128602598   -0.446408797214   -0.191094281806
               2 C     -3.063955974829   -1.442657638791   -0.152683650935
               3 C     -2.723966524589    0.671909999439   -1.400498226415
               4 H     -2.087632912295    0.814150957021   -2.285205797246
               5 H     -2.712679062610    1.622753777446   -0.850734282849
               6 H     -3.749281803383    0.501309805870   -1.743632175712
               7 H     -2.748367480155   -2.281498000629    0.459775418642
               8 H     -4.114606608746   -1.424951028013   -0.434152459321
               9 H     -0.202832125582   -0.295948268227   -1.140276165100
              10 C     -0.407503503230    0.758821311224    0.715544003672
              11 H     -0.681366088619    1.713905331771    0.254828240367
              12 H      0.667585853879    0.789970714326    0.928978992389
              13 H     -0.940237304649    0.680368074112    1.671539713467
              14 C     -0.217550246065   -1.744789308127    0.435740465635
              15 H      0.862411060654   -1.671032918874    0.609119167853
              16 H     -0.398089752089   -2.607983116213   -0.214559045863
              17 H     -0.692975899873   -1.944811284326    1.403716831920
------------------------ !GEOMETRY! -------------------------
    Number of atoms:    18 
    Geometry Index:     11 
    Coordinates:
               0 C     -2.225952749069   -0.474601666483   -0.551601030529
               1 C     -0.742929553713   -0.442915430501   -0.190431127909
               2 C     -3.064175415127   -1.436959911816   -0.148786642401
               3 C     -2.720271570021    0.668283240083   -1.411630782013
               4 H     -2.100493541122    0.783433750212   -2.311370754831
               5 H     -2.681134093203    1.626741951181   -0.877370249220
               6 H     -3.755641350310    0.509856250957   -1.729973471050
               7 H     -2.744978583831   -2.273359387639    0.465080165192
               8 H     -4.115595625560   -1.421099594046   -0.426739383729
               9 H     -0.194930088917   -0.281407707068   -1.133168486106
              10 C     -0.415974809872    0.754611495857    0.728845936298
              11 H     -0.697009088835    1.711098078899    0.275704077669
              12 H      0.658923050192    0.792462073103    0.942987673585
              13 H     -0.948858212533    0.663696272660    1.683393044097
              14 C     -0.214808936047   -1.743243834201    0.429174343136
              15 H      0.868906045970   -1.677509960923    0.580453355942
              16 H     -0.416234972777   -2.606994348596   -0.213886300300
              17 H     -0.671120505227   -1.935521271678    1.408089632169
------------------------ !GEOMETRY! -------------------------
    Number of atoms:    18 
    Geometry Index:     12 
    Coordinates:
               0 C     -2.225705357706   -0.472695346024   -0.552104282365
               1 C     -0.743271057472   -0.439998827227   -0.189477890873
               2 C     -3.064556128132   -1.431900984449   -0.143180900588
               3 C     -2.717985320387    0.664564895659   -1.420363660320
               4 H     -2.107505582273    0.761606460432   -2.328675260676
               5 H     -2.662131795236    1.629485534913   -0.899325484017
               6 H     -3.758541863331    0.512769070509   -1.724655283179
               7 H     -2.745146878683   -2.264201743427    0.476183175956
               8 H     -4.116299214823   -1.416983470738   -0.419926207089
               9 H     -0.193559402774   -0.270557363068   -1.129793947662
              10 C     -0.420836391185    0.752190507842    0.738632384128
              11 H     -0.705979179348    1.710877638968    0.292619310611
              12 H      0.654004178238    0.792879581983    0.952667433984
              13 H     -0.952955877165    0.652099007519    1.692614712154
              14 C     -0.212516820512   -1.742933189087    0.422930570871
              15 H      0.872355883377   -1.678761355593    0.566579890793
              16 H     -0.419775126444   -2.604860797288   -0.220695753170
              17 H     -0.661874066145   -1.937009620925    1.404741191442
------------------------ !GEOMETRY! -------------------------
    Number of atoms:    18 
    Geometry Index:     13 
    Coordinates:
               0 C     -2.225610321347   -0.469459494663   -0.551581032108
               1 C     -0.744331738983   -0.435075105104   -0.187622665597
               2 C     -3.065225043430   -1.424157305058   -0.134075850925
               3 C     -2.715050055036    0.658247137106   -1.433451933344
               4 H     -2.120603792220    0.725389165558   -2.355362977549
               5 H     -2.631093580263    1.633287914900   -0.935336103977
               6 H     -3.763670226483    0.518494087034   -1.714694194311
               7 H     -2.746531242828   -2.250369405188    0.493882799827
               8 H     -4.117132388582   -1.410610031388   -0.410357811969
               9 H     -0.193696271627   -0.254088275245   -1.125355939537
              10 C     -0.427119210236    0.748953362331    0.753519005552
              11 H     -0.717960530667    1.711459541182    0.319297224057
              12 H      0.647715205216    0.792948246807    0.966863500919
              13 H     -0.957490081468    0.634757067497    1.706833146043
              14 C     -0.209058641582   -1.742185283702    0.413363505858
              15 H      0.876559883433   -1.677729833178    0.551360116328
              16 H     -0.419105726909   -2.600103841344   -0.234775395411
              17 H     -0.652876236988   -1.943187947544    1.396264606144
------------------------ !GEOMETRY! -------------------------
    Number of atoms:    18 
    Geometry Index:     14 
    Coordinates:
               0 C     -2.225528223881   -0.467574236800   -0.550853535336
               1 C     -0.744890631554   -0.431737547624   -0.186270687312
               2 C     -3.065895376573   -1.419101846311   -0.127839792200
               3 C     -2.713298421895    0.653760660070   -1.441519176008
               4 H     -2.131836723356    0.698982987008   -2.373246184436
               5 H     -2.607557662847    1.635136310984   -0.960193817288
               6 H     -3.767737521344    0.524606105695   -1.705314839318
               7 H     -2.748395757281   -2.241959964152    0.505179589915
               8 H     -4.117785586924   -1.405872047915   -0.404278358521
               9 H     -0.194473541054   -0.243672495938   -1.122812365470
              10 C     -0.430829392372    0.747088835014    0.762864646414
              11 H     -0.725654140092    1.711981105443    0.336534535225
              12 H      0.644033769967    0.793342809798    0.975475729363
              13 H     -0.959827547737    0.623533621665    1.715770986339
              14 C     -0.206572934702   -1.741429334017    0.407171297278
              15 H      0.878719413561   -1.674858617284    0.546730155568
              16 H     -0.413631428222   -2.595747392341   -0.246740941603
              17 H     -0.651118293696   -1.949908953294    1.388112757389
------------------------ !GEOMETRY! -------------------------
    Number of atoms:    18 
    Geometry Index:     15 
    Coordinates:
               0 C     -2.225425800890   -0.466273884157   -0.550042959347
               1 C     -0.744874807953   -0.429034792781   -0.185163784659
               2 C     -3.066810108237   -1.414730380000   -0.122214232415
               3 C     -2.711759012110    0.649910285922   -1.447756111617
               4 H     -2.142164605938    0.675933301267   -2.387637264717
               5 H     -2.586726984214    1.635895405072   -0.980772062176
               6 H     -3.771065100183    0.531078701649   -1.696380474771
               7 H     -2.750615204138   -2.235551977130    0.514115852733
               8 H     -4.118680312626   -1.401162170392   -0.398740040841
               9 H     -0.195012046639   -0.235463599177   -1.120889803856
              10 C     -0.433789817990    0.745621454997    0.770099333867
              11 H     -0.732662934852    1.712019914751    0.350020399019
              12 H      0.641129486658    0.794467083999    0.981808796195
              13 H     -0.961446627033    0.614298455602    1.722711412624
              14 C     -0.204288481858   -1.740674321852    0.401985915504
              15 H      0.880172478021   -1.671430088664    0.546541024082
              16 H     -0.405956238583   -2.591263439310   -0.258478689262
              17 H     -0.652303881435   -1.957069949796    1.379562689637
------------------------ !GEOMETRY! -------------------------
    Number of atoms:    18 
    Geometry Index:     16 
    Coordinates:
               0 C     -2.225367428315   -0.465875026178   -0.549644489435
               1 C     -0.744492167562   -0.428016319347   -0.184775682482
               2 C     -3.067452527804   -1.412647499725   -0.119441351429
               3 C     -2.710889551893    0.648293166287   -1.450238270892
               4 H     -2.146055713498    0.666302791263   -2.393149348452
               5 H     -2.578154166932    1.635849582797   -0.988854385053
               6 H     -3.772069795649    0.533931884291   -1.692968691220
               7 H     -2.751901507606   -2.232858817998    0.517975697767
               8 H     -4.119374419176   -1.398551713564   -0.395725539786
               9 H     -0.194959362905   -0.232217200687   -1.120151300269
              10 C     -0.435133884086    0.744953973106    0.772852113799
              11 H     -0.736591522208    1.711569543242    0.355177309951
              12 H      0.639855807058    0.795722808042    0.983819717711
              13 H     -0.961891611882    0.610269507212    1.725482002925
              14 C     -0.203186328950   -1.740419521610    0.399639883243
              15 H      0.880703068194   -1.669891709010    0.547800317531
              16 H     -0.401636719774   -2.589110483829   -0.264209947958
              17 H     -0.653682167011   -1.960734964293    1.375181964052
------------------------ !GEOMETRY! -------------------------
    Number of atoms:    18 
    Geometry Index:     17 
    Coordinates:
               0 C     -2.225369338072   -0.465858051697   -0.549547645620
               1 C     -0.744222545270   -0.427936201224   -0.184765035381
               2 C     -3.067668543550   -1.412219587246   -0.118858395879
               3 C     -2.710615810251    0.648108778596   -1.450547067471
               4 H     -2.146139408349    0.665109385341   -2.393644095244
               5 H     -2.577222534411    1.635748733500   -0.989593514384
               6 H     -3.771965665200    0.534232334538   -1.692844768476
               7 H     -2.752228969896   -2.232432856370    0.518592126622
               8 H     -4.119632603353   -1.397881941981   -0.394947629179
               9 H     -0.194778034127   -0.231877676958   -1.120082879659
              10 C     -0.435361997838    0.744826678644    0.773098487666
              11 H     -0.737984049191    1.711197404048    0.355730187455
              12 H      0.639710175265    0.796551218404    0.983493197368
              13 H     -0.961524101804    0.609508887527    1.725959681603
              14 C     -0.203013833598   -1.740455336478    0.399226481362
              15 H      0.880696375541   -1.669765397965    0.548645271356
              16 H     -0.400634149066   -2.588735254889   -0.265365852120
              17 H     -0.654324966829   -1.961551115791    1.374221449979
