-------------------------------------------------------------
----------------------- !PROPERTIES! ------------------------
-------------------------------------------------------------
# -----------------------------------------------------------
$ PAL_Flags
   description: The PAL Flags
   geom. index: 1
   prop. index: 1
        Diskflag:     2
# -----------------------------------------------------------
$ SCF_Energy
   description: The SCF energy
   geom. index: 1
   prop. index: 1
        SCF Energy:     -650.7967719721
# -----------------------------------------------------------
$ DFT_Energy
   description: The DFT energy
   geom. index: 1
   prop. index: 1
   Number of Alpha Electrons                 51.0000639778 
   Number of Beta  Electrons                 46.0000767868 
   Total number of  Electrons                97.0001407646 
   Exchange energy                          -64.2973033542 
   Correlation energy                        -3.9124715933 
   Correlation energy NL                      0.0000000000 
   Exchange-Correlation energy              -68.2097749475 
   Embedding correction                       0.0000000000 
   Total DFT Energy (No VdW correction)    -650.7967719721 
# -----------------------------------------------------------
$ Mayer_Pop
   description: The Mayer population analysis
   geom. index: 1
   prop. index: 1
     Number of atoms                     : 13
     Threshold for printing              : 0.1000000
     Number of bond orders printed       : 12
  NA   - Mulliken gross atomic population
  ZA   - Total nuclear charge
  QA   - Mulliken gross atomic charge
  VA   - Mayer's total valence
  BVA  - Mayer's bonded valence
  FA   - Mayer's free valence
  ATOM       NA         ZA         QA         VA         BVA        FA
  0   0    16.9928    16.0000    -0.9928     8.4910     5.6663     2.8247
  1   0     6.2033     6.0000    -0.2033     3.7429     3.7101     0.0328
  2   0     6.2035     6.0000    -0.2035     3.7424     3.7096     0.0328
  3   0     6.2030     6.0000    -0.2030     3.7436     3.7109     0.0327
  4   0     6.2034     6.0000    -0.2034     3.7433     3.7106     0.0327
  5   0     7.1312     7.0000    -0.1312     2.8720     2.8623     0.0097
  6   0     7.1313     7.0000    -0.1313     2.8721     2.8625     0.0096
  7   0     7.1314     7.0000    -0.1314     2.8721     2.8625     0.0096
  8   0     7.1310     7.0000    -0.1310     2.8719     2.8622     0.0097
  9   0     6.2032     6.0000    -0.2032     3.7438     3.7111     0.0327
 10   0     7.1309     7.0000    -0.1309     2.8717     2.8619     0.0098
 11   0     6.2036     6.0000    -0.2036     3.7422     3.7094     0.0328
 12   0     7.1315     7.0000    -0.1315     2.8722     2.8626     0.0096
      Bond orders larger than 0.1000000
           Atom A     A.N. of A          Atom B    A.N. of B              Bond order
                0            44               1            6                0.848316
                0            44               2            6                0.848114
                0            44               3            6                0.849098
                0            44               4            6                0.849011
                0            44               9            6                0.849907
                0            44              11            6                0.847887
                1             6               6            7                2.713011
                2             6               7            7                2.712895
                3             6               8            7                2.712498
                4             6               5            7                2.712631
                9             6              10            7                2.712021
               11             6              12            7                2.713072
# -----------------------------------------------------------
$ PAL_Flags
   description: The PAL Flags
   geom. index: 2
   prop. index: 1
        Diskflag:     2
# -----------------------------------------------------------
$ SCF_Energy
   description: The SCF energy
   geom. index: 2
   prop. index: 1
        SCF Energy:     -650.8675109439
# -----------------------------------------------------------
$ DFT_Energy
   description: The DFT energy
   geom. index: 2
   prop. index: 1
   Number of Alpha Electrons                 51.0000638453 
   Number of Beta  Electrons                 46.0000742777 
   Total number of  Electrons                97.0001381231 
   Exchange energy                          -64.1847506505 
   Correlation energy                        -3.8987369035 
   Correlation energy NL                      0.0000000000 
   Exchange-Correlation energy              -68.0834875540 
   Embedding correction                       0.0000000000 
   Total DFT Energy (No VdW correction)    -650.8675109439 
# -----------------------------------------------------------
$ PAL_Flags
   description: The PAL Flags
   geom. index: 3
   prop. index: 1
        Diskflag:     2
# -----------------------------------------------------------
$ SCF_Energy
   description: The SCF energy
   geom. index: 3
   prop. index: 1
        SCF Energy:     -650.9169149773
# -----------------------------------------------------------
$ DFT_Energy
   description: The DFT energy
   geom. index: 3
   prop. index: 1
   Number of Alpha Electrons                 51.0000628446 
   Number of Beta  Electrons                 46.0000705410 
   Total number of  Electrons                97.0001333855 
   Exchange energy                          -64.1227244303 
   Correlation energy                        -3.8882465250 
   Correlation energy NL                      0.0000000000 
   Exchange-Correlation energy              -68.0109709553 
   Embedding correction                       0.0000000000 
   Total DFT Energy (No VdW correction)    -650.9169149773 
# -----------------------------------------------------------
$ PAL_Flags
   description: The PAL Flags
   geom. index: 4
   prop. index: 1
        Diskflag:     2
# -----------------------------------------------------------
$ SCF_Energy
   description: The SCF energy
   geom. index: 4
   prop. index: 1
        SCF Energy:     -650.9502493152
# -----------------------------------------------------------
$ DFT_Energy
   description: The DFT energy
   geom. index: 4
   prop. index: 1
   Number of Alpha Electrons                 51.0000556978 
   Number of Beta  Electrons                 46.0000610325 
   Total number of  Electrons                97.0001167303 
   Exchange energy                          -64.0785216613 
   Correlation energy                        -3.8793167537 
   Correlation energy NL                      0.0000000000 
   Exchange-Correlation energy              -67.9578384150 
   Embedding correction                       0.0000000000 
   Total DFT Energy (No VdW correction)    -650.9502493152 
# -----------------------------------------------------------
$ PAL_Flags
   description: The PAL Flags
   geom. index: 5
   prop. index: 1
        Diskflag:     2
# -----------------------------------------------------------
$ SCF_Energy
   description: The SCF energy
   geom. index: 5
   prop. index: 1
        SCF Energy:     -650.9707935703
# -----------------------------------------------------------
$ DFT_Energy
   description: The DFT energy
   geom. index: 5
   prop. index: 1
   Number of Alpha Electrons                 51.0000444007 
   Number of Beta  Electrons                 46.0000485380 
   Total number of  Electrons                97.0000929387 
   Exchange energy                          -64.0395972257 
   Correlation energy                        -3.8712176353 
   Correlation energy NL                      0.0000000000 
   Exchange-Correlation energy              -67.9108148610 
   Embedding correction                       0.0000000000 
   Total DFT Energy (No VdW correction)    -650.9707935703 
# -----------------------------------------------------------
$ PAL_Flags
   description: The PAL Flags
   geom. index: 6
   prop. index: 1
        Diskflag:     2
# -----------------------------------------------------------
$ SCF_Energy
   description: The SCF energy
   geom. index: 6
   prop. index: 1
        SCF Energy:     -650.9812438930
# -----------------------------------------------------------
$ DFT_Energy
   description: The DFT energy
   geom. index: 6
   prop. index: 1
   Number of Alpha Electrons                 51.0000341042 
   Number of Beta  Electrons                 46.0000373199 
   Total number of  Electrons                97.0000714241 
   Exchange energy                          -64.0024710714 
   Correlation energy                        -3.8637188651 
   Correlation energy NL                      0.0000000000 
   Exchange-Correlation energy              -67.8661899365 
   Embedding correction                       0.0000000000 
   Total DFT Energy (No VdW correction)    -650.9812438930 
# -----------------------------------------------------------
$ PAL_Flags
   description: The PAL Flags
   geom. index: 7
   prop. index: 1
        Diskflag:     2
# -----------------------------------------------------------
$ SCF_Energy
   description: The SCF energy
   geom. index: 7
   prop. index: 1
        SCF Energy:     -650.9837106290
# -----------------------------------------------------------
$ DFT_Energy
   description: The DFT energy
   geom. index: 7
   prop. index: 1
   Number of Alpha Electrons                 51.0000290993 
   Number of Beta  Electrons                 46.0000315960 
   Total number of  Electrons                97.0000606953 
   Exchange energy                          -63.9785278090 
   Correlation energy                        -3.8590289690 
   Correlation energy NL                      0.0000000000 
   Exchange-Correlation energy              -67.8375567780 
   Embedding correction                       0.0000000000 
   Total DFT Energy (No VdW correction)    -650.9837106290 
# -----------------------------------------------------------
$ PAL_Flags
   description: The PAL Flags
   geom. index: 8
   prop. index: 1
        Diskflag:     2
# -----------------------------------------------------------
$ SCF_Energy
   description: The SCF energy
   geom. index: 8
   prop. index: 1
        SCF Energy:     -650.9838529125
# -----------------------------------------------------------
$ DFT_Energy
   description: The DFT energy
   geom. index: 8
   prop. index: 1
   Number of Alpha Electrons                 51.0000278064 
   Number of Beta  Electrons                 46.0000301179 
   Total number of  Electrons                97.0000579243 
   Exchange energy                          -63.9715819948 
   Correlation energy                        -3.8577211788 
   Correlation energy NL                      0.0000000000 
   Exchange-Correlation energy              -67.8293031736 
   Embedding correction                       0.0000000000 
   Total DFT Energy (No VdW correction)    -650.9838529125 
# -----------------------------------------------------------
$ PAL_Flags
   description: The PAL Flags
   geom. index: 9
   prop. index: 1
        Diskflag:     2
# -----------------------------------------------------------
$ SCF_Energy
   description: The SCF energy
   geom. index: 9
   prop. index: 1
        SCF Energy:     -650.9838544752
# -----------------------------------------------------------
$ DFT_Energy
   description: The DFT energy
   geom. index: 9
   prop. index: 1
   Number of Alpha Electrons                 51.0000276429 
   Number of Beta  Electrons                 46.0000299317 
   Total number of  Electrons                97.0000575746 
   Exchange energy                          -63.9706963158 
   Correlation energy                        -3.8575612509 
   Correlation energy NL                      0.0000000000 
   Exchange-Correlation energy              -67.8282575666 
   Embedding correction                       0.0000000000 
   Total DFT Energy (No VdW correction)    -650.9838544752 
# -----------------------------------------------------------
$ Mayer_Pop
   description: The Mayer population analysis
   geom. index: 9
   prop. index: 1
     Number of atoms                     : 13
     Threshold for printing              : 0.1000000
     Number of bond orders printed       : 12
  NA   - Mulliken gross atomic population
  ZA   - Total nuclear charge
  QA   - Mulliken gross atomic charge
  VA   - Mayer's total valence
  BVA  - Mayer's bonded valence
  FA   - Mayer's free valence
  ATOM       NA         ZA         QA         VA         BVA        FA
  0   0    15.8366    16.0000     0.1634     7.7500     4.1762     3.5738
  1   0     6.2882     6.0000    -0.2882     3.5899     3.5699     0.0200
  2   0     6.2885     6.0000    -0.2885     3.5898     3.5699     0.0199
  3   0     6.2882     6.0000    -0.2882     3.5902     3.5703     0.0199
  4   0     6.2884     6.0000    -0.2884     3.5900     3.5701     0.0199
  5   0     7.2388     7.0000    -0.2388     2.9890     2.9884     0.0006
  6   0     7.2390     7.0000    -0.2390     2.9889     2.9883     0.0006
  7   0     7.2389     7.0000    -0.2389     2.9889     2.9883     0.0006
  8   0     7.2388     7.0000    -0.2388     2.9889     2.9883     0.0006
  9   0     6.2884     6.0000    -0.2884     3.5901     3.5702     0.0199
 10   0     7.2388     7.0000    -0.2388     2.9890     2.9884     0.0006
 11   0     6.2885     6.0000    -0.2885     3.5897     3.5698     0.0199
 12   0     7.2389     7.0000    -0.2389     2.9889     2.9883     0.0006
      Bond orders larger than 0.1000000
           Atom A     A.N. of A          Atom B    A.N. of B              Bond order
                0            44               1            6                0.619765
                0            44               2            6                0.619584
                0            44               3            6                0.620027
                0            44               4            6                0.619804
                0            44               9            6                0.619940
                0            44              11            6                0.619538
                1             6               6            7                2.892242
                2             6               7            7                2.892332
                3             6               8            7                2.892229
                4             6               5            7                2.892323
                9             6              10            7                2.892305
               11             6              12            7                2.892340
# -----------------------------------------------------------
$ SCF_Electric_Properties
   description: The SCF Calculated Electric Properties
   geom. index: 9
   prop. index: 1
       Filename                          : opt.scfp 
       Do Dipole Moment Calculation      : true 
       Do Quadrupole Moment Calculation  : false 
       Do Polarizability Calculation     : false 
** Dipole moment part of electric properties **
        Magnitude of dipole moment (Debye) :        0.0036585731
        Electronic Contribution:
                  0    
      0      -0.001629
      1      -0.000494
      2      -0.007034
        Nuclear Contribution:
                  0    
      0       0.001114
      1       0.000026
      2       0.005774
        Total Dipole moment:
                  0    
      0      -0.000515
      1      -0.000468
      2      -0.001260
# -----------------------------------------------------------
$ Hessian
   description: Details about the Hessian
   geom. index: 9
   prop. index: 1
Normal modes:
Number of Rows: 39 Number of Columns: 39
                  0          1          2          3          4          5    
      0       0.000000   0.000000   0.000000   0.000000   0.000000   0.000000
      1       0.000000   0.000000   0.000000   0.000000   0.000000   0.000000
      2       0.000000   0.000000   0.000000   0.000000   0.000000   0.000000
      3       0.000000   0.000000   0.000000   0.000000   0.000000   0.000000
      4       0.000000   0.000000   0.000000   0.000000   0.000000   0.000000
      5       0.000000   0.000000   0.000000   0.000000   0.000000   0.000000
      6       0.000000   0.000000   0.000000   0.000000   0.000000   0.000000
      7       0.000000   0.000000   0.000000   0.000000   0.000000   0.000000
      8       0.000000   0.000000   0.000000   0.000000   0.000000   0.000000
      9       0.000000   0.000000   0.000000   0.000000   0.000000   0.000000
     10       0.000000   0.000000   0.000000   0.000000   0.000000   0.000000
     11       0.000000   0.000000   0.000000   0.000000   0.000000   0.000000
     12       0.000000   0.000000   0.000000   0.000000   0.000000   0.000000
     13       0.000000   0.000000   0.000000   0.000000   0.000000   0.000000
     14       0.000000   0.000000   0.000000   0.000000   0.000000   0.000000
     15       0.000000   0.000000   0.000000   0.000000   0.000000   0.000000
     16       0.000000   0.000000   0.000000   0.000000   0.000000   0.000000
     17       0.000000   0.000000   0.000000   0.000000   0.000000   0.000000
     18       0.000000   0.000000   0.000000   0.000000   0.000000   0.000000
     19       0.000000   0.000000   0.000000   0.000000   0.000000   0.000000
     20       0.000000   0.000000   0.000000   0.000000   0.000000   0.000000
     21       0.000000   0.000000   0.000000   0.000000   0.000000   0.000000
     22       0.000000   0.000000   0.000000   0.000000   0.000000   0.000000
     23       0.000000   0.000000   0.000000   0.000000   0.000000   0.000000
     24       0.000000   0.000000   0.000000   0.000000   0.000000   0.000000
     25       0.000000   0.000000   0.000000   0.000000   0.000000   0.000000
     26       0.000000   0.000000   0.000000   0.000000   0.000000   0.000000
     27       0.000000   0.000000   0.000000   0.000000   0.000000   0.000000
     28       0.000000   0.000000   0.000000   0.000000   0.000000   0.000000
     29       0.000000   0.000000   0.000000   0.000000   0.000000   0.000000
     30       0.000000   0.000000   0.000000   0.000000   0.000000   0.000000
     31       0.000000   0.000000   0.000000   0.000000   0.000000   0.000000
     32       0.000000   0.000000   0.000000   0.000000   0.000000   0.000000
     33       0.000000   0.000000   0.000000   0.000000   0.000000   0.000000
     34       0.000000   0.000000   0.000000   0.000000   0.000000   0.000000
     35       0.000000   0.000000   0.000000   0.000000   0.000000   0.000000
     36       0.000000   0.000000   0.000000   0.000000   0.000000   0.000000
     37       0.000000   0.000000   0.000000   0.000000   0.000000   0.000000
     38       0.000000   0.000000   0.000000   0.000000   0.000000   0.000000
                  6          7          8          9         10         11    
      0      -0.000329  -0.000651  -0.000156  -0.000270   0.000319   0.000538
      1       0.000024  -0.000051   0.000149   0.000727   0.000524  -0.000323
      2       0.000042   0.000377  -0.000442  -0.000075   0.000407   0.001144
      3       0.030698   0.228810   0.148045  -0.146437   0.085666  -0.060710
      4      -0.000495  -0.009074   0.002878   0.007025   0.002227  -0.000530
      5       0.007963  -0.149510   0.229711   0.103166   0.135810  -0.058771
      6      -0.007009   0.009139  -0.015764  -0.005130   0.007632   0.010092
      7      -0.272260   0.024120   0.017388  -0.153984   0.077564  -0.051955
      8      -0.002878   0.132099  -0.238155  -0.013663   0.079197   0.160106
      9       0.030909   0.228930   0.148113   0.146966  -0.086133   0.059966
     10      -0.000399  -0.009237   0.003020  -0.005533  -0.001195  -0.000195
     11       0.008125  -0.149520   0.229690  -0.103131  -0.136466   0.057177
     12      -0.007200   0.009359  -0.015835   0.004588  -0.007166  -0.009232
     13      -0.272019   0.024329   0.017493   0.153111  -0.078374   0.052388
     14      -0.002891   0.132203  -0.238482   0.013806  -0.079753  -0.161563
     15      -0.010429   0.014394  -0.024217   0.011378  -0.018473  -0.024865
     16      -0.415642   0.037470   0.026193   0.396399  -0.203674   0.135834
     17      -0.004669   0.202151  -0.364703   0.036211  -0.206307  -0.418407
     18       0.046866   0.349951   0.225916  -0.378616   0.220982  -0.157248
     19      -0.000707  -0.013766   0.004583   0.016343   0.005305  -0.001099
     20       0.012474  -0.228801   0.350767   0.266954   0.350466  -0.152577
     21      -0.010542   0.014239  -0.024188  -0.012476   0.019151   0.025473
     22      -0.415846   0.037473   0.026203  -0.399475   0.200938  -0.134254
     23      -0.004638   0.201963  -0.364264  -0.035691   0.204600   0.413329
     24       0.047151   0.350032   0.225966   0.379909  -0.222363   0.154635
     25      -0.000627  -0.013881   0.004541  -0.014750  -0.003961   0.000147
     26       0.012550  -0.228828   0.350804  -0.266706  -0.352654   0.146998
     27      -0.023656  -0.237228  -0.131985   0.016213  -0.084635  -0.158250
     28       0.272703  -0.015188  -0.020221  -0.093736  -0.139557   0.065836
     29      -0.005123   0.016792   0.009389   0.001205   0.009894   0.010433
     30      -0.035393  -0.362686  -0.201773   0.041681  -0.219223  -0.409461
     31       0.416387  -0.023323  -0.031536  -0.243162  -0.362125   0.170485
     32      -0.008037   0.025777   0.014564   0.003309   0.025093   0.025283
     33      -0.023637  -0.237305  -0.131560  -0.015805   0.084280   0.157899
     34       0.272543  -0.015218  -0.020115   0.092776   0.138943  -0.065353
     35      -0.005114   0.017020   0.009517  -0.001382  -0.008985  -0.007981
     36      -0.035370  -0.362692  -0.201447  -0.040271   0.217930   0.407789
     37       0.416201  -0.023375  -0.031437   0.239694   0.360070  -0.168945
     38      -0.008052   0.025805   0.014591  -0.003535  -0.023879  -0.022366
                 12         13         14         15         16         17    
      0      -0.024173   0.147075   0.116693  -0.000005   0.000582   0.001044
      1      -0.183827   0.005313  -0.044853  -0.000647  -0.000307   0.000046
      2      -0.038110  -0.119060   0.142141   0.000543  -0.000869  -0.000074
      3       0.007829  -0.089249  -0.073099   0.008317   0.000430  -0.415744
      4      -0.196284   0.016588  -0.050003   0.404832  -0.024302   0.012427
      5       0.032952   0.071705  -0.084469  -0.012525   0.000136   0.125874
      6      -0.013968   0.170165   0.109785  -0.222588  -0.337790   0.007262
      7       0.112848  -0.010075   0.022817   0.006340   0.008346   0.423447
      8       0.025132   0.055983  -0.101073   0.015728   0.023651  -0.013510
      9       0.008330  -0.088764  -0.072956  -0.008771   0.000825   0.412428
     10      -0.196389   0.016697  -0.050098  -0.402870   0.024888  -0.012708
     11       0.031003   0.071759  -0.085262   0.009657   0.000129  -0.125343
     12      -0.013865   0.170233   0.109993   0.222822   0.335951  -0.010064
     13       0.113462  -0.009598   0.023097  -0.003909  -0.005946  -0.420941
     14       0.024636   0.055327  -0.098043  -0.014344  -0.022106   0.013441
     15      -0.002825   0.182794   0.095155   0.226420   0.341452   0.002851
     16       0.421162  -0.024426   0.093683  -0.006245  -0.009138   0.242373
     17       0.090047   0.236268  -0.345207  -0.016111  -0.023709  -0.007577
     18       0.040932  -0.333760  -0.268811   0.009409  -0.001126   0.239822
     19      -0.195667   0.027123  -0.052522   0.411704  -0.024642  -0.006626
     20       0.106215   0.268944  -0.317997  -0.010110   0.001371  -0.072538
     21      -0.002210   0.182840   0.094593  -0.226436  -0.343556  -0.007177
     22       0.419481  -0.025965   0.092696   0.004984   0.008057  -0.243670
     23       0.091334   0.237946  -0.353325   0.014984   0.023178   0.008029
     24       0.042205  -0.332266  -0.268259  -0.009183   0.000065  -0.238057
     25      -0.195984   0.027070  -0.052281  -0.409590   0.025289   0.006242
     26       0.100918   0.269082  -0.320146   0.011628  -0.001305   0.072268
     27       0.009325  -0.103494  -0.052954   0.012435  -0.026290   0.000174
     28       0.109781  -0.007099   0.033445   0.003841  -0.010163   0.095979
     29      -0.051085  -0.109690   0.162950   0.179504  -0.359689  -0.003532
     30       0.044269  -0.362359  -0.228250   0.012626  -0.024373  -0.000462
     31       0.412588  -0.020595   0.114033   0.005467  -0.008487  -0.055376
     32      -0.061575  -0.091655   0.173684   0.182479  -0.365951   0.000428
     33       0.009794  -0.102919  -0.055865  -0.012047   0.023331   0.001596
     34       0.111631  -0.007222   0.034344  -0.004506   0.009164  -0.098032
     35      -0.051183  -0.109536   0.163191  -0.181127   0.362658   0.003445
     36       0.045668  -0.360741  -0.236353  -0.012941   0.026374  -0.000780
     37       0.417652  -0.020938   0.116372  -0.004852   0.009432   0.056580
     38      -0.061776  -0.091968   0.173968  -0.184125   0.368591  -0.000399
                 18         19         20         21         22         23    
      0       0.000234  -0.000235  -0.000364  -0.005617   0.001481   0.006486
      1      -0.000649   0.000012  -0.000115   0.000972  -0.001179   0.274696
      2      -0.000021   0.000951   0.001855   0.002336   0.004739   0.017786
      3      -0.126023  -0.001927  -0.078395   0.402859  -0.156939  -0.011537
      4      -0.006809  -0.000480   0.000122  -0.013999  -0.006459  -0.420792
      5      -0.414467  -0.014685  -0.019103  -0.163485  -0.408284  -0.008470
      6       0.004470  -0.029184   0.012565   0.020593   0.025586  -0.005256
      7       0.097617  -0.009951   0.427749   0.070357  -0.036287  -0.201321
      8       0.012988  -0.432751   0.011841   0.129485   0.408820  -0.011063
      9       0.125209   0.001869  -0.081365   0.405669  -0.157743  -0.011281
     10       0.008517   0.000547   0.002753  -0.014314  -0.004238  -0.423456
     11       0.412955   0.015408  -0.018505  -0.163912  -0.409262  -0.006303
     12      -0.005074   0.029872   0.011061   0.017644   0.024690  -0.002520
     13      -0.097548   0.009843   0.429639   0.068724  -0.035714  -0.202019
     14      -0.011808   0.430892   0.011971   0.130512   0.410882  -0.011776
     15      -0.000513  -0.016580  -0.004744   0.001623  -0.017729   0.004655
     16       0.056152  -0.005507  -0.241277  -0.038650   0.020334   0.075836
     17       0.006873  -0.248386  -0.006787  -0.074190  -0.230743   0.003940
     18       0.072882   0.001090   0.044055  -0.225335   0.088097  -0.008101
     19       0.007007   0.000088  -0.001620   0.006007   0.005938  -0.432047
     20       0.239102   0.008464   0.010795   0.091366   0.228413   0.019553
     21      -0.000565   0.017888  -0.004558   0.004315  -0.016818   0.002370
     22      -0.056030   0.005526  -0.240112  -0.039736   0.020634   0.075608
     23      -0.007471   0.249284  -0.006805  -0.073861  -0.229756   0.003823
     24      -0.072371  -0.001016   0.045904  -0.226888   0.088601  -0.008481
     25      -0.004314  -0.000027   0.000837   0.005751   0.007312  -0.434885
     26      -0.238374  -0.009067   0.010282   0.091649   0.229030   0.018141
     27       0.005803  -0.431988   0.067348  -0.404790   0.127479  -0.002080
     28      -0.422074  -0.005034  -0.430462  -0.057817   0.043968  -0.203156
     29       0.009748   0.028539   0.003741   0.027246  -0.017907  -0.033812
     30      -0.003567   0.248788  -0.038306   0.227511  -0.072437  -0.003716
     31       0.242881   0.002669   0.241635   0.031949  -0.024932   0.075041
     32      -0.006893  -0.019299  -0.006418  -0.019364  -0.002348  -0.042031
     33      -0.005398   0.432301   0.067224  -0.404481   0.127760  -0.002328
     34       0.422964   0.005011  -0.429268  -0.058152   0.042379  -0.198973
     35      -0.009649  -0.031293   0.002421   0.025634  -0.016431  -0.033607
     36       0.003312  -0.249283  -0.038389   0.227152  -0.072537  -0.003509
     37      -0.243299  -0.002783   0.240913   0.032123  -0.023908   0.072960
     38       0.007115   0.015478  -0.007904  -0.020003  -0.001192  -0.041702
                 24         25         26         27         28         29    
      0       0.275200  -0.005036  -0.000295   0.005035   0.003388  -0.000031
      1      -0.006072   0.017890  -0.007316   0.000450  -0.000999  -0.000004
      2      -0.005394  -0.274705  -0.001229  -0.003411   0.004873   0.000066
      3      -0.180350   0.002932   0.027744   0.340720   0.240810   0.009107
      4       0.004475  -0.032916   0.199253  -0.040377   0.022330   0.284187
      5       0.001768   0.184202  -0.067817  -0.233790   0.339589  -0.003115
      6      -0.422887  -0.005444  -0.024572  -0.184834  -0.081493   0.283855
      7       0.010048  -0.007499  -0.413623   0.055375  -0.028357  -0.004727
      8       0.020079   0.209288  -0.051392  -0.201804   0.364576  -0.017030
      9      -0.186679   0.002575   0.028256   0.339948   0.240537  -0.006942
     10       0.004217  -0.035827   0.196895  -0.039524   0.025031  -0.285526
     11       0.002191   0.184802  -0.068394  -0.233745   0.339627   0.007347
     12      -0.425296  -0.006966  -0.026219  -0.184199  -0.078451  -0.284689
     13       0.014133  -0.007148  -0.413392   0.055974  -0.028058   0.009759
     14       0.020686   0.215156  -0.051208  -0.201443   0.364185   0.020404
     15      -0.436736  -0.027463  -0.008632  -0.169434  -0.114837  -0.292118
     16       0.007639   0.002564   0.179115  -0.018492   0.015653   0.005131
     17       0.032660  -0.080872   0.023494   0.103960  -0.147141   0.019458
     18       0.064979  -0.002270  -0.005629  -0.148143  -0.103619   0.004954
     19      -0.000675  -0.040724   0.207522  -0.021694   0.016608   0.291309
     20      -0.000305  -0.065484   0.021553   0.102089  -0.147618  -0.009592
     21      -0.434065  -0.025435  -0.005641  -0.169995  -0.118132   0.290759
     22       0.010421   0.002721   0.179165  -0.017936   0.016058  -0.007629
     23       0.032825  -0.078064   0.023331   0.104307  -0.146956  -0.020786
     24       0.068206  -0.002187  -0.005776  -0.147819  -0.103394  -0.005956
     25      -0.001261  -0.043416   0.205059  -0.021061   0.020117  -0.292794
     26      -0.000501  -0.065666   0.022104   0.101999  -0.147716   0.007658
     27      -0.214521   0.016670   0.020221   0.365637   0.205220  -0.018148
     28      -0.000193  -0.010506  -0.412390   0.048520  -0.048290  -0.005405
     29      -0.004708   0.425334   0.038737   0.075410  -0.182916  -0.285440
     30       0.080648   0.035425  -0.005860  -0.147662  -0.105691  -0.021037
     31      -0.000019   0.019688   0.179369  -0.017056   0.014649  -0.008218
     32      -0.025910   0.435325   0.025936   0.115592  -0.167131  -0.292446
     33      -0.212649   0.020026   0.020591   0.366376   0.204050   0.022458
     34      -0.000300  -0.010508  -0.412863   0.048393  -0.048070   0.007271
     35      -0.007300   0.420728   0.041356   0.074959  -0.185327   0.283181
     36       0.079553   0.032719  -0.005797  -0.148209  -0.105323   0.018785
     37      -0.000055   0.019602   0.179685  -0.017074   0.014516   0.007462
     38      -0.027904   0.431068   0.028549   0.114422  -0.170174   0.290648
                 30         31         32         33         34         35    
      0       0.000228   0.000097  -0.000103  -0.000003  -0.000007  -0.000027
      1       0.000018  -0.000116  -0.000158   0.000013   0.000002  -0.002114
      2       0.000173  -0.000095   0.000037  -0.000008   0.000015   0.000000
      3      -0.192801  -0.285588   0.327348  -0.009291   0.000476   0.011204
      4       0.004608   0.015335   0.001601  -0.446838   0.023093   0.538371
      5       0.007025   0.355290   0.314616   0.012235  -0.000630  -0.014758
      6      -0.033712   0.002126  -0.003407   0.237799   0.372288  -0.003197
      7      -0.202559  -0.305361   0.300431  -0.005649  -0.008853  -0.000630
      8      -0.428427   0.140319  -0.147508  -0.016280  -0.025479   0.000219
      9       0.192286   0.284941  -0.326722   0.009318  -0.000521   0.011520
     10      -0.004768  -0.014944  -0.000703   0.439295  -0.024515   0.542558
     11      -0.006737  -0.355553  -0.314828  -0.011499   0.000651  -0.014211
     12       0.032591  -0.002760   0.004041  -0.236836  -0.366932  -0.009515
     13       0.202886   0.305863  -0.301049   0.005148   0.007970  -0.000500
     14       0.426937  -0.139615   0.147176   0.016083   0.024928   0.000646
     15      -0.011901   0.001034  -0.000564   0.199746   0.309429   0.007998
     16      -0.067197  -0.101310   0.099702  -0.004327  -0.006703  -0.000045
     17      -0.141512   0.046329  -0.048922  -0.013564  -0.021013  -0.000543
     18       0.063855   0.094601  -0.108535   0.007823  -0.000405  -0.009412
     19      -0.000972  -0.005532  -0.000823   0.376802  -0.019470  -0.453105
     20      -0.002375  -0.117724  -0.104352  -0.010328   0.000531   0.012426
     21       0.011757  -0.001006   0.000525  -0.200555  -0.313946   0.002685
     22       0.067083   0.101150  -0.099453   0.004767   0.007464   0.000064
     23       0.142000  -0.046547   0.048998   0.013731   0.021491  -0.000184
     24      -0.063737  -0.094434   0.108392  -0.007850   0.000440  -0.009682
     25       0.000881   0.005499   0.001058  -0.370444   0.020672  -0.456640
     26       0.002241   0.117852   0.104417   0.009690  -0.000540   0.011948
     27       0.432651  -0.139015   0.131951  -0.013604   0.027072   0.000812
     28      -0.004194  -0.331307  -0.338567  -0.005055   0.010066  -0.000401
     29      -0.030537   0.018525  -0.000138  -0.194596   0.387356   0.011731
     30      -0.143559   0.046052  -0.043757   0.011477  -0.022841  -0.000688
     31       0.001383   0.109759   0.112175   0.004267  -0.008495  -0.000128
     32       0.009586  -0.005870   0.000437   0.164123  -0.326659  -0.009863
     33      -0.432913   0.139408  -0.132310   0.013641  -0.027096   0.001025
     34       0.004071   0.331706   0.339278   0.005198  -0.010308  -0.000314
     35       0.029776  -0.018197   0.000022   0.199457  -0.396104   0.015099
     36       0.143568  -0.046185   0.043910  -0.011503   0.022842  -0.000866
     37      -0.001347  -0.109837  -0.112369  -0.004381   0.008699  -0.000203
     38      -0.009503   0.005990  -0.000277  -0.168223   0.334036  -0.012693
                 36         37         38    
      0       0.002116   0.000007  -0.000003
      1      -0.000027  -0.000001  -0.000006
      2       0.000007  -0.002117  -0.000009
      3       0.000575  -0.000211  -0.006403
      4      -0.006406  -0.010229  -0.307689
      5       0.000177  -0.000426   0.008412
      6      -0.536869  -0.035127  -0.312845
      7       0.012780   0.000836   0.007437
      8       0.036799   0.001707   0.021409
      9       0.000613  -0.000369   0.006596
     10      -0.004387  -0.017496   0.310836
     11       0.000117  -0.000249  -0.008132
     12      -0.539495  -0.041983   0.314576
     13       0.011730   0.000913  -0.006844
     14       0.036692   0.002157  -0.021370
     15       0.454061   0.035298  -0.263091
     16      -0.009838  -0.000765   0.005702
     17      -0.030843  -0.002271   0.017867
     18      -0.000015   0.000178   0.005345
     19       0.005381   0.008598   0.257282
     20      -0.000148  -0.000108  -0.007052
     21       0.451845   0.029537   0.261634
     22      -0.010746  -0.000703  -0.006221
     23      -0.030942  -0.001896  -0.017910
     24      -0.000049   0.000311  -0.005511
     25       0.003685   0.014705  -0.259930
     26      -0.000097  -0.000257   0.006801
     27      -0.001862   0.037842   0.022162
     28      -0.000960   0.014063   0.008232
     29      -0.036605   0.540680   0.317175
     30       0.002026  -0.031829  -0.018548
     31       0.000802  -0.011835  -0.006897
     32       0.030779  -0.455059  -0.265276
     33      -0.002096   0.036655  -0.021350
     34      -0.001071   0.013942  -0.008116
     35      -0.040816   0.535204  -0.312105
     36       0.002221  -0.030808   0.017849
     37       0.000895  -0.011732   0.006796
     38       0.034319  -0.450439   0.261015
# -----------------------------------------------------------
$ THERMOCHEMISTRY_Energies
   description: The Thermochemistry energies
   geom. index: 9
   prop. index: 1
        Temperature (Kelvin)           :        298.1500000000
        Pressure (atm)                 :          1.0000000000
        Total Mass (AMU)               :        257.1780000000
        Spin Degeneracy                :          6.0000000000
        Electronic Energy (Hartree)    :       -650.9838544752
        Translational Energy (Hartree) :          0.0014162714
        Rotational Energy (Hartree)    :          0.0014162714
        Vibrational Energy (Hartree)   :          0.0169213230
        Number of frequencies          :     39      
        Scaling Factor for frequencies :          1.0000000000
        Vibrational frequencies        :     
                  0    
      0       0.000000
      1       0.000000
      2       0.000000
      3       0.000000
      4       0.000000
      5       0.000000
      6      28.876154
      7      29.336361
      8      29.453459
      9      71.200488
     10      71.264438
     11      71.371924
     12      72.222969
     13      72.317356
     14      72.399208
     15     173.967639
     16     174.080471
     17     196.153301
     18     196.215675
     19     197.088443
     20     200.315194
     21     200.573234
     22     200.613132
     23     207.743887
     24     207.914787
     25     207.977622
     26     238.080244
     27     238.241291
     28     238.306042
     29     264.498705
     30     280.276563
     31     280.326567
     32     280.375169
     33     2199.979546
     34     2200.033138
     35     2201.676165
     36     2201.737492
     37     2201.748352
     38     2203.448258
        Zero Point Energy (Hartree)    :          0.0403459233
        Inner Energy (Hartree)         :       -650.9237546860
        Enthalpy (Hartree)             :       -650.9228104770
        Electronic entropy             :          0.0016917452
        Rotational entropy             :          0.0152861074
        Vibrational entropy            :          0.0323595916
        Translational entropy          :          0.0152861074
        Entropy                        :          0.0695464938
        Gibbs Energy (Hartree)         :       -650.9923569708
        Is Linear                      :                 false
# -------------------------------------------------------------
----------------------- !GEOMETRIES! ------------------------
# -------------------------------------------------------------
------------------------ !GEOMETRY! -------------------------
    Number of atoms:    13 
    Geometry Index:     1 
    Coordinates:
               0 Ru    -2.530382325809    1.635128614657   -0.011359845684
               1 C     -2.485824725903    3.658773037355   -0.063333185907
               2 C     -0.511028302481    1.586765682807   -0.149524310526
               3 C     -2.574568301784   -0.387718309002    0.040413314368
               4 C     -4.549288763038    1.682274890952    0.126600089147
               5 N     -5.712379292702    1.707051528069    0.206883450045
               6 N     -2.460823371167    4.824178047316   -0.095554249443
               7 N      0.651916070828    1.558283369525   -0.230501291180
               8 N     -2.599144706271   -1.553132432017    0.071467888615
               9 C     -2.667900067761    1.585910062334   -2.029390292603
              10 N     -2.749041967681    1.553648631080   -3.192233926633
              11 C     -2.391637833942    1.683146769786    2.008257118205
              12 N     -2.311366412289    1.713220107138    3.171255241596
------------------------ !GEOMETRY! -------------------------
    Number of atoms:    13 
    Geometry Index:     2 
    Coordinates:
               0 Ru    -2.530420424274    1.635064331851   -0.011450152165
               1 C     -2.484423884912    3.722648984329   -0.064865724664
               2 C     -0.447230421760    1.585364718292   -0.153747338193
               3 C     -2.576071435875   -0.451662913023    0.042067809351
               4 C     -4.613084183778    1.683878223036    0.130882219407
               5 N     -5.786627086903    1.708880281422    0.211932880734
               6 N     -2.459304461733    4.898547011235   -0.097358197354
               7 N      0.726167458322    1.556707187685   -0.235596297109
               8 N     -2.600863514753   -1.627576677668    0.073559343850
               9 C     -2.672219829219    1.584464313879   -2.093266085152
              10 N     -2.754142875445    1.551571897528   -3.266557357094
              11 C     -2.387144536409    1.684616082161    2.071977381277
              12 N     -2.306104803259    1.715026559272    3.245401517113
------------------------ !GEOMETRY! -------------------------
    Number of atoms:    13 
    Geometry Index:     3 
    Coordinates:
               0 Ru    -2.530425968301    1.634971788473   -0.011513779703
               1 C     -2.482972756766    3.787285513081   -0.066466564961
               2 C     -0.382597248895    1.583914056323   -0.158050347200
               3 C     -2.577557085109   -0.516529472191    0.043824905195
               4 C     -4.677713683335    1.685478020006    0.135313864600
               5 N     -5.852150612283    1.710530692550    0.216349498429
               6 N     -2.457973353463    4.964079862634   -0.098939250897
               7 N      0.791698586321    1.555348190633   -0.239914285728
               8 N     -2.602369821358   -1.693347505900    0.075378964896
               9 C     -2.676688837324    1.582923153325   -2.158053027275
              10 N     -2.758714657894    1.549966578992   -3.332229575939
              11 C     -2.382529977402    1.686199839863    2.136488045145
              12 N     -2.301474584191    1.716709282211    3.310791553438
------------------------ !GEOMETRY! -------------------------
    Number of atoms:    13 
    Geometry Index:     4 
    Coordinates:
               0 Ru    -2.530403952305    1.634856207009   -0.011553651347
               1 C     -2.481521184995    3.851857972648   -0.068101247514
               2 C     -0.317966756691    1.582433316788   -0.162383730144
               3 C     -2.579016741935   -0.581412428412    0.045622296261
               4 C     -4.742312340873    1.687072906873    0.139785454316
               5 N     -5.915106570603    1.712144841155    0.220528739425
               6 N     -2.456719736711    5.027001365749   -0.100473858353
               7 N      0.854694791029    1.554037217522   -0.243949429545
               8 N     -2.603802092652   -1.756578714338    0.077070454720
               9 C     -2.681228115785    1.581302585885   -2.222830519410
              10 N     -2.763177495530    1.548587387822   -3.395352050882
              11 C     -2.377867100079    1.687842325713    2.200980442152
              12 N     -2.297042702870    1.718385015583    3.373637100321
------------------------ !GEOMETRY! -------------------------
    Number of atoms:    13 
    Geometry Index:     5 
    Coordinates:
               0 Ru    -2.530356344747    1.634719580274   -0.011569315005
               1 C     -2.480079760395    3.916408542746   -0.069771959754
               2 C     -0.253320792374    1.580928576468   -0.166741687353
               3 C     -2.580458612639   -0.646327335155    0.047450228695
               4 C     -4.806889800543    1.688664655810    0.144274000962
               5 N     -5.978116582552    1.713778059655    0.224647595072
               6 N     -2.455483023997    5.089971166468   -0.102045084020
               7 N      0.917782957084    1.552714379634   -0.247910485402
               8 N     -2.605226540151   -1.819909407838    0.078713916430
               9 C     -2.685829541664    1.579613451738   -2.287588910319
              10 N     -2.767707353109    1.547345683974   -3.458532515340
              11 C     -2.373166425214    1.689526979101    2.265483621977
              12 N     -2.292618179699    1.720095667127    3.436570594056
------------------------ !GEOMETRY! -------------------------
    Number of atoms:    13 
    Geometry Index:     6 
    Coordinates:
               0 Ru    -2.530280770871    1.634565212199   -0.011554819679
               1 C     -2.478648683070    3.980963041372   -0.071496693128
               2 C     -0.188646477978    1.579405472413   -0.171126157015
               3 C     -2.581889911315   -0.711286524061    0.049318987005
               4 C     -4.871451118921    1.690246353820    0.148771184446
               5 N     -6.041827823189    1.715433907541    0.228739736206
               6 N     -2.454238660127    5.153656618653   -0.103694914644
               7 N      0.981616918683    1.551373845762   -0.251848084814
               8 N     -2.606668787609   -1.883999083767    0.080341015386
               9 C     -2.690499150953    1.577859760197   -2.352323724196
              10 N     -2.772352267451    1.546241631397   -3.522410137319
              11 C     -2.368429198059    1.691241290338    2.330016425584
              12 N     -2.288154069138    1.721828474134    3.500247182167
------------------------ !GEOMETRY! -------------------------
    Number of atoms:    13 
    Geometry Index:     7 
    Coordinates:
               0 Ru    -2.530208023891    1.634453068389   -0.011516108644
               1 C     -2.477706348008    4.023937161748   -0.072707093167
               2 C     -0.145578465603    1.578380647317   -0.174066349546
               3 C     -2.582835780508   -0.754555376791    0.050609490658
               4 C     -4.914410186776    1.691281550617    0.151766107327
               5 N     -6.084624044882    1.716542478368    0.231428304767
               6 N     -2.453392748345    5.196451101449   -0.104873996900
               7 N      1.024529853649    1.550479288470   -0.254437440312
               8 N     -2.607644033135   -1.927090974178    0.081426400321
               9 C     -2.693666633438    1.576642212048   -2.395389947408
              10 N     -2.775523748447    1.545647934955   -3.565311234253
              11 C     -2.365252012140    1.692394422356    2.372995519040
              12 N     -2.285157828476    1.722966485252    3.543056348117
------------------------ !GEOMETRY! -------------------------
    Number of atoms:    13 
    Geometry Index:     8 
    Coordinates:
               0 Ru    -2.530171264747    1.634417255161   -0.011480908445
               1 C     -2.477445731082    4.036180736689   -0.073108768005
               2 C     -0.133304120273    1.578078857576   -0.174923779349
               3 C     -2.583097727387   -0.766899445038    0.051021172048
               4 C     -4.926632224888    1.691559133289    0.152622381508
               5 N     -6.096908192378    1.716857682328    0.232155167803
               6 N     -2.453136655645    5.208748573433   -0.105273928277
               7 N      1.036870175929    1.550229292619   -0.255133714062
               8 N     -2.607926585616   -1.939491371457    0.081739476388
               9 C     -2.694615648665    1.576252499537   -2.407636462163
              10 N     -2.776470874804    1.545607067981   -3.577621766674
              11 C     -2.364331511406    1.692728752960    2.385250804945
              12 N     -2.284299639037    1.723260964923    3.555370324282
------------------------ !GEOMETRY! -------------------------
    Number of atoms:    13 
    Geometry Index:     9 
    Coordinates:
               0 Ru    -2.530153633215    1.634409948147   -0.011455962522
               1 C     -2.477420720022    4.037664064138   -0.073209021634
               2 C     -0.131815725113    1.578033506919   -0.175046952391
               3 C     -2.583121747611   -0.768410152968    0.051112427684
               4 C     -4.928098276449    1.691577305031    0.152730415443
               5 N     -6.098396391337    1.716895312455    0.232204115695
               6 N     -2.453092067586    5.210249910540   -0.105374984294
               7 N      1.038383391477    1.550207099063   -0.255173769494
               8 N     -2.607961545965   -1.941021883994    0.081780066599
               9 C     -2.694772855502    1.576163810409   -2.409100807815
              10 N     -2.776616453360    1.545720157654   -3.579110853256
              11 C     -2.364206447880    1.692775236208    2.386742334012
              12 N     -2.284197527436    1.723265686398    3.556882991974
