5
Coordinates from ORCA-job optfreq
  C   -2.71974152712645      2.17721632234960     -0.05329284154617
  F   -1.36926656029283      2.16319121903129     -0.03572124635570
  F   -3.15504607253455      2.89427593342448      1.00529681960617
  F   -3.16418546121763      0.90832013471312      0.07547296156704
  H   -3.08616037882853      2.61816639048151     -0.99174569327134
