13
Coordinates from ORCA-job opt
  Fe  -2.53060583211729      1.63458049036872     -0.01157611568408
  C   -2.51312903964713      3.64146878998428     -0.03669982206426
  C   -0.52784247197197      1.56403896316473     -0.11931888162484
  C   -2.54840605278312     -0.37225608486779      0.01343982968895
  C   -4.53329322967528      1.70597797823211      0.09658536758389
  N   -5.70293383815649      1.74262103569872      0.16861101403348
  N   -2.49426159285896      4.81356455950695     -0.05775283936450
  N   0.64220596708407      1.53299908484253     -0.18720277184473
  N   -2.56770685446554     -1.54435633708793      0.03376767613392
  C   -2.69389827643892      1.55840247591942     -2.01035949484730
  N   -2.77912245706504      1.51786730121553     -3.17897731166946
  C   -2.36659623820495      1.70974249406744      1.98701310090427
  N   -2.27588008369936      1.74287924895526      3.15545024875466
