5
Coordinates from ORCA-job optfreq
  C   -2.71971191004349      2.17756639324537     -0.05326711031152
  F   -1.38946244287577      2.16290911574772     -0.03200167123853
  F   -3.14570605071847      2.88116947622390      0.99198423326485
  F   -3.15677749581112      0.92690479360392      0.07600980831431
  H   -3.08274210055116      2.61262022117908     -0.98271526002911
