! opt freq rks b3lyp 6-31G*
%maxcore 4000
%pal
  nprocs 4
end
*xyz 1 1
   C       -2.25526       -0.51442       -0.35807
   C       -0.76043       -0.53561       -0.07847
   C       -2.93237       -1.81485       -0.70121
   C       -2.88376        0.69948       -0.98414
   H       -2.54431        0.80990       -2.01869
   H       -2.64454        1.61196       -0.43061
   H       -3.97414        0.61464       -0.99064
   H       -2.58778       -2.17017       -1.67762
   H       -4.01784       -1.69682       -0.74097
   H       -2.73080       -2.58884        0.04482
   H       -0.26358       -0.79562       -1.02390
   C       -0.17527        0.80353        0.39150
   H       -0.42005        1.62971       -0.28278
   H        0.91772        0.74229        0.43153
   H       -0.52918        1.06250        1.39672
   C       -0.37575       -1.59229        0.96655
   H        0.70910       -1.61807        1.10766
   H       -0.67805       -2.60079        0.66992
   H       -0.83649       -1.37032        1.93723
*