
                                 *****************
                                 * O   R   C   A *
                                 *****************

                                            #,                                       
                                            ###                                      
                                            ####                                     
                                            #####                                    
                                            ######                                   
                                           ########,                                 
                                     ,,################,,,,,                         
                               ,,#################################,,                 
                          ,,##########################################,,             
                       ,#########################################, ''#####,          
                    ,#############################################,,   '####,        
                  ,##################################################,,,,####,       
                ,###########''''           ''''###############################       
              ,#####''   ,,,,##########,,,,          '''####'''          '####       
            ,##' ,,,,###########################,,,                        '##       
           ' ,,###''''                  '''############,,,                           
         ,,##''                                '''############,,,,        ,,,,,,###''
      ,#''                                            '''#######################'''  
     '                                                          ''''####''''         
             ,#######,   #######,   ,#######,      ##                                
            ,#'     '#,  ##    ##  ,#'     '#,    #''#        ######   ,####,        
            ##       ##  ##   ,#'  ##            #'  '#       #        #'  '#        
            ##       ##  #######   ##           ,######,      #####,   #    #        
            '#,     ,#'  ##    ##  '#,     ,#' ,#      #,         ##   #,  ,#        
             '#######'   ##     ##  '#######'  #'      '#     #####' # '####'        



                  #######################################################
                  #                        -***-                        #
                  #          Department of theory and spectroscopy      #
                  #    Directorship and core code : Frank Neese         #
                  #        Max Planck Institute fuer Kohlenforschung    #
                  #                Kaiser Wilhelm Platz 1               #
                  #                 D-45470 Muelheim/Ruhr               #
                  #                      Germany                        #
                  #                                                     #
                  #                  All rights reserved                #
                  #                        -***-                        #
                  #######################################################


                         Program Version 5.0.4 -  RELEASE  -


 With contributions from (in alphabetic order):
   Daniel Aravena         : Magnetic Suceptibility
   Michael Atanasov       : Ab Initio Ligand Field Theory (pilot matlab implementation)
   Alexander A. Auer      : GIAO ZORA, VPT2 properties, NMR spectrum
   Ute Becker             : Parallelization
   Giovanni Bistoni       : ED, misc. LED, open-shell LED, HFLD
   Martin Brehm           : Molecular dynamics
   Dmytro Bykov           : SCF Hessian
   Vijay G. Chilkuri      : MRCI spin determinant printing, contributions to CSF-ICE
   Dipayan Datta          : RHF DLPNO-CCSD density
   Achintya Kumar Dutta   : EOM-CC, STEOM-CC
   Dmitry Ganyushin       : Spin-Orbit,Spin-Spin,Magnetic field MRCI
   Miquel Garcia          : C-PCM and meta-GGA Hessian, CC/C-PCM, Gaussian charge scheme
   Yang Guo               : DLPNO-NEVPT2, F12-NEVPT2, CIM, IAO-localization
   Andreas Hansen         : Spin unrestricted coupled pair/coupled cluster methods
   Benjamin Helmich-Paris : MC-RPA, TRAH-SCF, COSX integrals
   Lee Huntington         : MR-EOM, pCC
   Robert Izsak           : Overlap fitted RIJCOSX, COSX-SCS-MP3, EOM
   Marcus Kettner         : VPT2
   Christian Kollmar      : KDIIS, OOCD, Brueckner-CCSD(T), CCSD density, CASPT2, CASPT2-K
   Simone Kossmann        : Meta GGA functionals, TD-DFT gradient, OOMP2, MP2 Hessian
   Martin Krupicka        : Initial AUTO-CI
   Lucas Lang             : DCDCAS
   Marvin Lechner         : AUTO-CI (C++ implementation), FIC-MRCC
   Dagmar Lenk            : GEPOL surface, SMD
   Dimitrios Liakos       : Extrapolation schemes; Compound Job, initial MDCI parallelization
   Dimitrios Manganas     : Further ROCIS development; embedding schemes
   Dimitrios Pantazis     : SARC Basis sets
   Anastasios Papadopoulos: AUTO-CI, single reference methods and gradients
   Taras Petrenko         : DFT Hessian,TD-DFT gradient, ASA, ECA, R-Raman, ABS, FL, XAS/XES, NRVS
   Peter Pinski           : DLPNO-MP2, DLPNO-MP2 Gradient
   Christoph Reimann      : Effective Core Potentials
   Marius Retegan         : Local ZFS, SOC
   Christoph Riplinger    : Optimizer, TS searches, QM/MM, DLPNO-CCSD(T), (RO)-DLPNO pert. Triples
   Tobias Risthaus        : Range-separated hybrids, TD-DFT gradient, RPA, STAB
   Michael Roemelt        : Original ROCIS implementation
   Masaaki Saitow         : Open-shell DLPNO-CCSD energy and density
   Barbara Sandhoefer     : DKH picture change effects
   Avijit Sen             : IP-ROCIS
   Kantharuban Sivalingam : CASSCF convergence, NEVPT2, FIC-MRCI
   Bernardo de Souza      : ESD, SOC TD-DFT
   Georgi Stoychev        : AutoAux, RI-MP2 NMR, DLPNO-MP2 response
   Willem Van den Heuvel  : Paramagnetic NMR
   Boris Wezisla          : Elementary symmetry handling
   Frank Wennmohs         : Technical directorship


 We gratefully acknowledge several colleagues who have allowed us to
 interface, adapt or use parts of their codes:
   Stefan Grimme, W. Hujo, H. Kruse, P. Pracht,  : VdW corrections, initial TS optimization,
                  C. Bannwarth, S. Ehlert          DFT functionals, gCP, sTDA/sTD-DF
   Ed Valeev, F. Pavosevic, A. Kumar             : LibInt (2-el integral package), F12 methods
   Garnet Chan, S. Sharma, J. Yang, R. Olivares  : DMRG
   Ulf Ekstrom                                   : XCFun DFT Library
   Mihaly Kallay                                 : mrcc  (arbitrary order and MRCC methods)
   Jiri Pittner, Ondrej Demel                    : Mk-CCSD
   Frank Weinhold                                : gennbo (NPA and NBO analysis)
   Christopher J. Cramer and Donald G. Truhlar   : smd solvation model
   Lars Goerigk                                  : TD-DFT with DH, B97 family of functionals
   V. Asgeirsson, H. Jonsson                     : NEB implementation
   FAccTs GmbH                                   : IRC, NEB, NEB-TS, DLPNO-Multilevel, CI-OPT
                                                   MM, QMMM, 2- and 3-layer-ONIOM, Crystal-QMMM,
                                                   LR-CPCM, SF, NACMEs, symmetry and pop. for TD-DFT,
                                                   nearIR, NL-DFT gradient (VV10), updates on ESD,
                                                   ML-optimized integration grids
   S Lehtola, MJT Oliveira, MAL Marques          : LibXC Library
   Liviu Ungur et al                             : ANISO software


 Your calculation uses the libint2 library for the computation of 2-el integrals
 For citations please refer to: http://libint.valeyev.net

 Your ORCA version has been built with support for libXC version: 5.1.0
 For citations please refer to: https://tddft.org/programs/libxc/

 This ORCA versions uses:
   CBLAS   interface :  Fast vector & matrix operations
   LAPACKE interface :  Fast linear algebra routines
   SCALAPACK package :  Parallel linear algebra routines
   Shared memory     :  Shared parallel matrices
   BLAS/LAPACK       :  OpenBLAS 0.3.15  USE64BITINT DYNAMIC_ARCH NO_AFFINITY SkylakeX SINGLE_THREADED
        Core in use  :  SkylakeX
   Copyright (c) 2011-2014, The OpenBLAS Project


SCAN-COORDS
================================================================================

----- Orbital basis set information -----
Your calculation utilizes the basis: def2-SVP
   F. Weigend and R. Ahlrichs, Phys. Chem. Chem. Phys. 7, 3297 (2005).

The basis set includes element-specific modifications.

================================================================================
                                        WARNINGS
                       Please study these warnings very carefully!
================================================================================


WARNING: Post HF methods need fully converged wavefunctions
  ===> : Setting SCFConvForced true
         You can overwrite this default with %scf ConvForced false 


WARNING: MDCI localization with Augmented Hessian Foster-Boys
  ===> : Switching off randomization!

INFO   : the flag for use of the SHARK integral package has been found!

================================================================================
                                       INPUT FILE
================================================================================
NAME = he.inp
|  1> ! rhf qcisd(t)
|  2> %pal
|  3>   nprocs 1
|  4> end
|  5> %maxcore 4000
|  6> %coords
|  7>   ctyp internal
|  8>   charge 0
|  9>   mult 1
| 10>   coords
| 11>     He 0   0   0   0   0   0
| 12>   end
| 13> end
| 14> %basis
| 15>   newgto He
| 16>     S 4
| 17>     1 9079.303600 0.0006320
| 18>     2 58.789362 0.0414350
| 19>     3 10.200107 0.2992590
| 20>     4 2.346173 0.9749240
| 21>     S 1
| 22>     1 0.728426 1.0000000
| 23>     S 1
| 24>     1 0.283539 1.0000000
| 25>     S 1
| 26>     1 0.131665 1.0000000
| 27>     S 1
| 28>     1 0.060512 1.0000000
| 29>     P 1
| 30>     1 2.278600 1.0000000
| 31>     P 1
| 32>     1 0.539650 1.0000000
| 33>     P 1
| 34>     1 0.166860 1.0000000
| 35>     P 1
| 36>     1 0.050000 1.0000000
| 37>     D 1
| 38>     1 0.680000 1.0000000
| 39>     D 1
| 40>     1 0.180000 1.0000000
| 41>     D 1
| 42>     1 0.060000 1.0000000
| 43>   end
| 44> endd                         ****END OF INPUT****
================================================================================

                       ****************************
                       * Single Point Calculation *
                       ****************************

---------------------------------
CARTESIAN COORDINATES (ANGSTROEM)
---------------------------------
  He     0.000000    0.000000    0.000000

----------------------------
CARTESIAN COORDINATES (A.U.)
----------------------------
  NO LB      ZA    FRAG     MASS         X           Y           Z
   0 He    2.0000    0     4.003    0.000000    0.000000    0.000000

--------------------------------
INTERNAL COORDINATES (ANGSTROEM)
--------------------------------
 He     0   0   0     0.000000000000     0.00000000     0.00000000

---------------------------
INTERNAL COORDINATES (A.U.)
---------------------------
 He     0   0   0     0.000000000000     0.00000000     0.00000000

---------------------
BASIS SET INFORMATION
---------------------
There are 1 groups of distinct atoms

 Group   1 Type He  : 8s4p3d contracted to 5s4p3d pattern {41111/1111/111}

Atom   0He   basis set group =>   1
------------------------------------------------------------------------------
                           ORCA GTO INTEGRAL CALCULATION
------------------------------------------------------------------------------
------------------------------------------------------------------------------
                   ___                                                        
                  /   \      - P O W E R E D   B Y -                         
                 /     \                                                     
                 |  |  |   _    _      __       _____    __    __             
                 |  |  |  | |  | |    /  \     |  _  \  |  |  /  |          
                  \  \/   | |  | |   /    \    | | | |  |  | /  /          
                 / \  \   | |__| |  /  /\  \   | |_| |  |  |/  /          
                |  |  |   |  __  | /  /__\  \  |    /   |      \           
                |  |  |   | |  | | |   __   |  |    \   |  |\   \          
                \     /   | |  | | |  |  |  |  | |\  \  |  | \   \       
                 \___/    |_|  |_| |__|  |__|  |_| \__\ |__|  \__/        
                                                                              
                      - O R C A' S   B I G   F R I E N D -                    
                                      &                                       
                       - I N T E G R A L  F E E D E R -                       
                                                                              
 v1 FN, 2020, v2 2021                                                         
------------------------------------------------------------------------------


Reading SHARK input file he.SHARKINP.tmp ... ok
----------------------
SHARK INTEGRAL PACKAGE
----------------------

Number of atoms                             ...      1
Number of basis functions                   ...     32
Number of shells                            ...     12
Maximum angular momentum                    ...      2
Integral batch strategy                     ... SHARK/LIBINT Hybrid
RI-J (if used) integral strategy            ... SPLIT-RIJ (Revised 2003 algorithm where possible)
Printlevel                                  ...      1
Contraction scheme used                     ... SEGMENTED contraction
Coulomb Range Separation                    ... NOT USED
Exchange Range Separation                   ... NOT USED
Finite Nucleus Model                        ... NOT USED
Auxiliary Coulomb fitting basis             ... NOT available
Auxiliary J/K fitting basis                 ... NOT available
Auxiliary Correlation fitting basis         ... NOT available
Auxiliary 'external' fitting basis          ... NOT available
Integral threshold                          ...     1.000000e-10
Primitive cut-off                           ...     1.000000e-11
Primitive pair pre-selection threshold      ...     1.000000e-11

Calculating pre-screening integrals         ... done (  0.0 sec) Dimension = 12
Organizing shell pair data                  ... done (  0.0 sec)
Shell pair information
Total number of shell pairs                 ...        78
Shell pairs after pre-screening             ...        78
Total number of primitive shell pairs       ...       126
Primitive shell pairs kept                  ...       126
          la=0 lb=0:     15 shell pairs
          la=1 lb=0:     20 shell pairs
          la=1 lb=1:     10 shell pairs
          la=2 lb=0:     15 shell pairs
          la=2 lb=1:     12 shell pairs
          la=2 lb=2:      6 shell pairs

Calculating one electron integrals          ... done (  0.0 sec)
Calculating Nuclear repulsion               ... done (  0.0 sec) ENN=      0.000000000000 Eh

SHARK setup successfully completed in   0.0 seconds

Maximum memory used throughout the entire GTOINT-calculation: 6.3 MB
-------------------------------------------------------------------------------
                                 ORCA SCF
-------------------------------------------------------------------------------

------------
SCF SETTINGS
------------
Hamiltonian:
 Ab initio Hamiltonian  Method          .... Hartree-Fock(GTOs)


General Settings:
 Integral files         IntName         .... he
 Hartree-Fock type      HFTyp           .... RHF
 Total Charge           Charge          ....    0
 Multiplicity           Mult            ....    1
 Number of Electrons    NEL             ....    2
 Basis Dimension        Dim             ....   32
 Nuclear Repulsion      ENuc            ....      0.0000000000 Eh

Convergence Acceleration:
 DIIS                   CNVDIIS         .... on
   Start iteration      DIISMaxIt       ....    12
   Startup error        DIISStart       ....  0.200000
   # of expansion vecs  DIISMaxEq       ....     5
   Bias factor          DIISBfac        ....   1.050
   Max. coefficient     DIISMaxC        ....  10.000
 Trust-Rad. Augm. Hess. CNVTRAH         .... auto
   Auto Start mean grad. ratio tolernc. ....  1.125000
   Auto Start start iteration           ....    20
   Auto Start num. interpolation iter.  ....    10
   Max. Number of Micro iterations      ....    16
   Max. Number of Macro iterations      .... Maxiter - #DIIS iter
   Number of Davidson start vectors     ....     2
   Converg. threshold I  (grad. norm)   ....   5.000e-05
   Converg. threshold II (energy diff.) ....   1.000e-06
   Grad. Scal. Fac. for Micro threshold ....   0.100
   Minimum threshold for Micro iter.    ....   0.010
   NR start threshold (gradient norm)   ....   0.001
   Initial trust radius                 ....   0.400
   Minimum AH scaling param. (alpha)    ....   1.000
   Maximum AH scaling param. (alpha)    .... 1000.000
   Orbital update algorithm             .... Taylor
   White noise on init. David. guess    .... on
   Maximum white noise                  ....   0.010
   Quad. conv. algorithm                .... NR
 SOSCF                  CNVSOSCF        .... on
   Start iteration      SOSCFMaxIt      ....   150
   Startup grad/error   SOSCFStart      ....  0.003300
 Level Shifting         CNVShift        .... on
   Level shift para.    LevelShift      ....    0.2500
   Turn off err/grad.   ShiftErr        ....    0.0010
 Zerner damping         CNVZerner       .... off
 Static damping         CNVDamp         .... on
   Fraction old density DampFac         ....    0.7000
   Max. Damping (<1)    DampMax         ....    0.9800
   Min. Damping (>=0)   DampMin         ....    0.0000
   Turn off err/grad.   DampErr         ....    0.1000
 Fernandez-Rico         CNVRico         .... off

SCF Procedure:
 Maximum # iterations   MaxIter         ....   125
 SCF integral mode      SCFMode         .... Direct
   Integral package                     .... SHARK and LIBINT hybrid scheme
 Reset frequency        DirectResetFreq ....    20
 Integral Threshold     Thresh          ....  1.000e-10 Eh
 Primitive CutOff       TCut            ....  1.000e-11 Eh

Convergence Tolerance:
 Convergence Check Mode ConvCheckMode   .... Total+1el-Energy
 Convergence forced     ConvForced      .... 1
 Energy Change          TolE            ....  1.000e-06 Eh
 1-El. energy change                    ....  1.000e-03 Eh
 Orbital Gradient       TolG            ....  5.000e-05
 Orbital Rotation angle TolX            ....  5.000e-05
 DIIS Error             TolErr          ....  1.000e-06


Diagonalization of the overlap matrix:
Smallest eigenvalue                        ... 7.382e-03
Time for diagonalization                   ...    0.000 sec
Threshold for overlap eigenvalues          ... 1.000e-08
Number of eigenvalues below threshold      ... 0
Time for construction of square roots      ...    0.000 sec
Total time needed                          ...    0.001 sec

Time for model grid setup =    0.002 sec

------------------------------
INITIAL GUESS: MODEL POTENTIAL
------------------------------
Loading Hartree-Fock densities                     ... done
Calculating cut-offs                               ... done
Initializing the effective Hamiltonian             ... done
Setting up the integral package (SHARK)            ... done
Starting the Coulomb interaction                   ... done (   0.0 sec)
Reading the grid                                   ... done
Mapping shells                                     ... done
Starting the XC term evaluation                    ... done (   0.0 sec)
Transforming the Hamiltonian                       ... done (   0.0 sec)
Diagonalizing the Hamiltonian                      ... done (   0.0 sec)
Back transforming the eigenvectors                 ... done (   0.0 sec)
Now organizing SCF variables                       ... done
                      ------------------
                      INITIAL GUESS DONE (   0.0 sec)
                      ------------------
--------------
SCF ITERATIONS
--------------
ITER       Energy         Delta-E        Max-DP      RMS-DP      [F,P]     Damp
               ***  Starting incremental Fock matrix formation  ***
  0     -2.8553147749   0.000000000000 0.01230165  0.00051606  0.0822687 0.7000
  1     -2.8562321155  -0.000917340598 0.01028113  0.00042822  0.0630521 0.7000
                               ***Turning on DIIS***
  2     -2.8569474610  -0.000715345449 0.02585148  0.00107652  0.0465668 0.0000
  3     -2.8574005472  -0.000453086228 0.00399370  0.00022047  0.0078799 0.0000
                      *** Initiating the SOSCF procedure ***
                           *** Shutting down DIIS ***
                      *** Re-Reading the Fockian *** 
                      *** Removing any level shift *** 
ITER      Energy       Delta-E        Grad      Rot      Max-DP    RMS-DP
  4     -2.85848181  -0.0010812638  0.001024  0.001024  0.001215  0.000073
               *** Restarting incremental Fock matrix formation ***
  5     -2.85887661  -0.0003947969  0.000220  0.000216  0.000306  0.000017
                 **** Energy Check signals convergence ****
              ***Rediagonalizing the Fockian in SOSCF/NRSCF***

               *****************************************************
               *                     SUCCESS                       *
               *           SCF CONVERGED AFTER   6 CYCLES          *
               *****************************************************


----------------
TOTAL SCF ENERGY
----------------

Total Energy       :           -2.85887675 Eh             -77.79399 eV

Components:
Nuclear Repulsion  :            0.00000000 Eh               0.00000 eV
Electronic Energy  :           -2.85887675 Eh             -77.79399 eV
One Electron Energy:           -3.88358543 Eh            -105.67773 eV
Two Electron Energy:            1.02470868 Eh              27.88374 eV

Virial components:
Potential Energy   :           -5.70993974 Eh            -155.37536 eV
Kinetic Energy     :            2.85106300 Eh              77.58137 eV
Virial Ratio       :            2.00274065


---------------
SCF CONVERGENCE
---------------

  Last Energy change         ...   -1.4114e-07  Tolerance :   1.0000e-06
  Last MAX-Density change    ...    8.8992e-05  Tolerance :   1.0000e-05
  Last RMS-Density change    ...    4.6771e-06  Tolerance :   1.0000e-06
  Last Orbital Gradient      ...    4.7279e-05  Tolerance :   5.0000e-05
  Last Orbital Rotation      ...    5.9769e-05  Tolerance :   5.0000e-05

             **** THE GBW FILE WAS UPDATED (he.gbw) ****
             **** DENSITY he.scfp WAS UPDATED ****
             **** ENERGY FILE WAS UPDATED (he.en.tmp) ****
             **** THE GBW FILE WAS UPDATED (he.gbw) ****
             **** DENSITY he.scfp WAS UPDATED ****
----------------
ORBITAL ENERGIES
----------------

  NO   OCC          E(Eh)            E(eV) 
   0   2.0000      -0.917097       -24.9555 
   1   0.0000       0.100290         2.7290 
   2   0.0000       0.112920         3.0727 
   3   0.0000       0.112920         3.0727 
   4   0.0000       0.112920         3.0727 
   5   0.0000       0.197171         5.3653 
   6   0.0000       0.197171         5.3653 
   7   0.0000       0.197171         5.3653 
   8   0.0000       0.197171         5.3653 
   9   0.0000       0.197171         5.3653 
  10   0.0000       0.473993        12.8980 
  11   0.0000       0.473993        12.8980 
  12   0.0000       0.473993        12.8980 
  13   0.0000       0.494538        13.4571 
  14   0.0000       0.735335        20.0095 
  15   0.0000       0.735335        20.0095 
  16   0.0000       0.735335        20.0095 
  17   0.0000       0.735335        20.0095 
  18   0.0000       0.735335        20.0095 
  19   0.0000       1.597560        43.4718 
  20   0.0000       1.598426        43.4954 
  21   0.0000       1.598426        43.4954 
  22   0.0000       1.598426        43.4954 
  23   0.0000       2.666831        72.5682 
  24   0.0000       2.666831        72.5682 
  25   0.0000       2.666831        72.5682 
  26   0.0000       2.666831        72.5682 
  27   0.0000       2.666831        72.5682 
  28   0.0000       6.150983       167.3768 
  29   0.0000       6.163560       167.7190 
  30   0.0000       6.163560       167.7190 
  31   0.0000       6.163560       167.7190 

                    ********************************
                    * MULLIKEN POPULATION ANALYSIS *
                    ********************************

-----------------------
MULLIKEN ATOMIC CHARGES
-----------------------
   0 He:   -0.000000
Sum of atomic charges:   -0.0000000

--------------------------------
MULLIKEN REDUCED ORBITAL CHARGES
--------------------------------
  0 Hes       :     2.000000  s :     2.000000
      pz      :     0.000000  p :     0.000000
      px      :     0.000000
      py      :     0.000000
      dz2     :     0.000000  d :     0.000000
      dxz     :     0.000000
      dyz     :     0.000000
      dx2y2   :     0.000000
      dxy     :     0.000000


                     *******************************
                     * LOEWDIN POPULATION ANALYSIS *
                     *******************************

----------------------
LOEWDIN ATOMIC CHARGES
----------------------
   0 He:   -0.000000

-------------------------------
LOEWDIN REDUCED ORBITAL CHARGES
-------------------------------
  0 Hes       :     2.000000  s :     2.000000
      pz      :     0.000000  p :     0.000000
      px      :     0.000000
      py      :     0.000000
      dz2     :     0.000000  d :     0.000000
      dxz     :     0.000000
      dyz     :     0.000000
      dx2y2   :     0.000000
      dxy     :     0.000000


                      *****************************
                      * MAYER POPULATION ANALYSIS *
                      *****************************

  NA   - Mulliken gross atomic population
  ZA   - Total nuclear charge
  QA   - Mulliken gross atomic charge
  VA   - Mayer's total valence
  BVA  - Mayer's bonded valence
  FA   - Mayer's free valence

  ATOM       NA         ZA         QA         VA         BVA        FA
  0 He     2.0000     2.0000    -0.0000    -0.0000     0.0000    -0.0000

  Mayer bond orders larger than 0.100000



Warning: MO coefficients are modified such that the real solid harmonic m components
have the correct order within each shell (0, +1, -1, +2, -2, ...) and all s orbitals
come before all p orbitals etc. (with increasing orbital energy within each block of given angular momentum).

--------------------------
ATOM BASIS FOR ELEMENT He
--------------------------
 NewGTO He
 S 8
    1       9079.303599999999         0.000178080779
    2         58.789362000000         0.011675280176
    3         10.200107000000         0.084323221192
    4          2.346173000000         0.274707634850
    5          0.728426000000         0.419189730494
    6          0.283539000000         0.296572514379
    7          0.131665000000         0.082279594561
    8          0.060512000000         0.003853974419
 S 8
    1       9079.303599999999         0.000026081260
    2         58.789362000000         0.001709931950
    3         10.200107000000         0.012349765309
    4          2.346173000000         0.040232984116
    5          0.728426000000         0.221882205981
    6          0.283539000000        -0.587420491102
    7          0.131665000000         1.929597994568
    8          0.060512000000        -2.218921804416
 S 8
    1       9079.303599999999        -0.000092461393
    2         58.789362000000        -0.006061926897
    3         10.200107000000        -0.043781493451
    4          2.346173000000        -0.142631061126
    5          0.728426000000         0.217711690378
    6          0.283539000000        -2.793997680674
    7          0.131665000000         5.101810035843
    8          0.060512000000        -2.407643372284
 S 8
    1       9079.303599999999        -0.000092534625
    2         58.789362000000        -0.006066728160
    3         10.200107000000        -0.043816169964
    4          2.346173000000        -0.142744030041
    5          0.728426000000        -2.329566503801
    6          0.283539000000         5.713688605825
    7          0.131665000000        -4.860365649485
    8          0.060512000000         1.577258745093
 S 8
    1       9079.303599999999        -0.000895511669
    2         58.789362000000        -0.058711275305
    3         10.200107000000        -0.424034693775
    4          2.346173000000        -1.381417433709
    5          0.728426000000         3.543937145339
    6          0.283539000000        -4.051132452327
    7          0.131665000000         2.725937394178
    8          0.060512000000        -0.828376566467
 P 4
    1          2.278600000000        -0.003092003880
    2          0.539650000000         0.059668090835
    3          0.166860000000        -0.220127665261
    4          0.050000000000         1.120752465420
 P 4
    1          2.278600000000         0.039376000979
    2          0.539650000000        -0.158463359290
    3          0.166860000000         1.431969891333
    4          0.050000000000        -0.767380146477
 P 4
    1          2.278600000000        -0.046041971035
    2          0.539650000000         1.463029640485
    3          0.166860000000        -1.171253708777
    4          0.050000000000         0.397813793740
 P 4
    1          2.278600000000         1.265065842814
    2          0.539650000000        -0.992883864441
    3          0.166860000000         0.518120610902
    4          0.050000000000        -0.167294292819
 D 3
    1          0.680000000000         0.026233317641
    2          0.180000000000        -0.202618115110
    3          0.060000000000         1.108084530821
 D 3
    1          0.680000000000        -0.103473222517
    2          0.180000000000         1.303694320944
    3          0.060000000000        -0.626371635118
 D 3
    1          0.680000000000         1.176490053374
    2          0.180000000000        -0.653033900703
    3          0.060000000000         0.244369727524
 end
-------------------------------------------
RADIAL EXPECTATION VALUES <R**-3> TO <R**3>
-------------------------------------------
   0 :     0.000000     5.907648     1.683662     0.928138     1.186807     1.945174
   1 :     0.000000     0.211366     0.261350     4.660913    23.413285   124.567250
   2 :     0.000000     0.994333     0.472889     3.536595    15.705715    81.825569
   3 :     0.000000     2.665369     0.911818     2.218308     7.379743    32.640090
   4 :     0.000000    22.278800     2.851551     1.020000     2.333260     8.934736
   5 :     0.017466     0.054137     0.216608     5.098350    28.138003   166.242907
   6 :     0.017466     0.054137     0.216608     5.098350    28.138003   166.242907
   7 :     0.017466     0.054137     0.216608     5.098350    28.138003   166.242907
   8 :     0.146411     0.207369     0.405732     3.135971    12.823606    66.467414
   9 :     0.146411     0.207369     0.405732     3.135971    12.823606    66.467414
  10 :     0.146411     0.207369     0.405732     3.135971    12.823606    66.467414
  11 :     0.839420     0.697187     0.739547     1.865629     5.226367    21.512069
  12 :     0.839420     0.697187     0.739547     1.865629     5.226367    21.512069
  13 :     0.839420     0.697187     0.739547     1.865629     5.226367    21.512069
  14 :     8.013463     3.088120     1.549747     0.921199     1.472878     4.449332
  15 :     8.013463     3.088120     1.549747     0.921199     1.472878     4.449332
  16 :     8.013463     3.088120     1.549747     0.921199     1.472878     4.449332
  17 :     0.008852     0.039459     0.191993     5.528229    32.267098   990.231581
  18 :     0.008852     0.039459     0.191993     5.528229    32.267098   990.231581
  19 :     0.008852     0.039459     0.191993     5.528229    32.267098   990.231581
  20 :     0.008852     0.039459     0.191993     5.528229    32.267098   990.231581
  21 :     0.008852     0.039459     0.191993     5.528229    32.267098   990.231581
  22 :     0.057089     0.134156     0.346882     3.315051    13.138852   316.944338
  23 :     0.057089     0.134156     0.346882     3.315051    13.138852   316.944338
  24 :     0.057089     0.134156     0.346882     3.315051    13.138852   316.944338
  25 :     0.057089     0.134156     0.346882     3.315051    13.138852   316.944338
  26 :     0.057089     0.134156     0.346882     3.315051    13.138852   316.944338
  27 :     0.516289     0.562385     0.700130     1.718043     3.925363    65.549224
  28 :     0.516289     0.562385     0.700130     1.718043     3.925363    65.549224
  29 :     0.516289     0.562385     0.700130     1.718043     3.925363    65.549224
  30 :     0.516289     0.562385     0.700130     1.718043     3.925363    65.549224
  31 :     0.516289     0.562385     0.700130     1.718043     3.925363    65.549224
-------
TIMINGS
-------

Total SCF time: 0 days 0 hours 0 min 0 sec 

Total time                  ....       0.095 sec
Sum of individual times     ....       0.014 sec  ( 14.8%)

Fock matrix formation       ....       0.009 sec  (  9.1%)
Diagonalization             ....       0.001 sec  (  0.7%)
Density matrix formation    ....       0.000 sec  (  0.0%)
Population analysis         ....       0.001 sec  (  0.8%)
Initial guess               ....       0.002 sec  (  1.7%)
Orbital Transformation      ....       0.000 sec  (  0.0%)
Orbital Orthonormalization  ....       0.000 sec  (  0.0%)
DIIS solution               ....       0.000 sec  (  0.4%)
SOSCF solution              ....       0.000 sec  (  0.2%)

Maximum memory used throughout the entire SCF-calculation: 224.7 MB


--------------------------------------------------------------------------------
                             ORCA-MATRIX DRIVEN CI
--------------------------------------------------------------------------------

--------------------------------
AUTOMATIC CHOICE OF INCORE LEVEL
--------------------------------

Memory available                           ...   2000.00 MB
Memory needed for S+T                      ...      0.01 MB
Memory needed for J+K                      ...      0.04 MB
Memory needed for DIIS                     ...      0.21 MB
Memory needed for 3-ext                    ...      0.23 MB
Memory needed for 4-ext                    ...      3.64 MB
Memory needed for triples                  ...      1.14 MB
 -> Final InCoreLevel    ... 5
 -> check shows that triples correction can be computed


Wavefunction type
-----------------
Correlation treatment                      ...     QCISD     
Single excitations                         ... ON
Orbital optimization                       ... OFF
Calculation of Z vector                    ... OFF
Calculation of Brueckner orbitals          ... OFF
Perturbative triple excitations            ... ON
Calculation of F12 correction              ... OFF
Frozen core treatment                      ... chemical core (0 el)
Reference Wavefunction                     ... RHF
  Internal Orbitals:     0 ...    0 (  1 MO's/  2 electrons)
  Virtual  Orbitals:     1 ...   31 ( 31 MO's              )
Number of AO's                             ...     32
Number of electrons                        ...      2
Number of correlated electrons             ...      2

Algorithmic settings
--------------------
Integral transformation                    ... AO direct full transformation
K(C) Formation                             ... FULL-MO TRAFO
Maximum number of iterations               ...        50
Convergence tolerance (max. residuum)      ... 2.500e-05
Level shift for amplitude update           ... 2.000e-01
Maximum number of DIIS vectors             ...         7
DIIS turned on at iteration                ...         0
Damping before turning on DIIS             ...     0.500
Damping after turning on DIIS              ...     0.000
Pair specific amplitude update             ... OFF
Natural orbital iterations                 ... OFF
Perturbative natural orbital generation    ... OFF
Printlevel                                 ... 2

Memory handling:
----------------
Maximum memory for working arrays          ...   2000 MB
Data storage in matrix containers          ... UNCOMPRESSED
Data type for integral storage             ... DOUBLE
In-Core Storage of quantities:
   Amplitudes+Sigma Vector      ... YES
   J+K operators                ... YES
   DIIS vectors                 ... YES
   3-external integrals         ... YES
   4-external integrals         ... YES


Initializing the integral package          ... done
Warning: reference  - re-canonicalizations have been set to INT 1 VIRT 1

--------------------------
CLOSED-SHELL FOCK OPERATOR
--------------------------

Restoring SHARK [2] ... ok
Recanonicalizing the internal orbitals
Recanonicalizing the virtual orbitals
Time needed for Fock operator              ...            0.018 sec
Reference energy                           ...     -2.858876756

------------------------------
PARTIAL COULOMB TRANSFORMATION
------------------------------

Transformation type                        ... one-operator
Dimension of the basis                     ...   32
Number of internal MOs                     ...   32 (0-31)
Pair cutoff                                ... 0.000e+00 Eh
Number of AO pairs included in the trafo   ...  528
Total Number of distinct AO pairs          ...  528
Memory devoted for trafo                   ... 2000.0 MB 
Max. Number of MO pairs treated together   ... 496484      
Max. Number of MOs treated per batch       ... 15515      
Number Format for Storage                  ... Double (8 Byte)
AO-integral source                         ... DIRECT
Integral package used                      ... LIBINT

Starting integral evaluation:
<ss|**>:         1170 b        0 skpd     0.001 s (  0.001 ms/b)
<sp|**>:         1560 b        0 skpd     0.002 s (  0.001 ms/b)
<sd|**>:         1170 b        0 skpd     0.002 s (  0.002 ms/b)
<pp|**>:          780 b        0 skpd     0.002 s (  0.002 ms/b)
<pd|**>:          936 b        0 skpd     0.004 s (  0.004 ms/b)
<dd|**>:          468 b        0 skpd     0.003 s (  0.007 ms/b)
Closing buffer AOJ ( 0.00 GB; CompressionRatio= 1.00)
Collecting buffer AOJ 
    ... done with AO integral generation
Number of MO pairs included in the trafo   ...  528
    ... Now sorting integrals
IBATCH = 1 of  1
Closing buffer JAO ( 0.00 GB; CompressionRatio= 1.00)
Collecting buffer JAO 
TOTAL TIME for half transformation         ...     0.023 sec
AO-integral generation                     ...     0.005 sec
Half transformation                        ...     0.008 sec
J-integral sorting                         ...     0.009 sec

-------------------------- SECOND HALF TRANSFORMATION --------------------------
Formation of (pq|rs)                       ... ok (     0.009 sec)
Integral sorting                           ... ok (     0.006 sec)

------------------
CLOSED SHELL GUESS
------------------

Initial guess performed in     0.000 sec
E(0)                                       ...     -2.858876756
E(MP2)                                     ...     -0.031888706
Initial E(tot)                             ...     -2.890765463
<T|T>                                      ...      0.005411774
Number of pairs included                   ... 1
Total number of pairs                      ... 1

---------------------------
RHF QUADRATIC CI ITERATIONS
---------------------------

Number of amplitudes to be optimized       ... 992

Iter       E(tot)           E(Corr)          Delta-E          Residual     Time
  0     -2.890765463     -0.031888706      0.000000000      0.021776285    0.00
                           *** Turning on DIIS ***
  1     -2.895486722     -0.036609966     -0.004721259      0.006036609    0.00
  2     -2.896801697     -0.037924941     -0.001314975      0.000669424    0.00
  3     -2.896878281     -0.038001525     -0.000076584      0.000169819    0.00
  4     -2.896887765     -0.038011009     -0.000009484      0.000038597    0.00
  5     -2.896889084     -0.038012327     -0.000001319      0.000006759    0.00
               --- The Quadratic CI iterations have converged ---

-------------------
QUADRATIC CI ENERGY
-------------------

E(0)                                       ...     -2.858876756
E(CORR)                                    ...     -0.038012327
E(TOT)                                     ...     -2.896889084
Singles Norm <S|S>**1/2                    ...      0.002911484  
T1 diagnostic                              ...      0.002058730  

------------------
LARGEST AMPLITUDES
------------------
   0-> 19   0-> 19       0.027970
   0-> 19   0-> 13       0.023476
   0-> 13   0-> 19       0.023476
   0-> 13   0-> 13       0.022316
   0-> 20   0-> 20       0.021980
   0-> 21   0-> 21       0.021980
   0-> 22   0-> 22       0.021980
   0-> 19   0-> 28       0.014065
   0-> 28   0-> 19       0.014065
   0-> 28   0-> 28       0.013740
   0-> 10   0-> 20       0.013407
   0-> 20   0-> 10       0.013407
   0->  1   0-> 19       0.012756
   0-> 19   0->  1       0.012756
   0-> 13   0->  1       0.012713
   0->  1   0-> 13       0.012713


        !!!!!!!!!!!!!!!!!!!!!!!!!!!!!!!!!!!!!!!!!!!!!!!!!!!!!!!!!!!!!!!!!!!!!!!!!! 
        !  Warning: Densities are linearized densities !                         !
        !!!!!!!!!!!!!!!!!!!!!!!!!!!!!!!!!!!!!!!!!!!!!!!!!!!!!!!!!!!!!!!!!!!!!!!!!! 

Trace of internal density part =     -0.016213581
Trace of external density part =      0.016213581
----------------------
RHF TRIPLES CORRECTION (Algorithm 1)
----------------------

Multiplier for the singles contribution    ...      2.000000000

Triples Correction (T)                     ...      0.000000000
Scaling of triples based on CCSD energies (Peterson et al. Molecular Physics 113, 1551 (2015))
E(T*) = f*E(T) where f = E(F12-CCSD)/E(CCSD) 
f = CCSD (with F12)/ CCSD (without F12)    ...      1.000000000
Scaled triples correction (T)              ...      0.000000000

Final correlation energy                   ...     -0.038012327
E(QCISD)                                   ...     -2.896889084
E(QCISD(T))                                ...     -2.896889084

NORM  =      1.008115267 sqrt=     1.004049435
W(HF) =      0.991950060
------------------------------------------------------------------------------
                           ORCA POPULATION ANALYSIS
------------------------------------------------------------------------------
Input electron density              ... he.mdcip
BaseName (.gbw .S,...)              ... he

                    ********************************
                    * MULLIKEN POPULATION ANALYSIS *
                    ********************************

-----------------------
MULLIKEN ATOMIC CHARGES
-----------------------
   0 He:    0.000000
Sum of atomic charges:    0.0000000

--------------------------------
MULLIKEN REDUCED ORBITAL CHARGES
--------------------------------
  0 Hes       :     1.991592  s :     1.991592
      pz      :     0.002718  p :     0.008154
      px      :     0.002718
      py      :     0.002718
      dz2     :     0.000051  d :     0.000254
      dxz     :     0.000051
      dyz     :     0.000051
      dx2y2   :     0.000051
      dxy     :     0.000051


                     *******************************
                     * LOEWDIN POPULATION ANALYSIS *
                     *******************************

----------------------
LOEWDIN ATOMIC CHARGES
----------------------
   0 He:   -0.000000

-------------------------------
LOEWDIN REDUCED ORBITAL CHARGES
-------------------------------
  0 Hes       :     1.991592  s :     1.991592
      pz      :     0.002718  p :     0.008154
      px      :     0.002718
      py      :     0.002718
      dz2     :     0.000051  d :     0.000254
      dxz     :     0.000051
      dyz     :     0.000051
      dx2y2   :     0.000051
      dxy     :     0.000051


                      *****************************
                      * MAYER POPULATION ANALYSIS *
                      *****************************

  NA   - Mulliken gross atomic population
  ZA   - Total nuclear charge
  QA   - Mulliken gross atomic charge
  VA   - Mayer's total valence
  BVA  - Mayer's bonded valence
  FA   - Mayer's free valence

  ATOM       NA         ZA         QA         VA         BVA        FA
  0 He     2.0000     2.0000     0.0000     0.0644     0.0000     0.0644





--------------------------------------------------------------------------------
                                    TIMINGS
--------------------------------------------------------------------------------


Total execution time                   ...        0.160 sec

Fock Matrix Formation                  ...        0.018 sec ( 11.0%)
Initial Guess                          ...        0.000 sec (  0.0%)
DIIS Solver                            ...        0.000 sec (  0.1%)
State Vector Update                    ...        0.000 sec (  0.0%)
Sigma-vector construction              ...        0.009 sec (  5.7%)
  <D|H|D>(4-ext)                       ...        0.007 sec ( 77.4% of sigma)
Total Time for computing (T)           ...        0.000 sec (  0.0% of ALL)


Maximum memory used throughout the entire MDCI-calculation: 55.1 MB

-------------------------   --------------------
FINAL SINGLE POINT ENERGY        -2.896889083672
-------------------------   --------------------


                            ***************************************
                            *     ORCA property calculations      *
                            ***************************************

                                    ---------------------
                                    Active property flags
                                    ---------------------
   (+) Dipole Moment


------------------------------------------------------------------------------
                       ORCA ELECTRIC PROPERTIES CALCULATION
------------------------------------------------------------------------------

Dipole Moment Calculation                       ... on
Quadrupole Moment Calculation                   ... off
Polarizability Calculation                      ... off
GBWName                                         ... he.gbw
Electron density                                ... he.scfp
The origin for moment calculation is the CENTER OF MASS  = ( 0.000000,  0.000000  0.000000)

-------------
DIPOLE MOMENT
-------------
                                X             Y             Z
Electronic contribution:      0.00000       0.00000       0.00000
Nuclear contribution   :      0.00000       0.00000       0.00000
                        -----------------------------------------
Total Dipole Moment    :      0.00000       0.00000       0.00000
                        -----------------------------------------
Magnitude (a.u.)       :      0.00000
Magnitude (Debye)      :      0.00000



--------------------
Rotational spectrum 
--------------------
 
Rotational constants in cm-1:     0.000000     0.000000     0.000000 
Rotational constants in MHz :     0.000000     0.000000     0.000000 

 Dipole components along the rotational axes: 
x,y,z [a.u.] :     0.000000     0.000000     0.000000 
x,y,z [Debye]:     0.000000     0.000000     0.000000 

 

                           *** MDCI DENSITY ***

------------------------------------------------------------------------------
                       ORCA ELECTRIC PROPERTIES CALCULATION
------------------------------------------------------------------------------

Dipole Moment Calculation                       ... on
Quadrupole Moment Calculation                   ... off
Polarizability Calculation                      ... off
GBWName                                         ... he.gbw
Electron density                                ... he.mdcip
The origin for moment calculation is the CENTER OF MASS  = ( 0.000000,  0.000000  0.000000)

-------------
DIPOLE MOMENT
-------------
                                X             Y             Z
Electronic contribution:      0.00000       0.00000      -0.00000
Nuclear contribution   :      0.00000       0.00000       0.00000
                        -----------------------------------------
Total Dipole Moment    :      0.00000       0.00000      -0.00000
                        -----------------------------------------
Magnitude (a.u.)       :      0.00000
Magnitude (Debye)      :      0.00000



--------------------
Rotational spectrum 
--------------------
 
Rotational constants in cm-1:     0.000000     0.000000     0.000000 
Rotational constants in MHz :     0.000000     0.000000     0.000000 

 Dipole components along the rotational axes: 
x,y,z [a.u.] :     0.000000     0.000000    -0.000000 
x,y,z [Debye]:     0.000000     0.000000    -0.000000 

 

Timings for individual modules:

Sum of individual times         ...        0.409 sec (=   0.007 min)
GTO integral calculation        ...        0.079 sec (=   0.001 min)  19.4 %
SCF iterations                  ...        0.129 sec (=   0.002 min)  31.6 %
MDCI module                     ...        0.201 sec (=   0.003 min)  49.1 %
                             ****ORCA TERMINATED NORMALLY****
TOTAL RUN TIME: 0 days 0 hours 0 minutes 0 seconds 528 msec
