21
Coordinates from ORCA-job optfreq
  C   -2.32858246372962     -0.49919358296903     -0.02676433589501
  C   -0.76590847648924     -0.50105717019635     -0.04371841084094
  C   -2.82925861077944     -1.84670165871310     -0.59223034264542
  C   -2.85697080780914      0.63032072186702     -0.93322420079478
  C   -2.86623974180199     -0.32723206806593      1.40660889805055
  H   -2.40813597016407     -1.06088910800588      2.07844934820492
  H   -3.95392623126750     -0.46765138305452      1.43252013926706
  H   -2.65458658226324      0.67313054811488      1.80087485442867
  H   -2.44476497494623      0.55556963636842     -1.94833354081400
  H   -2.60686470740961      1.62178830174510     -0.54022549050248
  H   -3.94943436717385      0.57716141927010     -1.01603188088234
  H   -2.41818994383457     -2.04068836023505     -1.59255095493315
  H   -3.92204910674597     -1.84611289275505     -0.67997132994795
  H   -2.56423600892892     -2.68801657945514      0.06021071735632
  H   -0.46113504387081     -0.60529417778072     -1.10072842216860
  O   -0.22323189460635     -1.58788487429616      0.71293710989690
  C   -0.10044379053944      0.75240074301987      0.52128217821831
  H   -0.40570371270944      1.65293337478613     -0.01992636311239
  H   0.98622705988634      0.65148304400171      0.43662602549752
  H   -0.34179319077692      0.87997195177910      1.58144843555728
  H   -0.48595143403997     -2.41418788542541      0.28057756605952
