5
Coordinates from ORCA-job optfreq
  C   -2.74258698311973      2.11695516299807     -0.05036288150177
  F   -1.38850579093026      2.12033154659861     -0.04514934108294
  F   -3.17935846705917      2.85352416927691      0.99842885587766
  H   -3.09183479717084      1.09010840690065      0.07185190153198
  H   -3.09211396172000      2.58026071422576     -0.97476853482493
