5
Coordinates from ORCA-job optfreq
  C   -2.71988860672158      2.17726274151225     -0.05354281220332
  F   -1.38860649459456      2.16271273733667     -0.03365163809964
  F   -3.14738895321816      2.88255078281426      0.99176852379711
  F   -3.15696455124996      0.92591493568976      0.07575599267648
  H   -3.08155139421574      2.61272880264705     -0.98032006617063
