5
Coordinates from ORCA-job optfreq
  C   -2.69887715217366      2.15224691281982      0.00002220655749
  F   -1.36315413499829      2.14732877065966     -0.00205607723210
  F   -3.13962591341239      2.87471271232667      1.03349741636361
  F   -3.14864514925552      0.89915958264397      0.10843318239210
  F   -3.14409765016014      2.68772202154988     -1.13988672808110
