19
Coordinates from ORCA-job optfreq E -235.983303226000
  C      -2.255260     -0.514420     -0.358070
  C      -0.760430     -0.535610     -0.078470
  C      -2.932370     -1.814850     -0.701210
  C      -2.883760      0.699480     -0.984140
  H      -2.544310      0.809900     -2.018690
  H      -2.644540      1.611960     -0.430610
  H      -3.974140      0.614640     -0.990640
  H      -2.587780     -2.170170     -1.677620
  H      -4.017840     -1.696820     -0.740970
  H      -2.730800     -2.588840      0.044820
  H      -0.263580     -0.795620     -1.023900
  C      -0.175270      0.803530      0.391500
  H      -0.420050      1.629710     -0.282780
  H       0.917720      0.742290      0.431530
  H      -0.529180      1.062500      1.396720
  C      -0.375750     -1.592290      0.966550
  H       0.709100     -1.618070      1.107660
  H      -0.678050     -2.600790      0.669920
  H      -0.836490     -1.370320      1.937230
19
Coordinates from ORCA-job optfreq E -235.993067988300
  C      -2.234989     -0.522544     -0.399956
  C      -0.767154     -0.535801     -0.075950
  C      -2.928182     -1.810824     -0.687960
  C      -2.868844      0.699191     -0.964760
  H      -2.516946      0.820171     -2.000746
  H      -2.610020      1.603831     -0.403753
  H      -3.960058      0.615916     -0.981320
  H      -2.579983     -2.174853     -1.666340
  H      -4.014168     -1.686251     -0.733225
  H      -2.712450     -2.581443      0.059432
  H      -0.274769     -0.801784     -1.029108
  C      -0.195365      0.824543      0.376578
  H      -0.435454      1.640857     -0.311949
  H       0.895225      0.765379      0.428337
  H      -0.559876      1.094610      1.373512
  C      -0.386589     -1.615843      0.967093
  H       0.696583     -1.630335      1.111496
  H      -0.678527     -2.625226      0.661756
  H      -0.851212     -1.403385      1.935694
19
Coordinates from ORCA-job optfreq E -235.998847232983
  C      -2.222803     -0.529867     -0.435772
  C      -0.778994     -0.533213     -0.067737
  C      -2.928619     -1.805934     -0.678562
  C      -2.866798      0.695726     -0.943583
  H      -2.495390      0.830651     -1.975927
  H      -2.594534      1.592441     -0.379288
  H      -3.955989      0.609872     -0.983618
  H      -2.571589     -2.173393     -1.657200
  H      -4.012719     -1.679299     -0.739132
  H      -2.697973     -2.577064      0.061532
  H      -0.295524     -0.810562     -1.027899
  C      -0.203931      0.834464      0.365810
  H      -0.427691      1.640762     -0.337275
  H       0.884747      0.760858      0.430079
  H      -0.577035      1.118167      1.355534
  C      -0.394360     -1.625483      0.968996
  H       0.689405     -1.619505      1.108314
  H      -0.673134     -2.634875      0.657008
  H      -0.859848     -1.417533      1.937550
19
Coordinates from ORCA-job optfreq E -236.001537213205
  C      -2.210628     -0.537653     -0.475197
  C      -0.781790     -0.531842     -0.060601
  C      -2.930582     -1.810461     -0.681041
  C      -2.876034      0.698545     -0.922030
  H      -2.494554      0.876574     -1.946805
  H      -2.601173      1.579768     -0.336635
  H      -3.962044      0.603006     -0.984638
  H      -2.577678     -2.191145     -1.658658
  H      -4.012711     -1.681707     -0.749593
  H      -2.685462     -2.579732      0.054863
  H      -0.298584     -0.825477     -1.019679
  C      -0.198913      0.836538      0.351429
  H      -0.393293      1.628322     -0.376015
  H       0.886436      0.744184      0.443342
  H      -0.590677      1.145122      1.326646
  C      -0.399622     -1.624731      0.975510
  H       0.683014     -1.599438      1.121353
  H      -0.662819     -2.635589      0.657247
  H      -0.875666     -1.418076      1.939333
19
Coordinates from ORCA-job optfreq E -236.002334615177
  C      -2.202000     -0.546684     -0.496199
  C      -0.784849     -0.537044     -0.054784
  C      -2.925672     -1.816775     -0.700295
  C      -2.881775      0.700782     -0.882426
  H      -2.482944      0.947759     -1.888168
  H      -2.618460      1.553071     -0.249810
  H      -3.963611      0.594127     -0.978627
  H      -2.578149     -2.198998     -1.681188
  H      -4.006879     -1.686355     -0.772602
  H      -2.669900     -2.591737      0.025716
  H      -0.304085     -0.858233     -1.010103
  C      -0.193840      0.836729      0.315722
  H      -0.353482      1.598640     -0.451662
  H       0.886114      0.730429      0.445811
  H      -0.609739      1.192395      1.264835
  C      -0.408738     -1.619658      0.993515
  H       0.671315     -1.578602      1.152877
  H      -0.656270     -2.634956      0.677389
  H      -0.899816     -1.408679      1.948830
19
Coordinates from ORCA-job optfreq E -236.002627300224
  C      -2.198130     -0.553087     -0.504200
  C      -0.784698     -0.542803     -0.054822
  C      -2.916767     -1.823941     -0.726000
  C      -2.889449      0.701436     -0.845030
  H      -2.471514      1.020314     -1.822384
  H      -2.651384      1.519490     -0.157922
  H      -3.966285      0.583487     -0.975747
  H      -2.578701     -2.197186     -1.713550
  H      -3.998701     -1.695769     -0.790552
  H      -2.650639     -2.607266     -0.012290
  H      -0.305153     -0.893749     -1.001805
  C      -0.182995      0.833948      0.277710
  H      -0.312551      1.565359     -0.524604
  H       0.891547      0.719084      0.441103
  H      -0.616852      1.236094      1.200310
  C      -0.420595     -1.609457      1.013978
  H       0.656790     -1.562349      1.188712
  H      -0.660377     -2.629292      0.706615
  H      -0.926327     -1.388105      1.959306
19
Coordinates from ORCA-job optfreq E -236.002917565839
  C      -2.194890     -0.562232     -0.509400
  C      -0.783281     -0.552252     -0.059491
  C      -2.903260     -1.833151     -0.765534
  C      -2.897129      0.699286     -0.794280
  H      -2.445770      1.120277     -1.715338
  H      -2.702172      1.458375     -0.027123
  H      -3.964801      0.572960     -0.979087
  H      -2.585017     -2.181912     -1.767604
  H      -3.987187     -1.710657     -0.807009
  H      -2.618591     -2.632529     -0.076515
  H      -0.304839     -0.947903     -0.989656
  C      -0.168729      0.827485      0.221813
  H      -0.267713      1.516448     -0.622117
  H       0.899195      0.708129      0.421230
  H      -0.618002      1.288852      1.109162
  C      -0.439040     -1.590841      1.045764
  H       0.634314     -1.536956      1.241568
  H      -0.671146     -2.617908      0.757366
  H      -0.964723     -1.349261      1.975081
19
Coordinates from ORCA-job optfreq E -236.003254443827
  C      -2.192108     -0.571003     -0.514183
  C      -0.778635     -0.561474     -0.070729
  C      -2.887189     -1.841365     -0.807506
  C      -2.906924      0.692708     -0.746899
  H      -2.420265      1.216216     -1.591797
  H      -2.765610      1.379660      0.099600
  H      -3.962368      0.563016     -0.988995
  H      -2.603704     -2.148005     -1.832370
  H      -3.973783     -1.731945     -0.804820
  H      -2.570240     -2.662001     -0.158134
  H      -0.298313     -1.006456     -0.975592
  C      -0.148794      0.817685      0.165208
  H      -0.222984      1.468030     -0.711746
  H       0.913259      0.694665      0.392022
  H      -0.604736      1.331126      1.020255
  C      -0.463269     -1.564679      1.079955
  H       0.605846     -1.507949      1.296737
  H      -0.694682     -2.599042      0.818390
  H      -1.008282     -1.292980      1.989435
19
Coordinates from ORCA-job optfreq E -236.003789764983
  C      -2.188588     -0.579985     -0.518751
  C      -0.770601     -0.571371     -0.087870
  C      -2.870260     -1.847937     -0.848738
  C      -2.914909      0.682437     -0.706302
  H      -2.400806      1.295259     -1.466897
  H      -2.824182      1.291902      0.207839
  H      -3.958970      0.555779     -0.993663
  H      -2.633949     -2.097585     -1.899664
  H      -3.957753     -1.758530     -0.787701
  H      -2.512726     -2.692123     -0.252736
  H      -0.284044     -1.064316     -0.960088
  C      -0.127838      0.805721      0.112973
  H      -0.184890      1.425324     -0.787627
  H       0.929943      0.680588      0.358129
  H      -0.584544      1.359702      0.941922
  C      -0.491067     -1.533462      1.113576
  H       0.574237     -1.478213      1.348596
  H      -0.730045     -2.573891      0.885274
  H      -1.051786     -1.223089      2.000558
19
Coordinates from ORCA-job optfreq E -236.004311483518
  C      -2.184538     -0.588892     -0.523163
  C      -0.762048     -0.582256     -0.104978
  C      -2.854284     -1.852255     -0.890360
  C      -2.920495      0.671504     -0.666125
  H      -2.384860      1.364580     -1.332880
  H      -2.880999      1.195936      0.306374
  H      -3.952048      0.552766     -0.997430
  H      -2.667197     -2.044570     -1.962020
  H      -3.939504     -1.786279     -0.771877
  H      -2.458015     -2.716601     -0.350292
  H      -0.269694     -1.120997     -0.942009
  C      -0.107276      0.792075      0.061859
  H      -0.147825      1.380426     -0.860735
  H       0.946120      0.666336      0.325175
  H      -0.564245      1.384742      0.863456
  C      -0.518631     -1.499663      1.145635
  H       0.542406     -1.444103      1.399043
  H      -0.764899     -2.545176      0.951139
  H      -1.094748     -1.151364      2.008015
19
Coordinates from ORCA-job optfreq E -236.004771947686
  C      -2.178587     -0.596528     -0.527814
  C      -0.751592     -0.593093     -0.124489
  C      -2.836195     -1.854319     -0.930811
  C      -2.924944      0.659657     -0.626679
  H      -2.377955      1.423345     -1.194504
  H      -2.936057      1.092879      0.394138
  H      -3.944666      0.550110     -0.995027
  H      -2.701810     -1.988168     -2.018075
  H      -3.915791     -1.817619     -0.753685
  H      -2.400301     -2.734271     -0.449368
  H      -0.253291     -1.176034     -0.922658
  C      -0.084330      0.777049      0.012492
  H      -0.108969      1.335937     -0.929175
  H       0.964717      0.650441      0.292665
  H      -0.540342      1.404732      0.787402
  C      -0.550090     -1.462735      1.174264
  H       0.506324     -1.409701      1.446811
  H      -0.808549     -2.511164      1.014043
  H      -1.140352     -1.074309      2.009300
19
Coordinates from ORCA-job optfreq E -236.005093740279
  C      -2.169035     -0.602459     -0.532319
  C      -0.737581     -0.603530     -0.149350
  C      -2.815363     -1.854735     -0.964915
  C      -2.926832      0.646880     -0.592274
  H      -2.378544      1.467612     -1.064938
  H      -2.986452      0.988713      0.464943
  H      -3.937946      0.543862     -0.985618
  H      -2.738103     -1.927925     -2.062599
  H      -3.885254     -1.853503     -0.727282
  H      -2.339052     -2.745112     -0.545020
  H      -0.231618     -1.226697     -0.905158
  C      -0.059269      0.762016     -0.031440
  H      -0.076510      1.302108     -0.984547
  H       0.987890      0.632995      0.255335
  H      -0.509982      1.412181      0.727382
  C      -0.587597     -1.423887      1.196456
  H       0.464198     -1.379873      1.488148
  H      -0.867436     -2.471649      1.070575
  H      -1.188294     -0.990788      2.001450
19
Coordinates from ORCA-job optfreq E -236.005181058227
  C      -2.163970     -0.601558     -0.533046
  C      -0.732182     -0.602012     -0.159837
  C      -2.809354     -1.856065     -0.960176
  C      -2.926412      0.644363     -0.595104
  H      -2.380605      1.468530     -1.063982
  H      -2.995839      0.979232      0.464534
  H      -3.939040      0.535511     -0.983758
  H      -2.740579     -1.919214     -2.059283
  H      -3.877466     -1.861613     -0.712866
  H      -2.326913     -2.745930     -0.547313
  H      -0.222706     -1.228868     -0.908680
  C      -0.052224      0.762415     -0.032032
  H      -0.084091      1.317272     -0.976169
  H       0.999288      0.628557      0.236329
  H      -0.492968      1.398390      0.744055
  C      -0.599706     -1.419346      1.193485
  H       0.452055     -1.385021      1.487117
  H      -0.892191     -2.464161      1.071726
  H      -1.197877     -0.974270      1.993828
19
Coordinates from ORCA-job optfreq E -236.005223664975
  C      -2.160746     -0.602828     -0.534284
  C      -0.729459     -0.602611     -0.165863
  C      -2.806624     -1.856510     -0.966276
  C      -2.925121      0.642111     -0.586164
  H      -2.376618      1.478497     -1.027995
  H      -3.015432      0.951905      0.480275
  H      -3.932897      0.536253     -0.988156
  H      -2.738214     -1.914431     -2.065483
  H      -3.874406     -1.864613     -0.717644
  H      -2.324384     -2.747374     -0.555871
  H      -0.219210     -1.239001     -0.905857
  C      -0.045895      0.759928     -0.042779
  H      -0.085912      1.315837     -0.985922
  H       1.007698      0.623849      0.216037
  H      -0.479485      1.395129      0.738033
  C      -0.607832     -1.410972      1.197459
  H       0.442209     -1.373244      1.497053
  H      -0.899378     -2.456495      1.082166
  H      -1.211074     -0.959219      1.990100
19
Coordinates from ORCA-job optfreq E -236.005293448602
  C      -2.156245     -0.603210     -0.537327
  C      -0.726051     -0.601907     -0.174468
  C      -2.804840     -1.855939     -0.973871
  C      -2.925782      0.640062     -0.570790
  H      -2.374680      1.494950     -0.969377
  H      -3.055489      0.908210      0.503426
  H      -3.923451      0.538479     -0.999164
  H      -2.717058     -1.920241     -2.071022
  H      -3.875751     -1.858989     -0.741084
  H      -2.334310     -2.746670     -0.549458
  H      -0.215883     -1.252643     -0.902004
  C      -0.033819      0.756051     -0.059192
  H      -0.091850      1.317682     -0.997819
  H       1.024154      0.613111      0.176735
  H      -0.450483      1.386343      0.734821
  C      -0.617682     -1.399255      1.201776
  H       0.428972     -1.349491      1.511782
  H      -0.900105     -2.447657      1.093272
  H      -1.232427     -0.942677      1.982595
19
Coordinates from ORCA-job optfreq E -236.005348826982
  C      -2.153147     -0.603482     -0.539954
  C      -0.723430     -0.604095     -0.181630
  C      -2.802969     -1.853041     -0.985435
  C      -2.927893      0.637675     -0.549156
  H      -2.376238      1.512284     -0.898651
  H      -3.096180      0.856909      0.531169
  H      -3.913916      0.543566     -1.006230
  H      -2.688523     -1.926070     -2.079403
  H      -3.877945     -1.849093     -0.774846
  H      -2.346364     -2.744115     -0.545499
  H      -0.214315     -1.270285     -0.895148
  C      -0.022358      0.749899     -0.079583
  H      -0.091634      1.310269     -1.018123
  H       1.038074      0.600768      0.140785
  H      -0.424906      1.382649      0.719773
  C      -0.626315     -1.385267      1.208216
  H       0.416496     -1.320747      1.528458
  H      -0.897545     -2.437327      1.107819
  H      -1.253672     -0.924285      1.976266
19
Coordinates from ORCA-job optfreq E -236.005421538317
  C      -2.151038     -0.602298     -0.542035
  C      -0.721197     -0.607898     -0.189311
  C      -2.801706     -1.847326     -0.999084
  C      -2.933063      0.635168     -0.517794
  H      -2.383038      1.530986     -0.808675
  H      -3.148198      0.792678      0.564843
  H      -3.903173      0.552067     -1.011114
  H      -2.633072     -1.942097     -2.084485
  H      -3.883742     -1.828877     -0.835699
  H      -2.372317     -2.737425     -0.528435
  H      -0.214613     -1.291004     -0.887386
  C      -0.008795      0.741910     -0.105716
  H      -0.091080      1.299633     -1.044674
  H       1.054266      0.584039      0.095145
  H      -0.392793      1.378694      0.699420
  C      -0.634816     -1.368319      1.215186
  H       0.403543     -1.285148      1.545558
  H      -0.891743     -2.424810      1.123763
  H      -1.276205     -0.903762      1.969322
19
Coordinates from ORCA-job optfreq E -236.005503947679
  C      -2.149584     -0.600807     -0.543033
  C      -0.718096     -0.614993     -0.198453
  C      -2.798710     -1.838944     -1.019469
  C      -2.940197      0.630206     -0.473301
  H      -2.393571      1.548883     -0.684477
  H      -3.210973      0.705410      0.605643
  H      -3.888720      0.567145     -1.011081
  H      -2.562579     -1.958126     -2.090003
  H      -3.886612     -1.806064     -0.915756
  H      -2.402337     -2.728241     -0.516366
  H      -0.214904     -1.317968     -0.876776
  C       0.007063      0.730637     -0.140995
  H      -0.084089      1.277802     -1.085286
  H       1.071556      0.563612      0.045017
  H      -0.358543      1.379424      0.662858
  C      -0.646366     -1.343791      1.224880
  H       0.387741     -1.244901      1.564345
  H      -0.894483     -2.403732      1.148403
  H      -1.299375     -0.869343      1.962678
19
Coordinates from ORCA-job optfreq E -236.005570002045
  C      -2.148813     -0.599088     -0.542339
  C      -0.715401     -0.621580     -0.206362
  C      -2.795550     -1.830062     -1.039077
  C      -2.947546      0.623653     -0.427984
  H      -2.403420      1.558082     -0.556713
  H      -3.275987      0.617762      0.637250
  H      -3.870591      0.587103     -1.012015
  H      -2.488895     -1.977143     -2.088233
  H      -3.886079     -1.782915     -0.999662
  H      -2.436982     -2.717304     -0.502183
  H      -0.216263     -1.340603     -0.868673
  C       0.020863      0.720547     -0.175009
  H      -0.078469      1.256043     -1.125087
  H       1.086367      0.545190     -0.002042
  H      -0.327655      1.381501      0.626170
  C      -0.656322     -1.319489      1.233082
  H       0.376013     -1.214123      1.576359
  H      -0.905188     -2.380493      1.172964
  H      -1.312863     -0.830871      1.958384
19
Coordinates from ORCA-job optfreq E -236.005640088375
  C      -2.149195     -0.597519     -0.540278
  C      -0.713550     -0.627124     -0.210787
  C      -2.793087     -1.821686     -1.056275
  C      -2.955145      0.616526     -0.386899
  H      -2.411434      1.558189     -0.440238
  H      -3.339869      0.542269      0.655985
  H      -3.849163      0.610638     -1.016826
  H      -2.417917     -2.002321     -2.077422
  H      -3.882458     -1.760036     -1.081872
  H      -2.477413     -2.704430     -0.483391
  H      -0.218522     -1.354442     -0.865643
  C       0.029430      0.713606     -0.203012
  H      -0.074614      1.235835     -1.159890
  H       1.095331      0.533167     -0.036885
  H      -0.308082      1.386424      0.592567
  C      -0.660316     -1.299682      1.238511
  H       0.374465     -1.202936      1.577529
  H      -0.923748     -2.358194      1.194460
  H      -1.307494     -0.792073      1.959196
19
Coordinates from ORCA-job optfreq E -236.005708552561
  C      -2.147814     -0.596971     -0.538615
  C      -0.709929     -0.633502     -0.216693
  C      -2.788432     -1.812383     -1.078550
  C      -2.961827      0.605574     -0.340605
  H      -2.422794      1.549535     -0.298636
  H      -3.412310      0.450130      0.666135
  H      -3.819562      0.641458     -1.019501
  H      -2.357646     -2.020834     -2.071500
  H      -3.873856     -1.738236     -1.157959
  H      -2.513625     -2.691835     -0.477497
  H      -0.218422     -1.372722     -0.858842
  C       0.040352      0.704568     -0.235299
  H      -0.067399      1.210220     -1.200594
  H       1.106264      0.519239     -0.073772
  H      -0.286767      1.392244      0.551464
  C      -0.666829     -1.273587      1.245999
  H       0.370310     -1.188286      1.581571
  H      -0.949445     -2.328090      1.223849
  H      -1.303050     -0.740312      1.957874
19
Coordinates from ORCA-job optfreq E -236.005795112489
  C      -2.147012     -0.596723     -0.535976
  C      -0.707362     -0.638385     -0.220302
  C      -2.784336     -1.803366     -1.098725
  C      -2.969048      0.593263     -0.297234
  H      -2.435257      1.531221     -0.164456
  H      -3.485254      0.366982      0.662686
  H      -3.785298      0.676108     -1.023093
  H      -2.299907     -2.044696     -2.058276
  H      -3.862699     -1.714728     -1.233579
  H      -2.556355     -2.677056     -0.467768
  H      -0.219655     -1.386070     -0.854255
  C       0.048501      0.697822     -0.263817
  H      -0.063700      1.188259     -1.236325
  H       1.114522      0.508281     -0.107206
  H      -0.269049      1.398275      0.515140
  C      -0.669186     -1.250553      1.252091
  H       0.371674     -1.181576      1.580570
  H      -0.974266     -2.299279      1.250732
  H      -1.289095     -0.691569      1.958625
19
Coordinates from ORCA-job optfreq E -236.005899093214
  C      -2.146127     -0.597082     -0.533034
  C      -0.704888     -0.643042     -0.223249
  C      -2.780143     -1.794354     -1.118803
  C      -2.976047      0.579031     -0.254295
  H      -2.449756      1.503623     -0.031669
  H      -3.556126      0.288086      0.649214
  H      -3.746925      0.714577     -1.022113
  H      -2.247017     -2.069646     -2.041915
  H      -3.848607     -1.690276     -1.307527
  H      -2.601930     -2.661076     -0.460271
  H      -0.220520     -1.398342     -0.849519
  C       0.055281      0.691570     -0.291272
  H      -0.061218      1.166696     -1.270742
  H       1.121395      0.498591     -0.138776
  H      -0.253915      1.404320      0.479437
  C      -0.670145     -1.227704      1.257935
  H       0.374223     -1.175499      1.579068
  H      -0.997467     -2.269800      1.277430
  H      -1.272847     -0.643465      1.958931
19
Coordinates from ORCA-job optfreq E -236.005990081295
  C      -2.145246     -0.597758     -0.529787
  C      -0.702471     -0.647515     -0.225746
  C      -2.775590     -1.785212     -1.138750
  C      -2.983052      0.563004     -0.211502
  H      -2.466983      1.467118      0.099619
  H      -3.623724      0.213544      0.627061
  H      -3.705613      0.756126     -1.014594
  H      -2.197992     -2.095273     -2.022412
  H      -3.831298     -1.665336     -1.380352
  H      -2.649262     -2.643785     -0.455560
  H      -0.221112     -1.409950     -0.844474
  C       0.061174      0.685524     -0.318237
  H      -0.059597      1.144992     -1.304527
  H       1.127379      0.489646     -0.169331
  H      -0.240352      1.410426      0.443717
  C      -0.670534     -1.204702      1.263589
  H       0.376866     -1.169264      1.577857
  H      -1.019556     -2.239421      1.303769
  H      -1.255816     -0.595954      1.958492
19
Coordinates from ORCA-job optfreq E -236.006074918829
  C      -2.145657     -0.599060     -0.525660
  C      -0.700367     -0.650638     -0.224291
  C      -2.770204     -1.778338     -1.155530
  C      -2.991822      0.546703     -0.176605
  H      -2.484255      1.427106      0.207671
  H      -3.685473      0.158426      0.598797
  H      -3.665184      0.794290     -1.008473
  H      -2.153661     -2.127506     -1.995985
  H      -3.811250     -1.644898     -1.447754
  H      -2.697681     -2.624930     -0.447512
  H      -0.221747     -1.411098     -0.846940
  C       0.061421      0.684391     -0.337562
  H      -0.058399      1.125397     -1.332248
  H       1.127512      0.490908     -0.183950
  H      -0.240310      1.421540      0.411974
  C      -0.664813     -1.187983      1.266233
  H       0.387898     -1.194702      1.565391
  H      -1.056871     -2.206506      1.328010
  H      -1.211917     -0.546892      1.963265
19
Coordinates from ORCA-job optfreq E -236.006122311638
  C      -2.145357     -0.600357     -0.525419
  C      -0.699153     -0.650056     -0.222420
  C      -2.768448     -1.780513     -1.154534
  C      -2.991771      0.546561     -0.183223
  H      -2.483376      1.430278      0.191974
  H      -3.681255      0.166422      0.600214
  H      -3.669644      0.785745     -1.013922
  H      -2.160728     -2.124405     -2.003100
  H      -3.813920     -1.651568     -1.434285
  H      -2.688197     -2.627869     -0.448340
  H      -0.219789     -1.404153     -0.852373
  C       0.058394      0.687846     -0.331544
  H      -0.055850      1.126132     -1.328076
  H       1.124104      0.499339     -0.169206
  H      -0.251017      1.425539      0.414374
  C      -0.662238     -1.190964      1.264427
  H       0.392325     -1.228523      1.554921
  H      -1.082057     -2.198053      1.332693
  H      -1.184803     -0.535189      1.966669
19
Coordinates from ORCA-job optfreq E -236.006165800225
  C      -2.142996     -0.602649     -0.524729
  C      -0.696796     -0.650755     -0.224452
  C      -2.764197     -1.778447     -1.163114
  C      -2.991417      0.538222     -0.170799
  H      -2.491729      1.412842      0.234633
  H      -3.696872      0.139744      0.589952
  H      -3.657808      0.793553     -1.006343
  H      -2.155938     -2.121590     -2.011276
  H      -3.809864     -1.648463     -1.442072
  H      -2.689750     -2.626313     -0.456549
  H      -0.217465     -1.408410     -0.850016
  C       0.060848      0.686525     -0.339449
  H      -0.051882      1.118040     -1.339014
  H       1.126190      0.499273     -0.173151
  H      -0.250154      1.428729      0.401398
  C      -0.665390     -1.180874      1.266696
  H       0.389545     -1.245464      1.551297
  H      -1.111911     -2.175229      1.351807
  H      -1.165196     -0.502523      1.964011
19
Coordinates from ORCA-job optfreq E -236.006216870622
  C      -2.142849     -0.603915     -0.525309
  C      -0.698125     -0.646750     -0.223935
  C      -2.762950     -1.780682     -1.163531
  C      -2.991977      0.536986     -0.174199
  H      -2.491901      1.414918      0.224622
  H      -3.695945      0.144148      0.590873
  H      -3.662197      0.785908     -1.008645
  H      -2.149892     -2.128396     -2.006695
  H      -3.806418     -1.649812     -1.449077
  H      -2.697096     -2.624615     -0.451712
  H      -0.219398     -1.403023     -0.853386
  C       0.058908      0.690677     -0.335601
  H      -0.055128      1.125574     -1.333365
  H       1.124271      0.503387     -0.170021
  H      -0.253673      1.428825      0.408753
  C      -0.663047     -1.183867      1.265533
  H       0.393288     -1.273552      1.537906
  H      -1.129600     -2.167974      1.360957
  H      -1.139052     -0.491628      1.965663
19
Coordinates from ORCA-job optfreq E -236.006278846587
  C      -2.141698     -0.605409     -0.527772
  C      -0.698243     -0.644046     -0.226101
  C      -2.762144     -1.782311     -1.167812
  C      -2.992662      0.533037     -0.170147
  H      -2.495314      1.409663      0.235041
  H      -3.701223      0.136019      0.588266
  H      -3.660885      0.786314     -1.005111
  H      -2.142800     -2.139119     -2.001942
  H      -3.801537     -1.645316     -1.465051
  H      -2.712660     -2.621021     -0.448519
  H      -0.218282     -1.403138     -0.851674
  C       0.059585      0.692156     -0.335961
  H      -0.056939      1.130457     -1.331868
  H       1.124986      0.503484     -0.173010
  H      -0.252916      1.427002      0.411747
  C      -0.662079     -1.181130      1.265478
  H       0.395233     -1.285791      1.528700
  H      -1.140489     -2.158338      1.371348
  H      -1.122712     -0.476303      1.963217
19
Coordinates from ORCA-job optfreq E -236.006385769401
  C      -2.140208     -0.608173     -0.531660
  C      -0.698869     -0.640797     -0.229874
  C      -2.760522     -1.783958     -1.176240
  C      -2.995583      0.523020     -0.157430
  H      -2.501610      1.391624      0.269247
  H      -3.719199      0.115194      0.579422
  H      -3.648850      0.797388     -0.998165
  H      -2.125519     -2.165902     -1.985911
  H      -3.788488     -1.630708     -1.504307
  H      -2.751860     -2.609500     -0.439778
  H      -0.216490     -1.405100     -0.847530
  C       0.060048      0.694143     -0.339966
  H      -0.059089      1.135365     -1.334276
  H       1.125371      0.503517     -0.180145
  H      -0.252653      1.426182      0.410377
  C      -0.658953     -1.174197      1.265876
  H       0.400018     -1.297273      1.513861
  H      -1.151799     -2.142436      1.386080
  H      -1.098526     -0.452176      1.959250
19
Coordinates from ORCA-job optfreq E -236.006539511882
  C      -2.137986     -0.613045     -0.535254
  C      -0.698794     -0.639164     -0.235160
  C      -2.757844     -1.784910     -1.189027
  C      -3.000623      0.505131     -0.133038
  H      -2.510566      1.354058      0.336687
  H      -3.754087      0.079822      0.560005
  H      -3.618249      0.824644     -0.985784
  H      -2.102877     -2.205647     -1.960861
  H      -3.766391     -1.605949     -1.562910
  H      -2.813776     -2.588787     -0.430042
  H      -0.212349     -1.409938     -0.841137
  C       0.060069      0.695691     -0.350372
  H      -0.058929      1.134902     -1.345619
  H       1.125075      0.504373     -0.190390
  H      -0.255360      1.428640      0.397763
  C      -0.653852     -1.161394      1.267639
  H       0.406786     -1.300698      1.498908
  H      -1.160136     -2.120545      1.403654
  H      -1.072891     -0.420974      1.953767
19
Coordinates from ORCA-job optfreq E -236.006733203392
  C      -2.135503     -0.620079     -0.536080
  C      -0.697976     -0.639554     -0.240245
  C      -2.754313     -1.785185     -1.202985
  C      -3.006996      0.481129     -0.100434
  H      -2.521557      1.297080      0.429998
  H      -3.803052      0.038831      0.527267
  H      -3.566854      0.866714     -0.967155
  H      -2.080449     -2.250590     -1.929524
  H      -3.736699     -1.576193     -1.629798
  H      -2.889134     -2.560888     -0.423655
  H      -0.207261     -1.415822     -0.834924
  C       0.058616      0.696950     -0.366689
  H      -0.056320      1.126542     -1.366628
  H       1.123013      0.507558     -0.201030
  H      -0.263302      1.435824      0.372517
  C      -0.646954     -1.145160      1.270667
  H       0.415152     -1.295160      1.487493
  H      -1.163063     -2.096861      1.421602
  H      -1.050129     -0.388927      1.948432
19
Coordinates from ORCA-job optfreq E -236.006964889425
  C      -2.133432     -0.629080     -0.534401
  C      -0.697278     -0.640517     -0.244135
  C      -2.751994     -1.788007     -1.211091
  C      -3.013363      0.457361     -0.071897
  H      -2.530381      1.234721      0.517279
  H      -3.854028      0.012019      0.486291
  H      -3.501541      0.913418     -0.949400
  H      -2.066636     -2.294834     -1.895951
  H      -3.705817     -1.548811     -1.687514
  H      -2.966833     -2.531372     -0.417573
  H      -0.202088     -1.418846     -0.831739
  C       0.053526      0.699905     -0.381754
  H      -0.052784      1.116185     -1.388302
  H       1.116957      0.516147     -0.204236
  H      -0.280915      1.446004      0.344284
  C      -0.636784     -1.132997      1.273067
  H       0.427624     -1.283256      1.477215
  H      -1.153781     -2.082725      1.433076
  H      -1.033234     -0.369105      1.945610
19
Coordinates from ORCA-job optfreq E -236.007313456106
  C      -2.132290     -0.641772     -0.528940
  C      -0.697405     -0.641400     -0.247483
  C      -2.755877     -1.800537     -1.198145
  C      -3.016610      0.443587     -0.063526
  H      -2.528477      1.181987      0.572407
  H      -3.905375      0.025938      0.429841
  H      -3.405507      0.966480     -0.955200
  H      -2.076975     -2.331227     -1.869478
  H      -3.690831     -1.532273     -1.701928
  H      -3.033292     -2.511418     -0.395353
  H      -0.196404     -1.414436     -0.836813
  C       0.039580      0.708218     -0.387123
  H      -0.046140      1.109452     -1.401834
  H       1.100585      0.538585     -0.183083
  H      -0.322807      1.460245      0.319108
  C      -0.619218     -1.137106      1.271307
  H       0.450801     -1.251817      1.467039
  H      -1.106491     -2.104252      1.418520
  H      -1.040045     -0.392045      1.949513
19
Coordinates from ORCA-job optfreq E -236.007504506532
  C      -2.131801     -0.649484     -0.522130
  C      -0.695671     -0.644089     -0.248960
  C      -2.755407     -1.803297     -1.198054
  C      -3.020066      0.426092     -0.040301
  H      -2.548251      1.108961      0.667039
  H      -3.957653      0.020097      0.358937
  H      -3.312534      1.021446     -0.925259
  H      -2.071223     -2.359584     -1.841929
  H      -3.670326     -1.520490     -1.731451
  H      -3.081796     -2.490432     -0.392492
  H      -0.194338     -1.414451     -0.841296
  C       0.031569      0.710851     -0.404351
  H      -0.044189      1.090901     -1.427838
  H       1.091171      0.552324     -0.184069
  H      -0.345630      1.472700      0.283199
  C      -0.610547     -1.128492      1.271031
  H       0.460494     -1.238228      1.464568
  H      -1.095389     -2.096136      1.423820
  H      -1.031193     -0.382477      1.948366
19
Coordinates from ORCA-job optfreq E -236.007822966198
  C      -2.134330     -0.655380     -0.511408
  C      -0.694936     -0.645013     -0.247535
  C      -2.761946     -1.813047     -1.174059
  C      -3.018469      0.429492     -0.046611
  H      -2.566298      1.067002      0.715348
  H      -4.000890      0.059628      0.266290
  H      -3.201362      1.072154     -0.929784
  H      -2.084619     -2.366723     -1.828135
  H      -3.682557     -1.531762     -1.700247
  H      -3.087190     -2.495038     -0.364569
  H      -0.196546     -1.403291     -0.858359
  C       0.016395      0.718609     -0.406882
  H      -0.044968      1.081147     -1.437544
  H       1.073736      0.577733     -0.164045
  H      -0.383607      1.484957      0.262753
  C      -0.596617     -1.140858      1.263830
  H       0.476095     -1.223127      1.462406
  H      -1.057905     -2.122032      1.402945
  H      -1.036767     -0.418241      1.954437
19
Coordinates from ORCA-job optfreq E -236.008036954846
  C      -2.139576     -0.655689     -0.502211
  C      -0.695604     -0.643005     -0.244259
  C      -2.770372     -1.821594     -1.146379
  C      -3.014220      0.444591     -0.065123
  H      -2.585515      1.054450      0.733471
  H      -4.028316      0.109925      0.175972
  H      -3.111486      1.106520     -0.949221
  H      -2.095020     -2.365601     -1.812334
  H      -3.706235     -1.560318     -1.653873
  H      -3.063364     -2.510502     -0.330684
  H      -0.204367     -1.386311     -0.880173
  C       0.002142      0.727166     -0.400225
  H      -0.060203      1.086159     -1.431920
  H       1.059953      0.599155     -0.152151
  H      -0.409185      1.488190      0.268917
  C      -0.584862     -1.160313      1.251982
  H       0.487871     -1.228239      1.457471
  H      -1.030348     -2.150138      1.380852
  H      -1.034074     -0.458236      1.958718
19
Coordinates from ORCA-job optfreq E -236.008101711316
  C      -2.142492     -0.653060     -0.501998
  C      -0.697153     -0.639953     -0.244291
  C      -2.774279     -1.825196     -1.135143
  C      -3.011145      0.457027     -0.080744
  H      -2.582962      1.078707      0.708867
  H      -4.026840      0.128568      0.163477
  H      -3.109064      1.103037     -0.976596
  H      -2.101359     -2.356042     -1.814788
  H      -3.723859     -1.579550     -1.622565
  H      -3.032358     -2.525124     -0.317170
  H      -0.208267     -1.380529     -0.885767
  C       0.001024      0.729542     -0.389624
  H      -0.073863      1.103089     -1.415334
  H       1.061529      0.598698     -0.155469
  H      -0.402483      1.480592      0.295444
  C      -0.584891     -1.170466      1.246370
  H       0.487509     -1.233848      1.455489
  H      -1.023139     -2.163884      1.371149
  H      -1.038687     -0.475397      1.957523
19
Coordinates from ORCA-job optfreq E -236.008140628687
  C      -2.145797     -0.653366     -0.502158
  C      -0.699674     -0.636248     -0.246696
  C      -2.777735     -1.831452     -1.125075
  C      -3.011376      0.462837     -0.090935
  H      -2.587795      1.082982      0.702261
  H      -4.035722      0.149807      0.133080
  H      -3.083309      1.108997     -0.990142
  H      -2.104060     -2.361315     -1.804814
  H      -3.732177     -1.595222     -1.606361
  H      -3.020867     -2.530869     -0.301971
  H      -0.210989     -1.375236     -0.890607
  C      -0.002116      0.732995     -0.381558
  H      -0.092817      1.124092     -1.399506
  H       1.061706      0.598774     -0.165785
  H      -0.395881      1.471840      0.322286
  C      -0.582685     -1.176903      1.240426
  H       0.490424     -1.238907      1.446684
  H      -1.015881     -2.172359      1.365300
  H      -1.036027     -0.484236      1.954400
19
Coordinates from ORCA-job optfreq E -236.008152114273
  C      -2.146792     -0.652657     -0.503687
  C      -0.701072     -0.634542     -0.247838
  C      -2.777893     -1.833345     -1.122659
  C      -3.011503      0.465237     -0.096566
  H      -2.586806      1.091963      0.690762
  H      -4.034976      0.152693      0.132936
  H      -3.086304      1.105683     -0.999716
  H      -2.107661     -2.359334     -1.808774
  H      -3.737305     -1.600654     -1.595468
  H      -3.008330     -2.535897     -0.298584
  H      -0.211511     -1.375030     -0.889396
  C      -0.001138      0.733155     -0.377090
  H      -0.100073      1.135049     -1.390165
  H       1.064334      0.594481     -0.172804
  H      -0.385608      1.467138      0.337018
  C      -0.584331     -1.177990      1.239685
  H       0.488999     -1.240212      1.444474
  H      -1.016778     -2.173936      1.363106
  H      -1.038032     -0.485591      1.953596
19
Coordinates from ORCA-job optfreq E -236.008157169817
  C      -2.147331     -0.652997     -0.504089
  C      -0.701824     -0.634186     -0.248341
  C      -2.777887     -1.834783     -1.121280
  C      -3.012272      0.465025     -0.098683
  H      -2.588568      1.090982      0.689979
  H      -4.037455      0.155539      0.126301
  H      -3.079408      1.107405     -1.001307
  H      -2.109031     -2.362337     -1.807548
  H      -3.737986     -1.602593     -1.592946
  H      -3.006421     -2.536470     -0.295830
  H      -0.211136     -1.374359     -0.889303
  C      -0.002040      0.733611     -0.375600
  H      -0.106320      1.141427     -1.385824
  H       1.064610      0.592971     -0.178767
  H      -0.380747      1.464932      0.344391
  C      -0.584157     -1.177903      1.239543
  H       0.489457     -1.240806      1.442387
  H      -1.017212     -2.173739      1.361896
  H      -1.037053     -0.485509      1.953851
19
Coordinates from ORCA-job optfreq E -236.008158465343
  C      -2.147289     -0.652990     -0.504087
  C      -0.701887     -0.634528     -0.248066
  C      -2.777730     -1.834804     -1.121122
  C      -3.012257      0.465075     -0.099505
  H      -2.588953      1.090972      0.689506
  H      -4.037562      0.155655      0.125004
  H      -3.078061      1.107899     -1.001906
  H      -2.109817     -2.362456     -1.808294
  H      -3.738514     -1.603010     -1.591577
  H      -3.004673     -2.536950     -0.295560
  H      -0.210730     -1.374334     -0.889002
  C      -0.002345      0.733538     -0.375470
  H      -0.108947      1.143212     -1.384718
  H       1.064847      0.592144     -0.181909
  H      -0.378207      1.464267      0.346628
  C      -0.584376     -1.177738      1.240080
  H       0.489200     -1.240253      1.443060
  H      -1.017639     -2.173632      1.361293
  H      -1.037841     -0.485856      1.954475
19
Coordinates from ORCA-job optfreq E -236.008158885621
  C      -2.147241     -0.653067     -0.503972
  C      -0.701856     -0.634830     -0.247722
  C      -2.777788     -1.834829     -1.120886
  C      -3.012108      0.465319     -0.100108
  H      -2.589218      1.090620      0.689644
  H      -4.037760      0.156365      0.123316
  H      -3.076309      1.108695     -1.002211
  H      -2.110148     -2.362693     -1.808205
  H      -3.738836     -1.603451     -1.590966
  H      -3.004218     -2.537002     -0.295161
  H      -0.210513     -1.374162     -0.889046
  C      -0.002786      0.733596     -0.375470
  H      -0.110981      1.144100     -1.384207
  H       1.064765      0.592054     -0.183876
  H      -0.377248      1.463804      0.347883
  C      -0.584236     -1.177932      1.240350
  H       0.489298     -1.239654      1.443723
  H      -1.017148     -2.174056      1.360879
  H      -1.038449     -0.486666      1.954865
19
Coordinates from ORCA-job optfreq E -236.008159068190
  C      -2.147205     -0.653135     -0.503960
  C      -0.701841     -0.635021     -0.247451
  C      -2.777843     -1.834806     -1.120879
  C      -3.011943      0.465525     -0.100454
  H      -2.589317      1.090350      0.689826
  H      -4.037777      0.156775      0.122401
  H      -3.075438      1.109233     -1.002336
  H      -2.110266     -2.362719     -1.808238
  H      -3.739040     -1.603699     -1.590774
  H      -3.004082     -2.536952     -0.295049
  H      -0.210458     -1.374195     -0.888941
  C      -0.003019      0.733584     -0.375517
  H      -0.112356      1.144508     -1.383959
  H       1.064766      0.591967     -0.185225
  H      -0.376651      1.463415      0.348650
  C      -0.584128     -1.178046      1.240557
  H       0.489371     -1.239022      1.444310
  H      -1.016546     -2.174401      1.360854
  H      -1.039007     -0.487151      1.955015
19
Coordinates from ORCA-job optfreq E -236.008159214234
  C      -2.147200     -0.653234     -0.504031
  C      -0.701859     -0.635191     -0.247197
  C      -2.777885     -1.834767     -1.121073
  C      -3.011822      0.465629     -0.100643
  H      -2.589343      1.089948      0.690122
  H      -4.037788      0.157025      0.121811
  H      -3.074893      1.109693     -1.002264
  H      -2.110243     -2.362825     -1.808244
  H      -3.739052     -1.603727     -1.591057
  H      -3.004384     -2.536718     -0.295122
  H      -0.210475     -1.374370     -0.888706
  C      -0.003200      0.733517     -0.375587
  H      -0.113513      1.144706     -1.383806
  H       1.064760      0.591843     -0.186348
  H      -0.376226      1.463021      0.349214
  C      -0.583962     -1.178040      1.240767
  H       0.489526     -1.238355      1.444781
  H      -1.015851     -2.174615      1.361127
  H      -1.039368     -0.487330      1.955083
19
Coordinates from ORCA-job optfreq E -236.008159297437
  C      -2.147219     -0.653315     -0.504097
  C      -0.701885     -0.635275     -0.247104
  C      -2.777874     -1.834722     -1.121353
  C      -3.011818      0.465518     -0.100510
  H      -2.589392      1.089485      0.690560
  H      -4.037842      0.156930      0.121719
  H      -3.074769      1.109893     -1.001908
  H      -2.110124     -2.362937     -1.808274
  H      -3.738876     -1.603494     -1.591605
  H      -3.004881     -2.536481     -0.295365
  H      -0.210528     -1.374585     -0.888491
  C      -0.003244      0.733435     -0.375704
  H      -0.113756      1.144546     -1.383930
  H       1.064740      0.591775     -0.186625
  H      -0.376225      1.462928      0.349129
  C      -0.583851     -1.177876      1.240889
  H       0.489647     -1.238095      1.444887
  H      -1.015610     -2.174478      1.361535
  H      -1.039271     -0.487040      1.955079
