5
Coordinates from ORCA-job optfreq E -40.533314219757
  C      -2.698880      2.152240      0.000000
  H      -1.628880      2.152240      0.000000
  H      -3.055540      2.732050      0.825530
  H      -3.055550      1.147400      0.089370
  H      -3.055550      2.577250     -0.914900
5
Coordinates from ORCA-job optfreq E -40.534013561507
  C      -2.698884      2.152246     -0.000029
  H      -1.613182      2.152260     -0.000000
  H      -3.060765      2.740529      0.837661
  H      -3.060802      1.132657      0.090709
  H      -3.060767      2.583488     -0.928341
5
Coordinates from ORCA-job optfreq E -40.534014443206
  C      -2.698886      2.152251     -0.000046
  H      -1.612625      2.152270      0.000004
  H      -3.060944      2.740810      0.838100
  H      -3.060998      1.132140      0.090772
  H      -3.060947      2.583709     -0.928830
5
Coordinates from ORCA-job optfreq E -40.534014444902
  C      -2.698887      2.152253     -0.000055
  H      -1.612599      2.152275      0.000007
  H      -3.060949      2.740812      0.838125
  H      -3.061011      1.132119      0.090784
  H      -3.060954      2.583721     -0.928861
