{
    "niv": {
        "branch": "master",
        "description": "Easy dependency management for Nix projects",
        "homepage": "https://github.com/nmattia/niv",
        "owner": "nmattia",
        "repo": "niv",
        "rev": "5830a4dd348d77e39a0f3c4c762ff2663b602d4c",
        "sha256": "1d3lsrqvci4qz2hwjrcnd8h5vfkg8aypq3sjd4g3izbc8frwz5sm",
        "type": "tarball",
        "url": "https://github.com/nmattia/niv/archive/5830a4dd348d77e39a0f3c4c762ff2663b602d4c.tar.gz",
        "url_template": "https://github.com/<owner>/<repo>/archive/<rev>.tar.gz"
    },
    "nixpkgs": {
        "branch": "nixpkgs-unstable",
        "description": "Nix Packages collection",
        "homepage": "",
        "owner": "NixOS",
        "repo": "nixpkgs",
        "rev": "98747f27ecfee70c8c97b195cbb94df80a074dda",
        "sha256": "04ss525ns5qqlggrdhvc6y4hqmshylda9yd0y99ddliyn15wmf27",
        "type": "tarball",
        "url": "https://github.com/NixOS/nixpkgs/archive/98747f27ecfee70c8c97b195cbb94df80a074dda.tar.gz",
        "url_template": "https://github.com/<owner>/<repo>/archive/<rev>.tar.gz"
    }
}
