   2.40000000000000        43158.3000000000     
   2.41329423264907        42182.8218804152     
   2.42658846529814        41296.6115325420     
   2.43988269794721        40490.4761087576     
   2.45317693059629        39755.2227614388     
   2.46647116324536        39081.6586429626     
   2.47976539589443        38460.5909057060     
   2.49305962854350        37882.8267020459     
   2.50635386119257        37339.7079379052     
   2.51964809384164        36826.1293976420     
   2.53294232649071        36340.6644550720     
   2.54623655913978        35882.5026022094     
   2.55953079178886        35450.8333310684     
   2.57282502443793        35044.8461336632     
   2.58611925708700        34663.7305020080     
   2.59941348973607        34306.6759281170     
   2.61270772238514        33972.8894348043     
   2.62600195503421        33661.3827151015     
   2.63929618768328        33371.1736654424     
   2.65259042033236        33101.2821030422     
   2.66588465298143        32850.7278451164     
   2.67917888563050        32618.5307088804     
   2.69247311827957        32403.7105115495     
   2.70576735092864        32205.2819463619     
   2.71906158357771        32022.0662193569     
   2.73235581622678        31852.6539916955     
   2.74565004887586        31695.6236793923     
   2.75894428152493        31549.5536984622     
   2.77223851417400        31413.0224649198     
   2.78553274682307        31284.6083947798     
   2.79882697947214        31162.8899040571     
   2.81212121212121        31046.5801606036     
   2.82541544477028        30935.0950829630     
   2.83870967741935        30828.0791930500     
   2.85200391006843        30725.1771259288     
   2.86529814271750        30626.0335166634     
   2.87859237536657        30530.2930003181     
   2.89188660801564        30437.6002119570     
   2.90518084066471        30347.6038462970     
   2.91847507331378        30260.1202243579     
   2.93176930596285        30175.1894327171     
   2.94506353861193        30092.8671265325     
   2.95835777126100        30013.2089609619     
   2.97165200391007        29936.2705911631     
   2.98494623655914        29862.1076722938     
   2.99824046920821        29790.7758595120     
   3.01153470185728        29722.3141178557     
   3.02482893450635        29656.6616916780     
   3.03812316715543        29593.7209636984     
   3.05141739980450        29533.3942553123     
   3.06471163245357        29475.5838879151     
   3.07800586510264        29420.1921829022     
   3.09130009775171        29367.1214616691     
   3.10459433040078        29316.2742823214     
   3.11788856304985        29267.5660839403     
   3.13118279569892        29220.9316473484     
   3.14447702834800        29176.3073413561     
   3.15777126099707        29133.6295347740     
   3.17106549364614        29092.8345964126     
   3.18435972629521        29053.8588950824     
   3.19765395894428        29016.6387995939     
   3.21094819159335        28981.1111243679     
   3.22424242424242        28947.2157205455     
   3.23753665689150        28914.8937208854     
   3.25083088954057        28884.0862607098     
   3.26412512218964        28854.7344753414     
   3.27741935483871        28826.7795001025     
   3.29071358748778        28800.1624703156     
   3.30400782013685        28774.8246196614     
   3.31730205278592        28750.7145873039     
   3.33059628543499        28727.7935268125     
   3.34389051808407        28706.0237959897     
   3.35718475073314        28685.3677526379     
   3.37047898338221        28665.7877545597     
   3.38377321603128        28647.2461595575     
   3.39706744868035        28629.7053254338     
   3.41036168132942        28613.1289051659     
   3.42365591397849        28597.4907711227     
   3.43695014662757        28582.7696516134     
   3.45024437927664        28568.9443032528     
   3.46353861192571        28555.9934826555     
   3.47683284457478        28543.8959464364     
   3.49012707722385        28532.6304512102     
   3.50342130987292        28522.1757858269     
   3.51671554252199        28512.5142755404     
   3.53000977517107        28503.6349836571     
   3.54330400782014        28495.5277277762     
   3.55659824046921        28488.1823254967     
   3.56989247311828        28481.5885944180     
   3.58318670576735        28475.7363521390     
   3.59648093841642        28470.6154162590     
   3.60977517106549        28466.2158407439     
   3.62306940371456        28462.5298326840     
   3.63636363636364        28459.5507564634     
   3.64965786901271        28457.2719867963     
   3.66295210166178        28455.6868983968     
   3.67624633431085        28454.7888659790     
   3.68954056695992        28454.5712642569     
   3.70283479960899        28455.0274599215     
   3.71612903225806        28456.1492625534     
   3.72942326490714        28457.9251394941     
   3.74271749755621        28460.3431239294     
   3.75601173020528        28463.3912490450     
   3.76930596285435        28467.0575480267     
   3.78260019550342        28471.3300540602     
   3.79589442815249        28476.1968003312     
   3.80918866080156        28481.6455252349     
   3.82248289345064        28487.6608201381     
   3.83577712609971        28494.2253778933     
   3.84907135874878        28501.3218644491     
   3.86236559139785        28508.9329457537     
   3.87565982404692        28517.0412877558     
   3.88895405669599        28525.6295564037     
   3.90224828934506        28534.6804026018     
   3.91554252199413        28544.1714046404     
   3.92883675464321        28554.0677974343     
   3.94213098729228        28564.3329727899     
   3.95542521994135        28574.9303225134     
   3.96871945259042        28585.8232384113     
   3.98201368523949        28596.9751122896     
   3.99530791788856        28608.3493359548     
   4.00860215053763        28619.9107539080     
   4.02189638318671        28631.6423526192     
   4.03519061583578        28643.5394526161     
   4.04848484848485        28655.5976097486     
   4.06177908113392        28667.8123798664     
   4.07507331378299        28680.1793188194     
   4.08836754643206        28692.6939824575     
   4.10166177908113        28705.3519267084     
   4.11495601173021        28718.1486572131     
   4.12825024437928        28731.0795423000     
   4.14154447702835        28744.1399265717     
   4.15483870967742        28757.3251546305     
   4.16813294232649        28770.6305710788     
   4.18142717497556        28784.0515205192     
   4.19472140762463        28797.5833475541     
   4.20801564027371        28811.2205406542     
   4.22130987292278        28824.9449238270     
   4.23460410557185        28838.7286477538     
   4.24789833822092        28852.5436184674     
   4.26119257086999        28866.3617420001     
   4.27448680351906        28880.1549243846     
   4.28778103616813        28893.8950716535     
   4.30107526881720        28907.5540886553     
   4.31436950146628        28921.1008392036     
   4.32766373411535        28934.4946300061     
   4.34095796676442        28947.6928949059     
   4.35425219941349        28960.6530677461     
   4.36754643206256        28973.3325823699     
   4.38084066471163        28985.6888726203     
   4.39413489736070        28997.6793723405     
   4.40742913000978        29009.2619445945     
   4.42072336265885        29020.4020530839     
   4.43401759530792        29031.0716793964     
   4.44731182795699        29041.2430164633     
   4.46060606060606        29050.8882572164     
   4.47390029325513        29059.9795945870     
   4.48719452590420        29068.4892215067     
   4.50048875855328        29076.3893309894     
   4.51378299120235        29083.6620098188     
   4.52707722385142        29090.3247877939     
   4.54037145650049        29096.4031301032     
   4.55366568914956        29101.9225019351     
   4.56695992179863        29106.9083684779     
   4.58025415444770        29111.3861949202     
   4.59354838709677        29115.3814464503     
   4.60684261974585        29118.9191896758     
   4.62013685239492        29122.0159407516     
   4.63343108504399        29124.6799840553     
   4.64672531769306        29126.9192708674     
   4.66001955034213        29128.7417524684     
   4.67331378299120        29130.1553801386     
   4.68660801564027        29131.1681051585     
   4.69990224828935        29131.7878788086     
   4.71319648093842        29132.0218350522     
   4.72649071358749        29131.8737683985     
   4.73978494623656        29131.3466184444     
   4.75307917888563        29130.4433251613     
   4.76637341153470        29129.1668285207     
   4.77966764418377        29127.5200684941     
   4.79296187683285        29125.5059850529     
   4.80625610948192        29123.1274775010     
   4.81955034213099        29120.3863763771     
   4.83284457478006        29117.2833561784     
   4.84613880742913        29113.8190342861     
   4.85943304007820        29109.9940280814     
   4.87272727272727        29105.8089549455     
   4.88602150537635        29101.2644322596     
   4.89931573802542        29096.3610774048     
   4.91260997067449        29091.0980446870     
   4.92590420332356        29085.4676596620     
   4.93919843597263        29079.4602553263     
   4.95249266862170        29073.0661647485     
   4.96578690127077        29066.2757209975     
   4.97908113391984        29059.0792571419     
   4.99237536656892        29051.4671062504     
   5.00566959921799        29043.4299349335     
   5.01896383186706        29034.9695681307     
   5.03225806451613        29026.1013505469     
   5.04555229716520        29016.8414391599     
   5.05884652981427        29007.2059909472     
   5.07214076246334        28997.2111628866     
   5.08543499511242        28986.8731119558     
   5.09872922776149        28976.2079951324     
   5.11202346041056        28965.2323692436     
   5.12531769305963        28953.9649281317     
   5.13861192570870        28942.4250741228     
   5.15190615835777        28930.6322103760     
   5.16520039100684        28918.6057400503     
   5.17849462365591        28906.3650663049     
   5.19178885630499        28893.9295922989     
   5.20508308895406        28881.3186895446     
   5.21837732160313        28868.5503732243     
   5.23167155425220        28855.6408109010     
   5.24496578690127        28842.6060381312     
   5.25826001955034        28829.4620904715     
   5.27155425219941        28816.2250034784     
   5.28484848484849        28802.9108127084     
   5.29814271749756        28789.5355537180     
   5.31143695014663        28776.1141477645     
   5.32473118279570        28762.6547077944     
   5.33802541544477        28749.1627749533     
   5.35131964809384        28735.6438857502     
   5.36461388074291        28722.1035766939     
   5.37790811339199        28708.5473842935     
   5.39120234604106        28694.9808450579     
   5.40449657869013        28681.4094879894     
   5.41779081133920        28667.8384095819     
   5.43108504398827        28654.2720443913     
   5.44437927663734        28640.7147710785     
   5.45767350928641        28627.1709683042     
   5.47096774193548        28613.6450147292     
   5.48426197458456        28600.1412890143     
   5.49755620723363        28586.6641698203     
   5.51085043988270        28573.2182405408     
   5.52414467253177        28559.8095215536     
   5.53743890518084        28546.4446486335     
   5.55073313782991        28533.1302598940     
   5.56402737047898        28519.8729934487     
   5.57732160312805        28506.6794874111     
   5.59061583577713        28493.5563798947     
   5.60391006842620        28480.5102916431     
   5.61720430107527        28467.5464312309     
   5.63049853372434        28454.6675754132     
   5.64379276637341        28441.8762604619     
   5.65708699902248        28429.1750226490     
   5.67038123167156        28416.5663982462     
   5.68367546432063        28404.0529235254     
   5.69696969696970        28391.6371347585     
   5.71026392961877        28379.3215937778     
   5.72355816226784        28367.1090685097     
   5.73685239491691        28355.0024270362     
   5.75014662756598        28343.0045380252     
   5.76344086021505        28331.1182701450     
   5.77673509286413        28319.3464920635     
   5.79002932551320        28307.6920724490     
   5.80332355816227        28296.1578794895     
   5.81661779081134        28284.7467129264     
   5.82991202346041        28273.4612403259     
   5.84320625610948        28262.3041139500     
   5.85650048875855        28251.2779860604     
   5.86979472140763        28240.3855089190     
   5.88308895405670        28229.6293347876     
   5.89638318670577        28219.0121159281     
   5.90967741935484        28208.5364601337     
   5.92297165200391        28198.2045570575     
   5.93626588465298        28188.0183681413     
   5.94956011730205        28177.9798523960     
   5.96285434995113        28168.0909688326     
   5.97614858260020        28158.3536764620     
   5.98944281524927        28148.7699342951     
   6.00273704789834        28139.3417002536     
   6.01603128054741        28130.0706938663     
   6.02932551319648        28120.9581126225     
   6.04261974584555        28112.0050845294     
   6.05591397849462        28103.2127375943     
   6.06920821114370        28094.5821998244     
   6.08250244379277        28086.1145992269     
   6.09579667644184        28077.8110638093     
   6.10909090909091        28069.6727081588     
   6.12238514173998        28061.7004983562     
   6.13567937438905        28053.8953096142     
   6.14897360703812        28046.2580156732     
   6.16226783968719        28038.7894902734     
   6.17556207233627        28031.4906071553     
   6.18885630498534        28024.3622400591     
   6.20215053763441        28017.4052623184     
   6.21544477028348        28010.6203467407     
   6.22873900293255        28004.0076691332     
   6.24203323558162        27997.5673291787     
   6.25532746823069        27991.2994265600     
   6.26862170087977        27985.2040609602     
   6.28191593352884        27979.2813320621     
   6.29521016617791        27973.5313395487     
   6.30850439882698        27967.9541664356     
   6.32179863147605        27962.5496794248     
   6.33509286412512        27957.3175960160     
   6.34838709677419        27952.2576305598     
   6.36168132942327        27947.3694974071     
   6.37497556207234        27942.6529109086     
   6.38826979472141        27938.1075854149     
   6.40156402737048        27933.7332354008     
   6.41485826001955        27929.5295561020     
   6.42815249266862        27925.4961901261     
   6.44144672531769        27921.6327706404     
   6.45474095796677        27917.9389308124     
   6.46803519061584        27914.4143038095     
   6.48132942326491        27911.0585227990     
   6.49462365591398        27907.8712209482     
   6.50791788856305        27904.8520555787     
   6.52121212121212        27902.0010491908     
   6.53450635386119        27899.3185094499     
   6.54780058651027        27896.8047513939     
   6.56109481915934        27894.4600900610     
   6.57438905180841        27892.2848404893     
   6.58768328445748        27890.2793177169     
   6.60097751710655        27888.4438368855     
   6.61427174975562        27886.7785945100     
   6.62756598240469        27885.2834078724     
   6.64086021505376        27883.9580180389     
   6.65415444770284        27882.8021660757     
   6.66744868035191        27881.8155930492     
   6.68074291300098        27880.9980400256     
   6.69403714565005        27880.3492480712     
   6.70733137829912        27879.8689487377     
   6.72062561094819        27879.5566967157     
   6.73391984359726        27879.4118928801     
   6.74721407624633        27879.4339327657     
   6.76050830889541        27879.6222119077     
   6.77380254154448        27879.9761258409     
   6.78709677419355        27880.4950701003     
   6.80039100684262        27881.1784403629     
   6.81368523949169        27882.0256312533     
   6.82697947214076        27883.0360355226     
   6.84027370478983        27884.2090452547     
   6.85356793743891        27885.5440525339     
   6.86686217008798        27887.0404494440     
   6.88015640273705        27888.6976280693     
   6.89345063538612        27890.5149804936     
   6.90674486803519        27892.4919009311     
   6.92003910068426        27894.6278274356     
   6.93333333333333        27896.9222418888     
   6.94662756598241        27899.3746278577     
   6.95992179863148        27901.9844689095     
   6.97321603128055        27904.7512486114     
   6.98651026392962        27907.6744505303     
   6.99980449657869        27910.7535582333     
   7.01309872922776        27913.9879571820     
   7.02639296187683        27917.3766217411     
   7.03968719452590        27920.9184193769     
   7.05298142717498        27924.6122174206     
   7.06627565982405        27928.4568832039     
   7.07956989247312        27932.4512840582     
   7.09286412512219        27936.5942873148     
   7.10615835777126        27940.8847579524     
   7.11945259042033        27945.3214921803     
   7.13274682306940        27949.9032113389     
   7.14604105571848        27954.6286327726     
   7.15933528836755        27959.4964738256     
   7.17262952101662        27964.5054518425     
   7.18592375366569        27969.6542841676     
   7.19921798631476        27974.9416881453     
   7.21251221896383        27980.3663876509     
   7.22580645161290        27985.9271367586     
   7.23910068426198        27991.6226990293     
   7.25239491691105        27997.4518379015     
   7.26568914956012        28003.4133168137     
   7.27898338220919        28009.5058992044     
   7.29227761485826        28015.7283485122     
   7.30557184750733        28022.0794309838     
   7.31886608015640        28028.5580062411     
   7.33216031280547        28035.1630500359     
   7.34545454545455        28041.8935451716     
   7.35874877810362        28048.7484744517     
   7.37204301075269        28055.7268206796     
   7.38533724340176        28062.8275666588     
   7.39863147605083        28070.0496951925     
   7.41192570869990        28077.3921849332     
   7.42521994134897        28084.8539909536     
   7.43851417399805        28092.4340607581     
   7.45180840664712        28100.1313417369     
   7.46510263929619        28107.9447812801     
   7.47839687194526        28115.8733267779     
   7.49169110459433        28123.9159256203     
   7.50498533724340        28132.0715247407     
   7.51827956989247        28140.3390454421     
   7.53157380254155        28148.7173741892     
   7.54486803519062        28157.2053947577     
   7.55816226783969        28165.8019909235     
   7.57145650048876        28174.5060464622     
   7.58475073313783        28183.3164451498     
   7.59804496578690        28192.2320707619     
   7.61133919843597        28201.2518152798     
   7.62463343108504        28210.3746210993     
   7.63792766373412        28219.5994504578     
   7.65122189638319        28228.9252655398     
   7.66451612903226        28238.3510285300     
   7.67781036168133        28247.8757016128     
   7.69110459433040        28257.4982469730     
   7.70439882697947        28267.2176255439     
   7.71769305962854        28277.0327162010     
   7.73098729227762        28286.9422704652     
   7.74428152492669        28296.9450286953     
   7.75757575757576        28307.0397312500     
   7.77086999022483        28317.2251184880     
   7.78416422287390        28327.4999307681     
   7.79745845552297        28337.8629084491     
   7.81075268817204        28348.3127912001     
   7.82404692082111        28358.8483128946     
   7.83734115347019        28369.4682052238     
   7.85063538611926        28380.1711997876     
   7.86392961876833        28390.9560281863     
   7.87722385141740        28401.8214220201     
   7.89051808406647        28412.7661128890     
   7.90381231671554        28423.7888313709     
   7.91710654936461        28434.8882131926     
   7.93040078201369        28446.0627280441     
   7.94369501466276        28457.3108286821     
   7.95698924731183        28468.6309678632     
   7.97028347996090        28480.0215983440     
   7.98357771260997        28491.4811728812     
   7.99687194525904        28503.0081442314     
   8.01016617790811        28514.6010332395     
   8.02346041055719        28526.2589244159     
   8.03675464320626        28537.9811812708     
   8.05004887585533        28549.7671692315     
   8.06334310850440        28561.6162537252     
   8.07663734115347        28573.5278001794     
   8.08993157380254        28585.5011740212     
   8.10322580645161        28597.5357402575     
   8.11652003910069        28609.6308017009     
   8.12981427174976        28621.7855383975     
   8.14310850439883        28633.9991158656     
   8.15640273704790        28646.2706996234     
   8.16969696969697        28658.5994551890     
   8.18299120234604        28670.9845480807     
   8.19628543499511        28683.4251438166     
   8.20957966764418        28695.9203833359     
   8.22287390029326        28708.4691706286     
   8.23616813294233        28721.0702777163     
   8.24946236559140        28733.7224751333     
   8.26275659824047        28746.4245334145     
   8.27605083088954        28759.1752230942     
   8.28934506353861        28771.9733147071     
   8.30263929618768        28784.8175783240     
   8.31593352883676        28797.7066736774     
   8.32922776148583        28810.6390137436     
   8.34252199413490        28823.6129778908     
   8.35581622678397        28836.6269454873     
   8.36911045943304        28849.6792959013     
   8.38240469208211        28862.7684085010     
   8.39569892473118        28875.8926626546     
   8.40899315738026        28889.0504414123     
   8.42228739002933        28902.2401685729     
   8.43558162267840        28915.4602937320     
   8.44887585532747        28928.7092668463     
   8.46217008797654        28941.9855378725     
   8.47546432062561        28955.2875567673     
   8.48875855327468        28968.6137734873     
   8.50205278592375        28981.9626383698     
   8.51534701857283        28995.3327474464     
   8.52864125122190        29008.7230668844     
   8.54193548387097        29022.1326206694     
   8.55522971652004        29035.5604327868     
   8.56852394916911        29049.0055272222     
   8.58181818181818        29062.4669279611     
   8.59511241446725        29075.9436589891     
   8.60840664711632        29089.4347497282     
   8.62170087976540        29102.9393010624     
   8.63499511241447        29116.4564644781     
   8.64828934506354        29129.9853925085     
   8.66158357771261        29143.5252376871     
   8.67487781036168        29157.0751525473     
   8.68817204301075        29170.6342896224     
   8.70146627565982        29184.2018015739     
   8.71476050830890        29197.7769589338     
   8.72805474095797        29211.3593722306     
   8.74134897360704        29224.9487128887     
   8.75464320625611        29238.5446523324     
   8.76793743890518        29252.1468619862     
   8.78123167155425        29265.7550132742     
   8.79452590420332        29279.3687776210     
   8.80782013685240        29292.9878454205     
   8.82111436950147        29306.6122044442     
   8.83440860215054        29320.2420786104     
   8.84770283479961        29333.8776983352     
   8.86099706744868        29347.5192940348     
   8.87429130009775        29361.1670961255     
   8.88758553274682        29374.8213350234     
   8.90087976539590        29388.4822411291     
   8.91417399804497        29402.1499611477     
   8.92746823069404        29415.8243671013     
   8.94076246334311        29429.5052747272     
   8.95405669599218        29443.1924997629     
   8.96735092864125        29456.8858579456     
   8.98064516129032        29470.5851650127     
   8.99393939393939        29484.2902367017     
   9.00723362658847        29498.0009163895     
   9.02052785923754        29511.7175684462     
   9.03382209188661        29525.4410215986     
   9.04711632453568        29539.1721208202     
   9.06041055718475        29552.9117110847     
   9.07370478983382        29566.6606373655     
   9.08699902248289        29580.4197446363     
   9.10029325513196        29594.1898778747     
   9.11358748778104        29607.9718303214     
   9.12688172043011        29621.7662015876     
   9.14017595307918        29635.5735459678     
   9.15347018572825        29649.3944177568     
   9.16676441837732        29663.2293712490     
   9.18005865102639        29677.0789607392     
   9.19335288367546        29690.9437405219     
   9.20664711632454        29704.8242233341     
   9.21994134897361        29718.7199658313     
   9.23323558162268        29732.6295686479     
   9.24652981427175        29746.5515908406     
   9.25982404692082        29760.4845914660     
   9.27311827956989        29774.4271295807     
   9.28641251221896        29788.3777642416     
   9.29970674486803        29802.3350545053     
   9.31300097751711        29816.2973501243     
   9.32629521016618        29830.2621062236     
   9.33958944281525        29844.2265390339     
   9.35288367546432        29858.1878647700     
   9.36617790811339        29872.1432996468     
   9.37947214076246        29886.0900598792     
   9.39276637341154        29900.0253616820     
   9.40606060606061        29913.9464080421     
   9.41935483870968        29927.8500238141     
   9.43264907135875        29941.7326095967     
   9.44594330400782        29955.5905434843     
   9.45923753665689        29969.4202035712     
   9.47253176930596        29983.2179679517     
   9.48582600195503        29996.9802147200     
   9.49912023460411        30010.7033219705     
   9.51241446725318        30024.3842705980     
   9.52570869990225        30038.0229837675     
   9.53900293255132        30051.6202809146     
   9.55229716520039        30065.1769817035     
   9.56559139784946        30078.6939057980     
   9.57888563049854        30092.1718728619     
   9.59217986314761        30105.6117025594     
   9.60547409579668        30119.0142032328     
   9.61876832844575        30132.3797736631     
   9.63206256109482        30145.7082965534     
   9.64535679374389        30158.9996217423     
   9.65865102639296        30172.2535990685     
   9.67194525904203        30185.4700783704     
   9.68523949169111        30198.6489094869     
   9.69853372434018        30211.7899422565     
   9.71182795698925        30224.8930978320     
   9.72512218963832        30237.9586956871     
   9.73841642228739        30250.9871933148     
   9.75171065493646        30263.9790483749     
   9.76500488758553        30276.9347185275     
   9.77829912023460        30289.8546614325     
   9.79159335288368        30302.7393347497     
   9.80488758553275        30315.5891899576     
   9.81818181818182        30328.4043866644     
   9.83147605083089        30341.1846713002     
   9.84477028347996        30353.9297590359     
   9.85806451612903        30366.6393650423     
   9.87135874877810        30379.3132044903     
   9.88465298142718        30391.9509925507     
   9.89794721407625        30404.5524443945     
   9.91124144672532        30417.1173654521     
   9.92453567937439        30429.6461388595     
   9.93782991202346        30442.1393752071     
   9.95112414467253        30454.5976856639     
   9.96441837732160        30467.0216813995     
   9.97771260997068        30479.4119735829     
   9.99100684261975        30491.7691733836     
   10.0043010752688        30504.0938756634     
   10.0175953079179        30516.3856261511     
   10.0308895405670        30528.6423009737     
   10.0441837732160        30540.8616275033     
   10.0574780058651        30553.0413331123     
   10.0707722385142        30565.1791451730     
   10.0840664711632        30577.2727910577     
   10.0973607038123        30589.3199981387     
   10.1106549364614        30601.3185248375     
   10.1239491691105        30613.2663582191     
   10.1372434017595        30625.1615872918     
   10.1505376344086        30637.0023015639     
   10.1638318670577        30648.7865905437     
   10.1771260997067        30660.5125437394     
   10.1904203323558        30672.1782506594     
   10.2037145650049        30683.7818056818     
   10.2170087976540        30695.3217551100     
   10.2303030303030        30706.7974548486     
   10.2435972629521        30718.2083450740     
   10.2568914956012        30729.5538659629     
   10.2701857282502        30740.8334576918     
   10.2834799608993        30752.0465604371     
   10.2967741935484        30763.1926143755     
   10.3100684261975        30774.2711862694     
   10.3233626588465        30785.2829186452     
   10.3366568914956        30796.2289966017     
   10.3499511241447        30807.1106094566     
   10.3632453567937        30817.9289465274     
   10.3765395894428        30828.6851971317     
   10.3898338220919        30839.3805505869     
   10.4031280547410        30850.0161938848     
   10.4164222873900        30860.5929950373     
   10.4297165200391        30871.1111764264     
   10.4430107526882        30881.5708826255     
   10.4563049853372        30891.9722582076     
   10.4695992179863        30902.3154477459     
   10.4828934506354        30912.6005958135     
   10.4961876832845        30922.8278469837     
   10.5094819159335        30932.9973179544     
   10.5227761485826        30943.1088512239     
   10.5360703812317        30953.1621329800     
   10.5493646138807        30963.1568476517     
   10.5626588465298        30973.0926796679     
   10.5759530791789        30982.9693134577     
   10.5892473118280        30992.7864334498     
   10.6025415444770        31002.5437227717     
   10.6158357771261        31012.2405665883     
   10.6291300097752        31021.8756681086     
   10.6424242424242        31031.4476356943     
   10.6557184750733        31040.9550777076     
   10.6690127077224        31050.3966025102     
   10.6823069403715        31059.7708184641     
   10.6956011730205        31069.0763339313     
   10.7088954056696        31078.3117177811     
   10.7221896383187        31087.4750845539     
   10.7354838709677        31096.5642573404     
   10.7487781036168        31105.5770545127     
   10.7620723362659        31114.5112944430     
   10.7753665689150        31123.3647955035     
   10.7886608015640        31132.1353760666     
   10.8019550342131        31140.8208546732     
   10.8152492668622        31149.4191572230     
   10.8285434995112        31157.9284872947     
   10.8418377321603        31166.3470929703     
   10.8551319648094        31174.6732223317     
   10.8684261974585        31182.9051234608     
   10.8817204301075        31191.0410444397     
   10.8950146627566        31199.0792333500     
   10.9083088954057        31207.0179835833     
   10.9216031280547        31214.8562048413     
   10.9348973607038        31222.5932506129     
   10.9481915933529        31230.2284842638     
   10.9614858260020        31237.7612691594     
   10.9747800586510        31245.1909686655     
   10.9880742913001        31252.5169461475     
   11.0013685239492        31259.7385665066     
   11.0146627565982        31266.8571809767     
   11.0279569892473        31273.8799913607     
   11.0412512218964        31280.8152716001     
   11.0545454545455        31287.6712956363     
   11.0678396871945        31294.4563374109     
   11.0811339198436        31301.1786708653     
   11.0944281524927        31307.8465699410     
   11.1077223851417        31314.4681747513     
   11.1210166177908        31321.0494649248     
   11.1343108504399        31327.5946707952     
   11.1476050830890        31334.1079725479     
   11.1608993157380        31340.5935503682     
   11.1741935483871        31347.0555844414     
   11.1874877810362        31353.4982549527     
   11.2007820136852        31359.9257410523     
   11.2140762463343        31366.3363981867     
   11.2273704789834        31372.7090427429     
   11.2406647116325        31379.0183980890     
   11.2539589442815        31385.2391875929     
   11.2672531769306        31391.3461346227     
   11.2805474095797        31397.3139625462     
   11.2938416422287        31403.1173947316     
   11.3071358748778        31408.7323389147     
   11.3204301075269        31414.1577596089     
   11.3337243401760        31419.4135686679     
   11.3470185728250        31424.5204392355     
   11.3603128054741        31429.4990444552     
   11.3736070381232        31434.3700574706     
   11.3869012707722        31439.1541514255     
   11.4001955034213        31443.8719992802     
   11.4134897360704        31448.5399903981     
   11.4267839687195        31453.1581167722     
   11.4400782013685        31457.7224482498     
   11.4533724340176        31462.2290546785     
   11.4666666666667        31466.6740059054     
   11.4799608993157        31471.0533717781     
   11.4932551319648        31475.3632221438     
   11.5065493646139        31479.5997542090     
   11.5198435972630        31483.7621990888     
   11.5331378299120        31487.8528803289     
   11.5464320625611        31491.8742606638     
   11.5597262952102        31495.8288028281     
   11.5730205278592        31499.7189695564     
   11.5863147605083        31503.5472235832     
   11.5996089931574        31507.3160276431     
   11.6129032258065        31511.0275550644     
   11.6261974584555        31514.6827152011     
   11.6394916911046        31518.2820720471     
   11.6527859237537        31521.8261896515     
   11.6660801564027        31525.3156320637     
   11.6793743890518        31528.7509633328     
   11.6926686217009        31532.1327475080     
   11.7059628543500        31535.4615539442     
   11.7192570869990        31538.7381110627     
   11.7325513196481        31541.9633289202     
   11.7458455522972        31545.1381275721     
   11.7591397849462        31548.2634270736     
   11.7724340175953        31551.3401474801     
   11.7857282502444        31554.3692088469     
   11.7990224828935        31557.3515312293     
   11.8123167155425        31560.2880041247     
   11.8256109481916        31563.1793648901     
   11.8389051808407        31566.0263033396     
   11.8521994134897        31568.8295093160     
   11.8654936461388        31571.5896726624     
   11.8787878787879        31574.3074832217     
   11.8920821114370        31576.9836308369     
   11.9053763440860        31579.6188047006     
   11.9186705767351        31582.2136709688     
   11.9319648093842        31584.7688659537     
   11.9452590420332        31587.2850240531     
   11.9585532746823        31589.7627796646     
   11.9718475073314        31592.2027671861     
   11.9851417399805        31594.6056210153     
   11.9984359726295        31596.9719755499     
   12.0117302052786        31599.3024555683     
   12.0250244379277        31601.5976312366     
   12.0383186705767        31603.8580532306     
   12.0516129032258        31606.0842722376     
   12.0649071358749        31608.2768389447     
   12.0782013685239        31610.4363040392     
   12.0914956011730        31612.5632182082     
   12.1047898338221        31614.6581315243     
   12.1180840664712        31616.7215650532     
   12.1313782991202        31618.7539977926     
   12.1446725317693        31620.7559055008     
   12.1579667644184        31622.7277639360     
   12.1712609970674        31624.6700488563     
   12.1845552297165        31626.5832360199     
   12.1978494623656        31628.4678011852     
   12.2111436950147        31630.3242162057     
   12.2244379276637        31632.1529276345     
   12.2377321603128        31633.9543717338     
   12.2510263929619        31635.7289847641     
   12.2643206256109        31637.4772029863     
   12.2776148582600        31639.1994626610     
   12.2909090909091        31640.8962000489     
   12.3042033235582        31642.5678509801     
   12.3174975562072        31644.2148236365     
   12.3307917888563        31645.8374811461     
   12.3440860215054        31647.4361825443     
   12.3573802541544        31649.0112868664     
   12.3706744868035        31650.5631531480     
   12.3839687194526        31652.0921404245     
   12.3972629521017        31653.5986077312     
   12.4105571847507        31655.0829125686     
   12.4238514173998        31656.5454010997     
   12.4371456500489        31657.9864142300     
   12.4504398826979        31659.4062928595     
   12.4637341153470        31660.8053778880     
   12.4770283479961        31662.1840102155     
   12.4903225806452        31663.5425307419     
   12.5036168132942        31664.8812801413     
   12.5169110459433        31666.2005788067     
   12.5302052785924        31667.5007098914     
   12.5434995112414        31668.7819526006     
   12.5567937438905        31670.0445861396     
   12.5700879765396        31671.2888897136     
   12.5833822091887        31672.5151425278     
   12.5966764418377        31673.7236237876     
   12.6099706744868        31674.9146114834     
   12.6232649071359        31676.0883732308     
   12.6365591397849        31677.2451712279     
   12.6498533724340        31678.3852676447     
   12.6631476050831        31679.5089246514     
   12.6764418377322        31680.6164044181     
   12.6897360703812        31681.7079691150     
   12.7030303030303        31682.7838808196     
   12.7163245356794        31683.8443898259     
   12.7296187683284        31684.8897219723     
   12.7429130009775        31685.9201000944     
   12.7562072336266        31686.9357470279     
   12.7695014662757        31687.9368856086     
   12.7827956989247        31688.9237386720     
   12.7960899315738        31689.8965290539     
   12.8093841642229        31690.8554782289     
   12.8226783968719        31691.8007940797     
   12.8359726295210        31692.7326765349     
   12.8492668621701        31693.6513254383     
   12.8625610948192        31694.5569406339     
   12.8758553274682        31695.4497219657     
   12.8891495601173        31696.3298692777     
   12.9024437927664        31697.1975823774     
   12.9157380254154        31698.0530546329     
   12.9290322580645        31698.8964642599     
   12.9423264907136        31699.7279873316     
   12.9556207233627        31700.5477999214     
   12.9689149560117        31701.3560781022     
   12.9822091886608        31702.1529979474     
   12.9955034213099        31702.9387355301     
   13.0087976539589        31703.7134658069     
   13.0220918866080        31704.4773506758     
   13.0353861192571        31705.2305434475     
   13.0486803519062        31705.9731972953     
   13.0619745845552        31706.7054653926     
   13.0752688172043        31707.4275009126     
   13.0885630498534        31708.1394570287     
   13.1018572825024        31708.8414868995     
   13.1151515151515        31709.5337408934     
   13.1284457478006        31710.2163618887     
   13.1417399804497        31710.8894915519     
   13.1550342130987        31711.5532715493     
   13.1683284457478        31712.2078435475     
   13.1816226783969        31712.8533492129     
   13.1949169110459        31713.4899302119     
   13.2082111436950        31714.1177275875     
   13.2215053763441        31714.7368738212     
   13.2347996089932        31715.3474950595     
   13.2480938416422        31715.9497173114     
   13.2613880742913        31716.5436665861     
   13.2746823069404        31717.1294688924     
   13.2879765395894        31717.7072502395     
   13.3012707722385        31718.2771366254     
   13.3145650048876        31718.8392487045     
   13.3278592375367        31719.3936909593     
   13.3411534701857        31719.9405648531     
   13.3544477028348        31720.4799718491     
   13.3677419354839        31721.0120134106     
   13.3810361681329        31721.5367910010     
   13.3943304007820        31722.0544060834     
   13.4076246334311        31722.5649601478     
   13.4209188660802        31723.0685552593     
   13.4342130987292        31723.5652939217     
   13.4475073313783        31724.0552786587     
   13.4608015640274        31724.5386119944     
   13.4740957966764        31725.0153964527     
   13.4873900293255        31725.4857345574     
   13.5006842619746        31725.9497288261     
   13.5139784946237        31726.4074775354     
   13.5272727272727        31726.8590643419     
   13.5405669599218        31727.3045697803     
   13.5538611925709        31727.7440743851     
   13.5671554252199        31728.1776586912     
   13.5804496578690        31728.6054032331     
   13.5937438905181        31729.0273885457     
   13.6070381231672        31729.4436952152     
   13.6203323558162        31729.8544049938     
   13.6336265884653        31730.2596006822     
   13.6469208211144        31730.6593651266     
   13.6602150537634        31731.0537811731     
   13.6735092864125        31731.4429316680     
   13.6868035190616        31731.8268994574     
   13.7000977517107        31732.2057673828     
   13.7133919843597        31732.5796156671     
   13.7266862170088        31732.9485142192     
   13.7399804496579        31733.3125304335     
   13.7532746823069        31733.6717317045     
   13.7665689149560        31734.0261854267     
   13.7798631476051        31734.3759589947     
   13.7931573802542        31734.7211198028     
   13.8064516129032        31735.0617350319     
   13.8197458455523        31735.3978667102     
   13.8330400782014        31735.7295714857     
   13.8463343108504        31736.0569057607     
   13.8596285434995        31736.3799259377     
   13.8729227761486        31736.6986884190     
   13.8862170087977        31737.0132496070     
   13.8995112414467        31737.3236659042     
   13.9128054740958        31737.6299941604     
   13.9260997067449        31737.9322932531     
   13.9393939393939        31738.2306226111     
   13.9526881720430        31738.5250416670     
   13.9659824046921        31738.8156098535     
   13.9792766373412        31739.1023866032     
   13.9925708699902        31739.3854313485     
   14.0058651026393        31739.6648033009     
   14.0191593352884        31739.9405549573     
   14.0324535679374        31740.2127309635     
   14.0457478005865        31740.4813755261     
   14.0590420332356        31740.7465328513     
   14.0723362658847        31741.0082471456     
   14.0856304985337        31741.2665626152     
   14.0989247311828        31741.5215234667     
   14.1122189638319        31741.7731740955     
   14.1255131964809        31742.0215598866     
   14.1388074291300        31742.2667265283     
   14.1521016617791        31742.5087197116     
   14.1653958944282        31742.7475851278     
   14.1786901270772        31742.9833684681     
   14.1919843597263        31743.2161154236     
   14.2052785923754        31743.4458716325     
   14.2185728250244        31743.6726807560     
   14.2318670576735        31743.8965838477     
   14.2451612903226        31744.1176217886     
   14.2584555229717        31744.3358354591     
   14.2717497556207        31744.5512657402     
   14.2850439882698        31744.7639535124     
   14.2983382209189        31744.9739396566     
   14.3116324535679        31745.1812638855     
   14.3249266862170        31745.3859591137     
   14.3382209188661        31745.5880557850     
   14.3515151515152        31745.7875843422     
   14.3648093841642        31745.9845752281     
   14.3781036168133        31746.1790588856     
   14.3913978494624        31746.3710657576     
   14.4046920821114        31746.5606263158     
   14.4179863147605        31746.7477726760     
   14.4312805474096        31746.9325393556     
   14.4445747800587        31747.1149610673     
   14.4578690127077        31747.2950725233     
   14.4711632453568        31747.4729084361     
   14.4844574780059        31747.6485035183     
   14.4977517106549        31747.8218924823     
   14.5110459433040        31747.9931094036     
   14.5243401759531        31748.1621841107     
   14.5376344086021        31748.3291446788     
   14.5509286412512        31748.4940191797     
   14.5642228739003        31748.6568356853     
   14.5775171065494        31748.8176222675     
   14.5908113391984        31748.9764069980     
   14.6041055718475        31749.1332179180     
   14.6173998044966        31749.2880809844     
   14.6306940371457        31749.4410186898     
   14.6439882697947        31749.5920532041     
   14.6572825024438        31749.7412066970     
   14.6705767350929        31749.8885013382     
   14.6838709677419        31750.0339592975     
   14.6971652003910        31750.1776027446     
   14.7104594330401        31750.3194540143     
   14.7237536656892        31750.4595367324     
   14.7370478983382        31750.5978751177     
   14.7503421309873        31750.7344933941     
   14.7636363636364        31750.8694157855     
   14.7769305962854        31751.0026665158     
   14.7902248289345        31751.1342698088     
   14.8035190615836        31751.2642498797     
   14.8168132942327        31751.3926301965     
   14.8301075268817        31751.5194328206     
   14.8434017595308        31751.6446796615     
   14.8566959921799        31751.7683926286     
   14.8699902248289        31751.8905936314     
   14.8832844574780        31752.0113045793     
   14.8965786901271        31752.1305473819     
   14.9098729227761        31752.2483434766     
   14.9231671554252        31752.3647101068     
   14.9364613880743        31752.4796623062     
   14.9497556207234        31752.5932150903     
   14.9630498533724        31752.7053834745     
   14.9763440860215        31752.8161824742     
   14.9896383186706        31752.9256271050     
   15.0029325513197        31753.0337323841     
   15.0162267839687        31753.1405138341     
   15.0295210166178        31753.2459880310     
   15.0428152492669        31753.3501716858     
   15.0561094819159        31753.4530815095     
   15.0694037145650        31753.5547342131     
   15.0826979472141        31753.6551465075     
   15.0959921798631        31753.7543351038     
   15.1092864125122        31753.8523167181     
   15.1225806451613        31753.9491081360     
   15.1358748778104        31754.0447261788     
   15.1491691104594        31754.1391876692     
   15.1624633431085        31754.2325094303     
   15.1757575757576        31754.3247082849     
   15.1890518084066        31754.4158010558     
   15.2023460410557        31754.5058045630     
   15.2156402737048        31754.5947350556     
   15.2289345063539        31754.6826074119     
   15.2422287390029        31754.7694363117     
   15.2555229716520        31754.8552364347     
   15.2688172043011        31754.9400224607     
   15.2821114369501        31755.0238090694     
   15.2954056695992        31755.1066109407     
   15.3086999022483        31755.1884424901     
   15.3219941348974        31755.2693149348     
   15.3352883675464        31755.3492373555     
   15.3485826001955        31755.4282187952     
   15.3618768328446        31755.5062682965     
   15.3751710654936        31755.5833949025     
   15.3884652981427        31755.6596076560     
   15.4017595307918        31755.7349155975     
   15.4150537634409        31755.8093269278     
   15.4283479960899        31755.8828475661     
   15.4416422287390        31755.9554830512     
   15.4549364613881        31756.0272389217     
   15.4682306940371        31756.0981207165     
   15.4815249266862        31756.1681339740     
   15.4948191593353        31756.2372842332     
   15.5081133919844        31756.3055777764     
   15.5214076246334        31756.3730315876     
   15.5347018572825        31756.4396706644     
   15.5479960899316        31756.5055201990     
   15.5612903225806        31756.5706053837     
   15.5745845552297        31756.6349514106     
   15.5878787878788        31756.6985834720     
   15.6011730205279        31756.7615267557     
   15.6144672531769        31756.8237994175     
   15.6277614858260        31756.8853979773     
   15.6410557184751        31756.9463148098     
   15.6543499511241        31757.0065422895     
   15.6676441837732        31757.0660727913     
   15.6809384164223        31757.1248986898     
   15.6942326490714        31757.1830123597     
   15.7075268817204        31757.2404069928     
   15.7208211143695        31757.2970898198     
   15.7341153470186        31757.3530798789     
   15.7474095796676        31757.4083965765     
   15.7607038123167        31757.4630593191     
   15.7739980449658        31757.5170875132     
   15.7872922776149        31757.5705005652     
   15.8005865102639        31757.6233178808     
   15.8138807429130        31757.6755552791     
   15.8271749755621        31757.7272160003     
   15.8404692082111        31757.7783005312     
   15.8537634408602        31757.8288093584     
   15.8670576735093        31757.8787429688     
   15.8803519061584        31757.9281018490     
   15.8936461388074        31757.9768864857     
   15.9069403714565        31758.0250975159     
   15.9202346041056        31758.0727387098     
   15.9335288367546        31758.1198167928     
   15.9468230694037        31758.1663386066     
   15.9601173020528        31758.2123109927     
   15.9734115347019        31758.2577407927     
   15.9867057673509        31758.3026348481     
   16.0000000000000        31758.3470000005     
