   2.40000000000000        3002.98444705551     
   2.41329423264907        2864.12948648478     
   2.42658846529814        2729.47578919674     
   2.43988269794721        2598.95432868097     
   2.45317693059629        2472.49034419531     
   2.46647116324536        2350.02183095298     
   2.47976539589443        2231.48562977747     
   2.49305962854350        2116.79733879724     
   2.50635386119257        2005.90041884339     
   2.51964809384164        1898.73481693044     
   2.53294232649071        1795.22762045685     
   2.54623655913978        1695.31168951500     
   2.55953079178886        1598.93772427316     
   2.57282502443793        1506.03655624989     
   2.58611925708700        1416.54462210133     
   2.59941348973607        1330.40169180170     
   2.61270772238514        1247.53239542914     
   2.62600195503421        1167.89687647343     
   2.63929618768328        1091.46124504273     
   2.65259042033236        1018.11835216540     
   2.66588465298143        947.817473318185     
   2.67917888563050        880.561869154722     
   2.69247311827957        816.197725327821     
   2.70576735092864        754.761969935257     
   2.71906158357771        696.142963557452     
   2.73235581622678        640.284184045871     
   2.74565004887586        587.250782080535     
   2.75894428152493        536.717568980706     
   2.77223851417400        488.937541699101     
   2.78553274682307        443.852336517224     
   2.79882697947214        401.027391000697     
   2.81212121212121        360.314656478452     
   2.82541544477028        322.087798165553     
   2.83870967741935        286.505672994248     
   2.85200391006843        253.757220351917     
   2.86529814271750        223.770046446482     
   2.87859237536657        195.900010005282     
   2.89188660801564        169.908529274798     
   2.90518084066471        145.708064002582     
   2.91847507331378        123.250656196089     
   2.93176930596285        102.434016080390     
   2.94506353861193        83.1643232980523     
   2.95835777126100        65.9165822486037     
   2.97165200391007        51.3584898635337     
   2.98494623655914        39.5809896311603     
   2.99824046920821        29.8218888724551     
   3.01153470185728        21.1202655443069     
   3.02482893450635        13.6431811346608     
   3.03812316715543        7.63755549723463     
   3.05141739980450        3.23158948579553     
   3.06471163245357       0.628321381796418     
   3.07800586510264        2.23661528732185D-002
   3.09130009775171        1.12965644565338     
   3.10459433040078        3.68032760992712     
   3.11788856304985        7.56996959674014     
   3.13118279569892        12.7563202759089     
   3.14447702834800        19.1794408821311     
   3.15777126099707        26.7890413091587     
   3.17106549364614        35.5095899142246     
   3.18435972629521        45.3467453394102     
   3.19765395894428        56.5409125480438     
   3.21094819159335        69.5447200338981     
   3.22424242424242        84.4818446385629     
   3.23753665689150        100.599123174970     
   3.25083088954057        117.204076021382     
   3.26412512218964        134.535327407938     
   3.27741935483871        152.645644804538     
   3.29071358748778        171.605529084536     
   3.30400782013685        191.492127083255     
   3.31730205278592        212.390401352345     
   3.33059628543499        234.380128469000     
   3.34389051808407        257.338287305428     
   3.35718475073314        281.140514317306     
   3.37047898338221        305.777777932937     
   3.38377321603128        331.302411636960     
   3.39706744868035        357.742950973313     
   3.41036168132942        385.198764102657     
   3.42365591397849        413.375918926358     
   3.43695014662757        441.993751718529     
   3.45024437927664        471.079641289778     
   3.46353861192571        500.788423334192     
   3.47683284457478        531.311898977542     
   3.49012707722385        562.580210833866     
   3.50342130987292        594.364527475322     
   3.51671554252199        626.544882763946     
   3.53000977517107        659.252518381228     
   3.54330400782014        692.633715529453     
   3.55659824046921        726.554734419017     
   3.56989247311828        760.837658654229     
   3.58318670576735        795.512025378973     
   3.59648093841642        830.673447795412     
   3.60977517106549        866.339852147698     
   3.62306940371456        902.371216690596     
   3.63636363636364        938.678285658001     
   3.64965786901271        975.367341276151     
   3.66295210166178        1012.48969348685     
   3.67624633431085        1049.89707308148     
   3.68954056695992        1087.53125866414     
   3.70283479960899        1125.47443563198     
   3.71612903225806        1163.76063906527     
   3.72942326490714        1202.25381207526     
   3.74271749755621        1240.93207956704     
   3.75601173020528        1279.86280815179     
   3.76930596285435        1319.04630239331     
   3.78260019550342        1358.36663539239     
   3.79589442815249        1397.83228744758     
   3.80918866080156        1437.50098238550     
   3.82248289345064        1477.33209500279     
   3.83577712609971        1517.24138685493     
   3.84907135874878        1557.26362721534     
   3.86236559139785        1597.43331269358     
   3.87565982404692        1637.67947382775     
   3.88895405669599        1677.96412051003     
   3.90224828934506        1718.33231272827     
   3.91554252199413        1758.78558556265     
   3.92883675464321        1799.25807941346     
   3.94213098729228        1839.73021193597     
   3.95542521994135        1880.21292513577     
   3.96871945259042        1920.70462441483     
   3.98201368523949        1961.19990519008     
   3.99530791788856        2001.69494240136     
   4.00860215053763        2042.15481607394     
   4.02189638318671        2082.55319699698     
   4.03519061583578        2122.90699765249     
   4.04848484848485        2163.23044370405     
   4.06177908113392        2203.46595670197     
   4.07507331378299        2243.60700501879     
   4.08836754643206        2283.68055033606     
   4.10166177908113        2323.66705141875     
   4.11495601173021        2363.52371928167     
   4.12825024437928        2403.27937684130     
   4.14154447702835        2442.92726680684     
   4.15483870967742        2482.42827956767     
   4.16813294232649        2521.78676852650     
   4.18142717497556        2561.02498367839     
   4.19472140762463        2600.10367468205     
   4.20801564027371        2639.00860891759     
   4.22130987292278        2677.76133692324     
   4.23460410557185        2716.35157957268     
   4.24789833822092        2754.74502368033     
   4.26119257086999        2792.95927569535     
   4.27448680351906        2830.99557110977     
   4.28778103616813        2868.82308378721     
   4.30107526881720        2906.44161712631     
   4.31436950146628        2943.86998038857     
   4.32766373411535        2981.08266431817     
   4.34095796676442        3018.06317204828     
   4.35425219941349        3054.82859747606     
   4.36754643206256        3091.37689762401     
   4.38084066471163        3127.67988332930     
   4.39413489736070        3163.74539961850     
   4.40742913000978        3199.58140696062     
   4.42072336265885        3235.16721524776     
   4.43401759530792        3270.49518970364     
   4.44731182795699        3305.58210329450     
   4.46060606060606        3340.41618621357     
   4.47390029325513        3374.97975216990     
   4.48719452590420        3409.28172448380     
   4.50048875855328        3443.33048858830     
   4.51378299120235        3477.10434845877     
   4.52707722385142        3510.59944168513     
   4.54037145650049        3543.82751247362     
   4.55366568914956        3576.78491159892     
   4.56695992179863        3609.45358130551     
   4.58025415444770        3641.84181863184     
   4.59354838709677        3673.95481466705     
   4.60684261974585        3705.78227044898     
   4.62013685239492        3737.31599690139     
   4.63343108504399        3768.56773793171     
   4.64672531769306        3799.53325573608     
   4.66001955034213        3830.20274864763     
   4.67331378299120        3860.57736865259     
   4.68660801564027        3890.66647790465     
   4.69990224828935        3920.46146599230     
   4.71319648093842        3949.95653428189     
   4.72649071358749        3979.15661620986     
   4.73978494623656        4008.06612137400     
   4.75307917888563        4036.67625473523     
   4.76637341153470        4064.98510284114     
   4.77966764418377        4092.99914488803     
   4.79296187683285        4120.71977980812     
   4.80625610948192        4148.14085005956     
   4.81955034213099        4175.26171900311     
   4.83284457478006        4202.08788275864     
   4.84613880742913        4228.61912713543     
   4.85943304007820        4254.85175462130     
   4.87272727272727        4280.78571044139     
   4.88602150537635        4306.42576282814     
   4.89931573802542        4331.77309874120     
   4.91260997067449        4356.82529062170     
   4.92590420332356        4381.58180752882     
   4.93919843597263        4406.04619292271     
   4.95249266862170        4430.22020600905     
   4.96578690127077        4454.10244804227     
   4.97908113391984        4477.69356636206     
   4.99237536656892        4500.99636327698     
   5.00566959921799        4524.01288802546     
   5.01896383186706        4546.74394969550     
   5.03225806451613        4569.19049052640     
   5.04555229716520        4591.35361130127     
   5.05884652981427        4613.23474299519     
   5.07214076246334        4634.83590252071     
   5.08543499511242        4656.15916603093     
   5.09872922776149        4677.20568243124     
   5.11202346041056        4697.97587918455     
   5.12531769305963        4718.47186129971     
   5.13861192570870        4738.69828377562     
   5.15190615835777        4758.65615437405     
   5.16520039100684        4778.34539830572     
   5.17849462365591        4797.76644102111     
   5.19178885630499        4816.92278182774     
   5.20508308895406        4835.82073306344     
   5.21837732160313        4854.45840553942     
   5.23167155425220        4872.84206980814     
   5.24496578690127        4890.95488467609     
   5.25826001955034        4908.76643307473     
   5.27155425219941        4926.29427940325     
   5.28484848484849        4943.59230487049     
   5.29814271749756        4960.80692740733     
   5.31143695014663        4977.85148196593     
   5.32473118279570        4994.37664128419     
   5.33802541544477        5010.34288121683     
   5.35131964809384        5026.16567881915     
   5.36461388074291        5042.07457140732     
   5.37790811339199        5058.79362652363     
   5.39120234604106        5077.62624983613     
   5.40449657869013        5098.51506992777     
   5.41779081133920        5119.80217082344     
   5.43108504398827        5139.15436785015     
   5.44437927663734        5155.86205598800     
   5.45767350928641        5171.51139650110     
   5.47096774193548        5186.67695431162     
   5.48426197458456        5201.43217509071     
   5.49755620723363        5215.82503690718     
   5.51085043988270        5230.02509452280     
   5.52414467253177        5244.20474407384     
   5.53743890518084        5258.27421622334     
   5.55073313782991        5272.11953452530     
   5.56402737047898        5285.70470896311     
   5.57732160312805        5299.06209334834     
   5.59061583577713        5312.22791913436     
   5.60391006842620        5325.17721781984     
   5.61720430107527        5337.87886525113     
   5.63049853372434        5350.33843095547     
   5.64379276637341        5362.58646552368     
   5.65708699902248        5374.63628150829     
   5.67038123167156        5386.49554630425     
   5.68367546432063        5398.18082119349     
   5.69696969696970        5409.71140048159     
   5.71026392961877        5421.08788971414     
   5.72355816226784        5432.27520704025     
   5.73685239491691        5443.23413612506     
   5.75014662756598        5453.96449741807     
   5.76344086021505        5464.49443517548     
   5.77673509286413        5474.84869586656     
   5.79002932551320        5485.03360206372     
   5.80332355816227        5495.05743437063     
   5.81661779081134        5504.94811555593     
   5.82991202346041        5514.72226970246     
   5.84320625610948        5524.36367864721     
   5.85650048875855        5533.85796081330     
   5.86979472140763        5543.19796950482     
   5.88308895405670        5552.38733161331     
   5.89638318670577        5561.42700567641     
   5.90967741935484        5570.30196426433     
   5.92297165200391        5578.99626356278     
   5.93626588465298        5587.53283171167     
   5.94956011730205        5595.93446358096     
   5.96285434995113        5604.20365701684     
   5.97614858260020        5612.33361826477     
   5.98944281524927        5620.32204049296     
   6.00273704789834        5628.20280402176     
   6.01603128054741        5635.99623594300     
   6.02932551319648        5643.69521092385     
   6.04261974584555        5651.29716795043     
   6.05591397849462        5658.80560895010     
   6.06920821114370        5666.22130661236     
   6.08250244379277        5673.53540322085     
   6.09579667644184        5680.72998136038     
   6.10909090909091        5687.79007052165     
   6.12238514173998        5694.72479331898     
   6.13567937438905        5701.54006001406     
   6.14897360703812        5708.23318014069     
   6.16226783968719        5714.79910856954     
   6.17556207233627        5721.24282870489     
   6.18885630498534        5727.60831352174     
   6.20215053763441        5733.91423485238     
   6.21544477028348        5740.15647614878     
   6.22873900293255        5746.33996674989     
   6.24203323558162        5752.48320275755     
   6.25532746823069        5758.58230564355     
   6.26862170087977        5764.61055832759     
   6.28191593352884        5770.52792515856     
   6.29521016617791        5776.30697225397     
   6.30850439882698        5781.96940337592     
   6.32179863147605        5787.54451819887     
   6.33509286412512        5793.05516272505     
   6.34838709677419        5798.52381627086     
   6.36168132942327        5803.97396970948     
   6.37497556207234        5809.40738099397     
   6.38826979472141        5814.79837173226     
   6.40156402737048        5820.11137198629     
   6.41485826001955        5825.32149058098     
   6.42815249266862        5830.42863795970     
   6.44144672531769        5835.45679316150     
   6.45474095796677        5840.42252023757     
   6.46803519061584        5845.33919572333     
   6.48132942326491        5850.22245428859     
   6.49462365591398        5855.08369779186     
   6.50791788856305        5859.92164778876     
   6.52121212121212        5864.73273672764     
   6.53450635386119        5869.51579394014     
   6.54780058651027        5874.26964275623     
   6.56109481915934        5878.98689464867     
   6.57438905180841        5883.65075728139     
   6.58768328445748        5888.23845631502     
   6.60097751710655        5892.74327659895     
   6.61427174975562        5897.18098442574     
   6.62756598240469        5901.56828932567     
   6.64086021505376        5905.91141849707     
   6.65415444770284        5910.21494126730     
   6.66744868035191        5914.49238731383     
   6.68074291300098        5918.76075113029     
   6.69403714565005        5923.02005998990     
   6.70733137829912        5927.26932063855     
   6.72062561094819        5931.50940946761     
   6.73391984359726        5935.74023277030     
   6.74721407624633        5939.95702616945     
   6.76050830889541        5944.14968115668     
   6.77380254154448        5948.31081431035     
   6.78709677419355        5952.42301452844     
   6.80039100684262        5956.47192533206     
   6.81368523949169        5960.46364584458     
   6.82697947214076        5964.40819909475     
   6.84027370478983        5968.31620846062     
   6.85356793743891        5972.20484735655     
   6.86686217008798        5976.08782102027     
   6.88015640273705        5979.96314148304     
   6.89345063538612        5983.82978945402     
   6.90674486803519        5987.68974592384     
   6.92003910068426        5991.54535582306     
   6.93333333333333        5995.39534176305     
   6.94662756598241        5999.23377180609     
   6.95992179863148        6003.05654718160     
   6.97321603128055        6006.85144116895     
   6.98651026392962        6010.61387922792     
   6.99980449657869        6014.35281625356     
   7.01309872922776        6018.07782552143     
   7.02639296187683        6021.79926719471     
   7.03968719452590        6025.51729921678     
   7.05298142717498        6029.22330550993     
   7.06627565982405        6032.90540349038     
   7.07956989247312        6036.55202022805     
   7.09286412512219        6040.15927371016     
   7.10615835777126        6043.73549693635     
   7.11945259042033        6047.29145076218     
   7.13274682306940        6050.83333500270     
   7.14604105571848        6054.36885204736     
   7.15933528836755        6057.90228449973     
   7.17262952101662        6061.43096196808     
   7.18592375366569        6064.94894919543     
   7.19921798631476        6068.45085288815     
   7.21251221896383        6071.92966963561     
   7.22580645161290        6075.38176462770     
   7.23910068426198        6078.81137596534     
   7.25239491691105        6082.22752738200     
   7.26568914956012        6085.63756964044     
   7.27898338220919        6089.04425580067     
   7.29227761485826        6092.44101334903     
   7.30557184750733        6095.81925504289     
   7.31886608015640        6099.17152689372     
   7.33216031280547        6102.48943827308     
   7.34545454545455        6105.76596515538     
   7.35874877810362        6109.00722608668     
   7.37204301075269        6112.22447889293     
   7.38533724340176        6115.42775716097     
   7.39863147605083        6118.62462093896     
   7.41192570869990        6121.81160825452     
   7.42521994134897        6124.98416789609     
   7.43851417399805        6128.14001193381     
   7.45180840664712        6131.27401156643     
   7.46510263929619        6134.37478216216     
   7.47839687194526        6137.44398245833     
   7.49169110459433        6140.48953660150     
   7.50498533724340        6143.52184215598     
   7.51827956989247        6146.54420050545     
   7.53157380254155        6149.54132984984     
   7.54486803519062        6152.50659248472     
   7.55816226783969        6155.43831044549     
   7.57145650048876        6158.32977443139     
   7.58475073313783        6161.16610105118     
   7.59804496578690        6163.93453918798     
   7.61133919843597        6166.64300538783     
   7.62463343108504        6169.30282606083     
   7.63792766373412        6171.92227512416     
   7.65122189638319        6174.50821365539     
   7.66451612903226        6177.06289848487     
   7.67781036168133        6179.58832362741     
   7.69110459433040        6182.08664538990     
   7.70439882697947        6184.55513081142     
   7.71769305962854        6186.98614438256     
   7.73098729227762        6189.38179150821     
   7.74428152492669        6191.74740619412     
   7.75757575757576        6194.07936804444     
   7.77086999022483        6196.36092991950     
   7.78416422287390        6198.57174261929     
   7.79745845552297        6200.70802842170     
   7.81075268817204        6202.76798629577     
   7.82404692082111        6204.73868069251     
   7.83734115347019        6206.61504584053     
   7.85063538611926        6208.42790435798     
   7.86392961876833        6210.21134801503     
   7.87722385141740        6211.99706287365     
   7.89051808406647        6213.76221251142     
   7.90381231671554        6215.45208388456     
   7.91710654936461        6217.06797006934     
   7.93040078201369        6218.60194910614     
   7.94369501466276        6220.06824813966     
   7.95698924731183        6221.49714061637     
   7.97028347996090        6222.90803041006     
   7.98357771260997        6224.29807513092     
   7.99687194525904        6225.66718131662     
   8.01016617790811        6227.01592320288     
   8.02346041055719        6228.34415479262     
   8.03675464320626        6229.65204871440     
   8.05004887585533        6230.93968794720     
   8.06334310850440        6232.20716675094     
   8.07663734115347        6233.45458422125     
   8.08993157380254        6234.68203532536     
   8.10322580645161        6235.88961673173     
   8.11652003910069        6237.07742466197     
   8.12981427174976        6238.24555538051     
   8.14310850439883        6239.39410518373     
   8.15640273704790        6240.52317034465     
   8.16969696969697        6241.63284714573     
   8.18299120234604        6242.72323186588     
   8.19628543499511        6243.79442078553     
   8.20957966764418        6244.84651018484     
   8.22287390029326        6245.87959634383     
   8.23616813294233        6246.89377554303     
   8.24946236559140        6247.88914406161     
   8.26275659824047        6248.86579818008     
   8.27605083088954        6249.82383417851     
   8.28934506353861        6250.76334833741     
   8.30263929618768        6251.68443693596     
   8.31593352883676        6252.58719625468     
   8.32922776148583        6253.47172257362     
   8.34252199413490        6254.33811217286     
   8.35581622678397        6255.18646133290     
   8.36911045943304        6256.01686633293     
   8.38240469208211        6256.82942345346     
   8.39569892473118        6257.62422897456     
   8.40899315738026        6258.40137917629     
   8.42228739002933        6259.16097033913     
   8.43558162267840        6259.90309874233     
   8.44887585532747        6260.62786066635     
   8.46217008797654        6261.33535239127     
   8.47546432062561        6262.02567019717     
   8.48875855327468        6262.69891036450     
   8.50205278592375        6263.35516917253     
   8.51534701857283        6263.99454290173     
   8.52864125122190        6264.61712783217     
   8.54193548387097        6265.22302024391     
   8.55522971652004        6265.81231641740     
   8.56852394916911        6266.38511263194     
   8.58181818181818        6266.94150516799     
   8.59511241446725        6267.48159030561     
   8.60840664711632        6268.00546432487     
   8.62170087976540        6268.51322350621     
   8.63499511241447        6269.00496412894     
   8.64828934506354        6269.48078247352     
   8.66158357771261        6269.94077482000     
   8.67487781036168        6270.38503744845     
   8.68817204301075        6270.81366663931     
   8.70146627565982        6271.22675867191     
   8.71476050830890        6271.62440982669     
   8.72805474095797        6272.00671638372     
   8.74134897360704        6272.37377462340     
   8.75464320625611        6272.72568082510     
   8.76793743890518        6273.06253126925     
   8.78123167155425        6273.38442223591     
   8.79452590420332        6273.69145000514     
   8.80782013685240        6273.98371085738     
   8.82111436950147        6274.26130107197     
   8.83440860215054        6274.52431692934     
   8.84770283479961        6274.77285470956     
   8.86099706744868        6275.00701069268     
   8.87429130009775        6275.22688115913     
   8.88758553274682        6275.43256238829     
   8.90087976539590        6275.62415066056     
   8.91417399804497        6275.80174225601     
   8.92746823069404        6275.96543345472     
   8.94076246334311        6276.11532053706     
   8.95405669599218        6276.25149978246     
   8.96735092864125        6276.37406747131     
   8.98064516129032        6276.48311988368     
   8.99393939393939        6276.57875329963     
   9.00723362658847        6276.66106399954     
   9.02052785923754        6276.73014826286     
   9.03382209188661        6276.78610236997     
   9.04711632453568        6276.82902260093     
   9.06041055718475        6276.85900523580     
   9.07370478983382        6276.87614655497     
   9.08699902248289        6276.88054283789     
   9.10029325513196        6276.87229036493     
   9.11358748778104        6276.85148541616     
   9.12688172043011        6276.81822427164     
   9.14017595307918        6276.77260321173     
   9.15347018572825        6276.71471851592     
   9.16676441837732        6276.64466646457     
   9.18005865102639        6276.56254333775     
   9.19335288367546        6276.46844541579     
   9.20664711632454        6276.36246897821     
   9.21994134897361        6276.24471030535     
   9.23323558162268        6276.11526567729     
   9.24652981427175        6275.97423137409     
   9.25982404692082        6275.82170367608     
   9.27311827956989        6275.65777886280     
   9.28641251221896        6275.48255321457     
   9.29970674486803        6275.29612301148     
   9.31300097751711        6275.09858453357     
   9.32629521016618        6274.89003406119     
   9.33958944281525        6274.67056787387     
   9.35288367546432        6274.44028225196     
   9.36617790811339        6274.19927347551     
   9.37947214076246        6273.94763782458     
   9.39276637341154        6273.68547157950     
   9.40606060606061        6273.41287101983     
   9.41935483870968        6273.12993242590     
   9.43264907135875        6272.83675207776     
   9.44594330400782        6272.53342625550     
   9.45923753665689        6272.22005123940     
   9.47253176930596        6271.89672330906     
   9.48582600195503        6271.56353874478     
   9.49912023460411        6271.22059382665     
   9.51241446725318        6270.86798483472     
   9.52570869990225        6270.50580804928     
   9.53900293255132        6270.13415974994     
   9.55229716520039        6269.75313621701     
   9.56559139784946        6269.36283373055     
   9.57888563049854        6268.96334857085     
   9.59217986314761        6268.55477701751     
   9.60547409579668        6268.13721535087     
   9.61876832844575        6267.71075985095     
   9.63206256109482        6267.27550679784     
   9.64535679374389        6266.83155247181     
   9.65865102639296        6266.37899315252     
   9.67194525904203        6265.91792512022     
   9.68523949169111        6265.44844465500     
   9.69853372434018        6264.97064803692     
   9.71182795698925        6264.48463154625     
   9.72512218963832        6263.99049146265     
   9.73841642228739        6263.48832406639     
   9.75171065493646        6262.97822563754     
   9.76500488758553        6262.46029245617     
   9.77829912023460        6261.93462080253     
   9.79159335288368        6261.40130695631     
   9.80488758553275        6260.86044719777     
   9.81818181818182        6260.31213780697     
   9.83147605083089        6259.75647506399     
   9.84477028347996        6259.19355524905     
   9.85806451612903        6258.62347464188     
   9.87135874877810        6258.04632952273     
   9.88465298142718        6257.46221617166     
   9.89794721407625        6256.87123086875     
   9.91124144672532        6256.27346989419     
   9.92453567937439        6255.66902952776     
   9.93782991202346        6255.05800604969     
   9.95112414467253        6254.44049574002     
   9.96441837732160        6253.81659487883     
   9.97771260997068        6253.18639974635     
   9.99100684261975        6252.55000662232     
   10.0043010752688        6251.90751178699     
   10.0175953079179        6251.25901152041     
   10.0308895405670        6250.60460210278     
   10.0441837732160        6249.94437981390     
   10.0574780058651        6249.27844093397     
   10.0707722385142        6248.60688174306     
   10.0840664711632        6247.92979852124     
   10.0973607038123        6247.24728754869     
   10.1106549364614        6246.55944510523     
   10.1239491691105        6245.86636747107     
   10.1372434017595        6245.16815092627     
   10.1505376344086        6244.46489175088     
   10.1638318670577        6243.75668622510     
   10.1771260997067        6243.04363062876     
   10.1904203323558        6242.32582124203     
   10.2037145650049        6241.60335434500     
   10.2170087976540        6240.87632621773     
   10.2303030303030        6240.14483314038     
   10.2435972629521        6239.40897139282     
   10.2568914956012        6238.66883725522     
   10.2701857282502        6237.92452700765     
   10.2834799608993        6237.17613693018     
   10.2967741935484        6236.42376330295     
   10.3100684261975        6235.66750240577     
   10.3233626588465        6234.90745051929     
   10.3366568914956        6234.14370392208     
   10.3499511241447        6233.37635889692     
   10.3632453567937        6232.60551172386     
   10.3765395894428        6231.83125866163     
   10.3898338220919        6231.05369608773     
   10.4031280547410        6230.27292000806     
   10.4164222873900        6229.48902714868     
   10.4297165200391        6228.70211398940     
   10.4430107526882        6227.91227238161     
   10.4563049853372        6227.11961721485     
   10.4695992179863        6226.32419559680     
   10.4828934506354        6225.52617408622     
   10.4961876832845        6224.72572716870     
   10.5094819159335        6223.92204253449     
   10.5227761485826        6223.11874173065     
   10.5360703812317        6222.30720452985     
   10.5493646138807        6221.49811950743     
   10.5626588465298        6220.71338703833     
   10.5759530791789        6219.78327796112     
   10.5892473118280        6219.34609377801     
   10.6025415444770        6219.43157028398     
   10.6158357771261        6219.40513974058     
   10.6291300097752        6219.40807837756     
   10.6424242424242        6219.40982379185     
   10.6557184750733        6219.40848289905     
   10.6690127077224        6219.40900630365     
   10.6823069403715        6219.40887491149     
   10.6956011730205        6219.40888465107     
   10.7088954056696        6219.40889606121     
   10.7221896383187        6219.40888854685     
   10.7354838709677        6219.40889129894     
   10.7487781036168        6219.40889066154     
   10.7620723362659        6219.40889068079     
   10.7753665689150        6219.40889075233     
   10.7886608015640        6219.40889071067     
   10.8019550342131        6219.40889072502     
   10.8152492668622        6219.40889072199     
   10.8285434995112        6219.40889072191     
   10.8418377321603        6219.40889072235     
   10.8551319648094        6219.40889072212     
   10.8684261974585        6219.40889072219     
   10.8817204301075        6219.40889072218     
   10.8950146627566        6219.40889072218     
   10.9083088954057        6219.40889072218     
   10.9216031280547        6219.40889072218     
   10.9348973607038        6219.40889072218     
   10.9481915933529        6219.40889072218     
   10.9614858260020        6219.40889072218     
   10.9747800586510        6219.40889072218     
   10.9880742913001        6219.40889072218     
   11.0013685239492        6219.40889072218     
   11.0146627565982        6219.40889072218     
   11.0279569892473        6219.40889072218     
   11.0412512218964        6219.40889072218     
   11.0545454545455        6219.40889072218     
   11.0678396871945        6219.40889072218     
   11.0811339198436        6219.40889072218     
   11.0944281524927        6219.40889072218     
   11.1077223851417        6219.40889072218     
   11.1210166177908        6219.40889072218     
   11.1343108504399        6219.40889072218     
   11.1476050830890        6219.40889072218     
   11.1608993157380        6219.40889072218     
   11.1741935483871        6219.40889072218     
   11.1874877810362        6219.40889072218     
   11.2007820136852        6219.40889072218     
   11.2140762463343        6219.40889072218     
   11.2273704789834        6219.40889072218     
   11.2406647116325        6219.40889072218     
   11.2539589442815        6219.40889072218     
   11.2672531769306        6219.40889072218     
   11.2805474095797        6219.40889072218     
   11.2938416422287        6219.40889072218     
   11.3071358748778        6219.40889072218     
   11.3204301075269        6219.40889072218     
   11.3337243401760        6219.40889072218     
   11.3470185728250        6219.40889072218     
   11.3603128054741        6219.40889072218     
   11.3736070381232        6219.40889072218     
   11.3869012707722        6219.40889072218     
   11.4001955034213        6219.40889072218     
   11.4134897360704        6219.40889072218     
   11.4267839687195        6219.40889072218     
   11.4400782013685        6219.40889072218     
   11.4533724340176        6219.40889072218     
   11.4666666666667        6219.40889072218     
   11.4799608993157        6219.40889072218     
   11.4932551319648        6219.40889072218     
   11.5065493646139        6219.40889072218     
   11.5198435972630        6219.40889072218     
   11.5331378299120        6219.40889072218     
   11.5464320625611        6219.40889072218     
   11.5597262952102        6219.40889072218     
   11.5730205278592        6219.40889072218     
   11.5863147605083        6219.40889072218     
   11.5996089931574        6219.40889072218     
   11.6129032258065        6219.40889072218     
   11.6261974584555        6219.40889072218     
   11.6394916911046        6219.40889072218     
   11.6527859237537        6219.40889072218     
   11.6660801564027        6219.40889072218     
   11.6793743890518        6219.40889072218     
   11.6926686217009        6219.40889072218     
   11.7059628543500        6219.40889072218     
   11.7192570869990        6219.40889072218     
   11.7325513196481        6219.40889072218     
   11.7458455522972        6219.40889072218     
   11.7591397849462        6219.40889072218     
   11.7724340175953        6219.40889072218     
   11.7857282502444        6219.40889072218     
   11.7990224828935        6219.40889072218     
   11.8123167155425        6219.40889072218     
   11.8256109481916        6219.40889072218     
   11.8389051808407        6219.40889072218     
   11.8521994134897        6219.40889072218     
   11.8654936461388        6219.40889072218     
   11.8787878787879        6219.40889072218     
   11.8920821114370        6219.40889072218     
   11.9053763440860        6219.40889072218     
   11.9186705767351        6219.40889072218     
   11.9319648093842        6219.40889072218     
   11.9452590420332        6219.40889072218     
   11.9585532746823        6219.40889072218     
   11.9718475073314        6219.40889072218     
   11.9851417399805        6219.40889072218     
   11.9984359726295        6219.40889072218     
   12.0117302052786        6219.40889072218     
   12.0250244379277        6219.40889072218     
   12.0383186705767        6219.40889072218     
   12.0516129032258        6219.40889072218     
   12.0649071358749        6219.40889072218     
   12.0782013685239        6219.40889072218     
   12.0914956011730        6219.40889072218     
   12.1047898338221        6219.40889072218     
   12.1180840664712        6219.40889072218     
   12.1313782991202        6219.40889072218     
   12.1446725317693        6219.40889072218     
   12.1579667644184        6219.40889072218     
   12.1712609970674        6219.40889072218     
   12.1845552297165        6219.40889072218     
   12.1978494623656        6219.40889072218     
   12.2111436950147        6219.40889072218     
   12.2244379276637        6219.40889072218     
   12.2377321603128        6219.40889072218     
   12.2510263929619        6219.40889072218     
   12.2643206256109        6219.40889072218     
   12.2776148582600        6219.40889072218     
   12.2909090909091        6219.40889072218     
   12.3042033235582        6219.40889072218     
   12.3174975562072        6219.40889072218     
   12.3307917888563        6219.40889072218     
   12.3440860215054        6219.40889072218     
   12.3573802541544        6219.40889072218     
   12.3706744868035        6219.40889072218     
   12.3839687194526        6219.40889072218     
   12.3972629521017        6219.40889072218     
   12.4105571847507        6219.40889072218     
   12.4238514173998        6219.40889072218     
   12.4371456500489        6219.40889072218     
   12.4504398826979        6219.40889072218     
   12.4637341153470        6219.40889072218     
   12.4770283479961        6219.40889072218     
   12.4903225806452        6219.40889072218     
   12.5036168132942        6219.40889072218     
   12.5169110459433        6219.40889072218     
   12.5302052785924        6219.40889072218     
   12.5434995112414        6219.40889072218     
   12.5567937438905        6219.40889072218     
   12.5700879765396        6219.40889072218     
   12.5833822091887        6219.40889072218     
   12.5966764418377        6219.40889072218     
   12.6099706744868        6219.40889072218     
   12.6232649071359        6219.40889072218     
   12.6365591397849        6219.40889072218     
   12.6498533724340        6219.40889072218     
   12.6631476050831        6219.40889072218     
   12.6764418377322        6219.40889072218     
   12.6897360703812        6219.40889072218     
   12.7030303030303        6219.40889072218     
   12.7163245356794        6219.40889072218     
   12.7296187683284        6219.40889072218     
   12.7429130009775        6219.40889072218     
   12.7562072336266        6219.40889072218     
   12.7695014662757        6219.40889072218     
   12.7827956989247        6219.40889072218     
   12.7960899315738        6219.40889072218     
   12.8093841642229        6219.40889072218     
   12.8226783968719        6219.40889072218     
   12.8359726295210        6219.40889072218     
   12.8492668621701        6219.40889072218     
   12.8625610948192        6219.40889072218     
   12.8758553274682        6219.40889072218     
   12.8891495601173        6219.40889072218     
   12.9024437927664        6219.40889072218     
   12.9157380254154        6219.40889072218     
   12.9290322580645        6219.40889072218     
   12.9423264907136        6219.40889072218     
   12.9556207233627        6219.40889072218     
   12.9689149560117        6219.40889072218     
   12.9822091886608        6219.40889072218     
   12.9955034213099        6219.40889072218     
   13.0087976539589        6219.40889072218     
   13.0220918866080        6219.40889072218     
   13.0353861192571        6219.40889072218     
   13.0486803519062        6219.40889072218     
   13.0619745845552        6219.40889072218     
   13.0752688172043        6219.40889072218     
   13.0885630498534        6219.40889072218     
   13.1018572825024        6219.40889072218     
   13.1151515151515        6219.40889072218     
   13.1284457478006        6219.40889072218     
   13.1417399804497        6219.40889072218     
   13.1550342130987        6219.40889072218     
   13.1683284457478        6219.40889072218     
   13.1816226783969        6219.40889072218     
   13.1949169110459        6219.40889072218     
   13.2082111436950        6219.40889072218     
   13.2215053763441        6219.40889072218     
   13.2347996089932        6219.40889072218     
   13.2480938416422        6219.40889072218     
   13.2613880742913        6219.40889072218     
   13.2746823069404        6219.40889072218     
   13.2879765395894        6219.40889072218     
   13.3012707722385        6219.40889072218     
   13.3145650048876        6219.40889072218     
   13.3278592375367        6219.40889072218     
   13.3411534701857        6219.40889072218     
   13.3544477028348        6219.40889072218     
   13.3677419354839        6219.40889072218     
   13.3810361681329        6219.40889072218     
   13.3943304007820        6219.40889072218     
   13.4076246334311        6219.40889072218     
   13.4209188660802        6219.40889072218     
   13.4342130987292        6219.40889072218     
   13.4475073313783        6219.40889072218     
   13.4608015640274        6219.40889072218     
   13.4740957966764        6219.40889072218     
   13.4873900293255        6219.40889072218     
   13.5006842619746        6219.40889072218     
   13.5139784946237        6219.40889072218     
   13.5272727272727        6219.40889072218     
   13.5405669599218        6219.40889072218     
   13.5538611925709        6219.40889072218     
   13.5671554252199        6219.40889072218     
   13.5804496578690        6219.40889072218     
   13.5937438905181        6219.40889072218     
   13.6070381231672        6219.40889072218     
   13.6203323558162        6219.40889072218     
   13.6336265884653        6219.40889072218     
   13.6469208211144        6219.40889072218     
   13.6602150537634        6219.40889072218     
   13.6735092864125        6219.40889072218     
   13.6868035190616        6219.40889072218     
   13.7000977517107        6219.40889072218     
   13.7133919843597        6219.40889072218     
   13.7266862170088        6219.40889072218     
   13.7399804496579        6219.40889072218     
   13.7532746823069        6219.40889072218     
   13.7665689149560        6219.40889072218     
   13.7798631476051        6219.40889072218     
   13.7931573802542        6219.40889072218     
   13.8064516129032        6219.40889072218     
   13.8197458455523        6219.40889072218     
   13.8330400782014        6219.40889072218     
   13.8463343108504        6219.40889072218     
   13.8596285434995        6219.40889072218     
   13.8729227761486        6219.40889072218     
   13.8862170087977        6219.40889072218     
   13.8995112414467        6219.40889072218     
   13.9128054740958        6219.40889072218     
   13.9260997067449        6219.40889072218     
   13.9393939393939        6219.40889072218     
   13.9526881720430        6219.40889072218     
   13.9659824046921        6219.40889072218     
   13.9792766373412        6219.40889072218     
   13.9925708699902        6219.40889072218     
   14.0058651026393        6219.40889072218     
   14.0191593352884        6219.40889072218     
   14.0324535679374        6219.40889072218     
   14.0457478005865        6219.40889072218     
   14.0590420332356        6219.40889072218     
   14.0723362658847        6219.40889072218     
   14.0856304985337        6219.40889072218     
   14.0989247311828        6219.40889072218     
   14.1122189638319        6219.40889072218     
   14.1255131964809        6219.40889072218     
   14.1388074291300        6219.40889072218     
   14.1521016617791        6219.40889072218     
   14.1653958944282        6219.40889072218     
   14.1786901270772        6219.40889072218     
   14.1919843597263        6219.40889072218     
   14.2052785923754        6219.40889072218     
   14.2185728250244        6219.40889072218     
   14.2318670576735        6219.40889072218     
   14.2451612903226        6219.40889072218     
   14.2584555229717        6219.40889072218     
   14.2717497556207        6219.40889072218     
   14.2850439882698        6219.40889072218     
   14.2983382209189        6219.40889072218     
   14.3116324535679        6219.40889072218     
   14.3249266862170        6219.40889072218     
   14.3382209188661        6219.40889072218     
   14.3515151515152        6219.40889072218     
   14.3648093841642        6219.40889072218     
   14.3781036168133        6219.40889072218     
   14.3913978494624        6219.40889072218     
   14.4046920821114        6219.40889072218     
   14.4179863147605        6219.40889072218     
   14.4312805474096        6219.40889072218     
   14.4445747800587        6219.40889072218     
   14.4578690127077        6219.40889072218     
   14.4711632453568        6219.40889072218     
   14.4844574780059        6219.40889072218     
   14.4977517106549        6219.40889072218     
   14.5110459433040        6219.40889072218     
   14.5243401759531        6219.40889072218     
   14.5376344086021        6219.40889072218     
   14.5509286412512        6219.40889072218     
   14.5642228739003        6219.40889072218     
   14.5775171065494        6219.40889072218     
   14.5908113391984        6219.40889072218     
   14.6041055718475        6219.40889072218     
   14.6173998044966        6219.40889072218     
   14.6306940371457        6219.40889072218     
   14.6439882697947        6219.40889072218     
   14.6572825024438        6219.40889072218     
   14.6705767350929        6219.40889072218     
   14.6838709677419        6219.40889072218     
   14.6971652003910        6219.40889072218     
   14.7104594330401        6219.40889072218     
   14.7237536656892        6219.40889072218     
   14.7370478983382        6219.40889072218     
   14.7503421309873        6219.40889072218     
   14.7636363636364        6219.40889072218     
   14.7769305962854        6219.40889072218     
   14.7902248289345        6219.40889072218     
   14.8035190615836        6219.40889072218     
   14.8168132942327        6219.40889072218     
   14.8301075268817        6219.40889072218     
   14.8434017595308        6219.40889072218     
   14.8566959921799        6219.40889072218     
   14.8699902248289        6219.40889072218     
   14.8832844574780        6219.40889072218     
   14.8965786901271        6219.40889072218     
   14.9098729227761        6219.40889072218     
   14.9231671554252        6219.40889072218     
   14.9364613880743        6219.40889072218     
   14.9497556207234        6219.40889072218     
   14.9630498533724        6219.40889072218     
   14.9763440860215        6219.40889072218     
   14.9896383186706        6219.40889072218     
   15.0029325513197        6219.40889072218     
   15.0162267839687        6219.40889072218     
   15.0295210166178        6219.40889072218     
   15.0428152492669        6219.40889072218     
   15.0561094819159        6219.40889072218     
   15.0694037145650        6219.40889072218     
   15.0826979472141        6219.40889072218     
   15.0959921798631        6219.40889072218     
   15.1092864125122        6219.40889072218     
   15.1225806451613        6219.40889072218     
   15.1358748778104        6219.40889072218     
   15.1491691104594        6219.40889072218     
   15.1624633431085        6219.40889072218     
   15.1757575757576        6219.40889072218     
   15.1890518084066        6219.40889072218     
   15.2023460410557        6219.40889072218     
   15.2156402737048        6219.40889072218     
   15.2289345063539        6219.40889072218     
   15.2422287390029        6219.40889072218     
   15.2555229716520        6219.40889072218     
   15.2688172043011        6219.40889072218     
   15.2821114369501        6219.40889072218     
   15.2954056695992        6219.40889072218     
   15.3086999022483        6219.40889072218     
   15.3219941348974        6219.40889072218     
   15.3352883675464        6219.40889072218     
   15.3485826001955        6219.40889072218     
   15.3618768328446        6219.40889072218     
   15.3751710654936        6219.40889072218     
   15.3884652981427        6219.40889072218     
   15.4017595307918        6219.40889072218     
   15.4150537634409        6219.40889072218     
   15.4283479960899        6219.40889072218     
   15.4416422287390        6219.40889072218     
   15.4549364613881        6219.40889072218     
   15.4682306940371        6219.40889072218     
   15.4815249266862        6219.40889072218     
   15.4948191593353        6219.40889072218     
   15.5081133919844        6219.40889072218     
   15.5214076246334        6219.40889072218     
   15.5347018572825        6219.40889072218     
   15.5479960899316        6219.40889072218     
   15.5612903225806        6219.40889072218     
   15.5745845552297        6219.40889072218     
   15.5878787878788        6219.40889072218     
   15.6011730205279        6219.40889072218     
   15.6144672531769        6219.40889072218     
   15.6277614858260        6219.40889072218     
   15.6410557184751        6219.40889072218     
   15.6543499511241        6219.40889072218     
   15.6676441837732        6219.40889072218     
   15.6809384164223        6219.40889072218     
   15.6942326490714        6219.40889072218     
   15.7075268817204        6219.40889072218     
   15.7208211143695        6219.40889072218     
   15.7341153470186        6219.40889072218     
   15.7474095796676        6219.40889072218     
   15.7607038123167        6219.40889072218     
   15.7739980449658        6219.40889072218     
   15.7872922776149        6219.40889072218     
   15.8005865102639        6219.40889072218     
   15.8138807429130        6219.40889072218     
   15.8271749755621        6219.40889072218     
   15.8404692082111        6219.40889072218     
   15.8537634408602        6219.40889072218     
   15.8670576735093        6219.40889072218     
   15.8803519061584        6219.40889072218     
   15.8936461388074        6219.40889072218     
   15.9069403714565        6219.40889072218     
   15.9202346041056        6219.40889072218     
   15.9335288367546        6219.40889072218     
   15.9468230694037        6219.40889072218     
   15.9601173020528        6219.40889072218     
   15.9734115347019        6219.40889072218     
   15.9867057673509        6219.40889072218     
   16.0000000000000        6219.40889072218     
