<?xml version="1.0" encoding="UTF-8"?>
<svg width="439px" height="482px" viewBox="0 0 439 482" version="1.1" xmlns="http://www.w3.org/2000/svg" xmlns:xlink="http://www.w3.org/1999/xlink">
    <!-- Generator: Sketch 48.2 (47327) - http://www.bohemiancoding.com/sketch -->
    <title>unite-the-market</title>
    <desc>Created with Sketch.</desc>
    <defs></defs>
    <g id="Page-1" stroke="none" stroke-width="1" fill="none" fill-rule="evenodd">
        <g id="unite-the-market" fill-rule="nonzero">
            <g id="Group" transform="translate(3.000000, 364.000000)" fill="#00BFFF">
                <path d="M292.779,101.43 C292.509,101.43 292.259,101.33 292.069,101.14 C291.889,100.96 291.779,100.701 291.779,100.44 C291.779,100.179 291.889,99.92 292.069,99.73 C292.439,99.36 293.109,99.35 293.489,99.73 C293.67,99.92 293.779,100.18 293.779,100.44 C293.779,100.7 293.67,100.96 293.489,101.14 C293.3,101.33 293.04,101.43 292.779,101.43 Z" id="Shape"></path>
                <path d="M210.34,116.78 C210.319,116.23 210.76,115.77 211.31,115.759 C211.871,115.739 212.32,116.179 212.331,116.729 C212.351,117.289 211.911,117.749 211.36,117.759 C211.35,117.759 211.34,117.759 211.331,117.759 C210.79,117.76 210.35,117.32 210.34,116.78 Z M190.41,117.31 C189.859,117.281 189.439,116.8 189.479,116.25 C189.519,115.7 189.989,115.28 190.54,115.32 L190.54,115.31 C191.09,115.35 191.51,115.831 191.479,116.38 C191.439,116.91 191,117.31 190.469,117.31 C190.45,117.31 190.43,117.31 190.41,117.31 Z M231.16,115.48 C231.099,114.93 231.489,114.44 232.05,114.38 C232.59,114.32 233.09,114.71 233.15,115.26 C233.211,115.81 232.81,116.3 232.26,116.36 C232.23,116.37 232.19,116.37 232.15,116.37 C231.649,116.37 231.22,115.99 231.16,115.48 Z M169.58,115.04 C169.04,114.95 168.66,114.44 168.75,113.9 C168.83,113.35 169.34,112.97 169.89,113.06 C170.43,113.14 170.8,113.65 170.72,114.201 C170.65,114.691 170.22,115.051 169.73,115.051 C169.68,115.05 169.63,115.04 169.58,115.04 Z M251.79,112.36 C251.68,111.82 252.029,111.29 252.58,111.18 C253.12,111.07 253.64,111.43 253.75,111.97 C253.859,112.51 253.51,113.031 252.97,113.14 C252.9,113.161 252.83,113.161 252.77,113.161 C252.3,113.16 251.88,112.84 251.79,112.36 Z M149.029,110.95 C148.489,110.82 148.16,110.28 148.29,109.74 C148.42,109.21 148.97,108.88 149.5,109.01 C150.04,109.14 150.37,109.68 150.239,110.22 C150.12,110.68 149.71,110.98 149.26,110.98 C149.189,110.98 149.109,110.97 149.029,110.95 Z M272.069,107.45 C271.91,106.92 272.219,106.36 272.75,106.21 C273.279,106.05 273.83,106.35 273.989,106.89 C274.139,107.411 273.84,107.97 273.309,108.12 C273.209,108.15 273.12,108.17 273.019,108.17 C272.59,108.17 272.199,107.88 272.069,107.45 Z M128.91,105.1 C128.389,104.92 128.109,104.36 128.279,103.83 C128.46,103.309 129.029,103.03 129.55,103.21 C130.08,103.38 130.36,103.95 130.18,104.47 C130.04,104.89 129.65,105.15 129.23,105.15 C129.13,105.15 129.02,105.14 128.91,105.1 Z M109.38,97.53 C108.87,97.309 108.64,96.719 108.859,96.21 C109.089,95.71 109.67,95.47 110.179,95.7 C110.689,95.92 110.919,96.51 110.7,97.01 C110.529,97.39 110.16,97.61 109.779,97.61 C109.64,97.61 109.51,97.59 109.38,97.53 Z M90.58,88.3 C90.09,88.03 89.91,87.42 90.18,86.94 C90.44,86.45 91.05,86.27 91.53,86.54 C92.02,86.81 92.201,87.41 91.93,87.9 C91.75,88.23 91.41,88.42 91.05,88.42 C90.89,88.42 90.729,88.38 90.58,88.3 Z M72.64,77.47 C72.18,77.17 72.06,76.54 72.36,76.08 C72.671,75.62 73.291,75.5 73.751,75.8 C74.211,76.11 74.331,76.73 74.03,77.19 C73.841,77.48 73.52,77.64 73.201,77.64 C73,77.64 72.81,77.58 72.64,77.47 Z M55.72,65.13 C55.29,64.78 55.22,64.16 55.56,63.72 C55.911,63.29 56.54,63.22 56.97,63.57 C57.4,63.91 57.47,64.54 57.13,64.97 C56.93,65.22 56.64,65.35 56.34,65.35 C56.12,65.35 55.91,65.28 55.72,65.13 Z M39.939,51.36 C39.54,50.98 39.529,50.35 39.91,49.95 C40.29,49.55 40.92,49.53 41.319,49.92 C41.719,50.3 41.739,50.93 41.349,51.33 C41.16,51.54 40.889,51.64 40.629,51.64 C40.38,51.64 40.13,51.55 39.939,51.36 Z M25.42,36.27 C25.06,35.86 25.1,35.22 25.51,34.86 C25.93,34.49 26.56,34.54 26.92,34.95 C27.29,35.36 27.25,36 26.84,36.36 C26.65,36.53 26.41,36.61 26.17,36.61 C25.899,36.61 25.62,36.5 25.42,36.27 Z M12.29,19.97 C11.96,19.52 12.06,18.9 12.5,18.57 C12.95,18.24 13.569,18.34 13.899,18.78 C14.229,19.23 14.129,19.849 13.689,20.179 C13.509,20.309 13.299,20.379 13.099,20.379 C12.79,20.38 12.489,20.24 12.29,19.97 Z" id="Shape"></path>
                <path d="M1.439,2.98 C1.179,2.98 0.919,2.88 0.739,2.69 C0.55,2.51 0.439,2.25 0.439,1.98 C0.439,1.71 0.549,1.46 0.739,1.27 C1.099,0.91 1.769,0.9 2.149,1.27 C2.339,1.46 2.45,1.72 2.45,1.98 C2.45,2.24 2.34,2.5 2.149,2.69 C1.96,2.88 1.7,2.98 1.439,2.98 Z" id="Shape"></path>
            </g>
            <g id="Group" transform="translate(123.000000, 0.000000)" fill="#00BFFF">
                <path d="M1.45,18.98 C1.179,18.98 0.92,18.88 0.739,18.69 C0.55,18.5 0.439,18.24 0.439,17.98 C0.439,17.72 0.549,17.46 0.739,17.28 C1.12,16.9 1.79,16.9 2.149,17.28 C2.339,17.46 2.45,17.719 2.45,17.98 C2.45,18.25 2.34,18.51 2.149,18.69 C1.97,18.87 1.71,18.98 1.45,18.98 Z" id="Shape"></path>
                <path d="M280.319,99.64 C279.989,99.19 280.09,98.56 280.529,98.241 C280.979,97.911 281.599,98.001 281.929,98.451 C282.259,98.901 282.159,99.521 281.719,99.85 C281.539,99.98 281.329,100.04 281.119,100.04 C280.819,100.04 280.52,99.9 280.319,99.64 Z M267.3,83.47 C266.93,83.05 266.97,82.42 267.39,82.06 C267.8,81.69 268.43,81.73 268.8,82.15 C269.16,82.56 269.12,83.19 268.71,83.56 C268.52,83.73 268.279,83.81 268.04,83.81 C267.77,83.81 267.489,83.69 267.3,83.47 Z M252.899,68.51 C252.5,68.12 252.479,67.49 252.87,67.09 C253.25,66.69 253.88,66.67 254.279,67.06 C254.679,67.44 254.699,68.07 254.319,68.47 C254.12,68.68 253.859,68.781 253.59,68.781 C253.34,68.78 253.1,68.69 252.899,68.51 Z M237.25,54.85 C236.819,54.51 236.75,53.88 237.1,53.451 C237.44,53.021 238.07,52.951 238.5,53.291 C238.93,53.631 239,54.261 238.66,54.691 C238.46,54.941 238.17,55.071 237.87,55.071 C237.66,55.07 237.439,55 237.25,54.85 Z M220.47,42.61 C220.01,42.31 219.89,41.69 220.19,41.23 C220.501,40.77 221.121,40.64 221.581,40.95 C222.041,41.26 222.161,41.88 221.86,42.34 C221.661,42.63 221.35,42.78 221.02,42.78 C220.83,42.78 220.64,42.73 220.47,42.61 Z M202.689,31.88 C202.21,31.62 202.029,31.01 202.29,30.52 C202.56,30.04 203.16,29.86 203.649,30.13 C204.129,30.39 204.309,31 204.049,31.48 C203.859,31.81 203.519,32 203.169,32 C203,32 202.84,31.96 202.689,31.88 Z M184.04,22.72 C183.54,22.5 183.3,21.91 183.529,21.41 C183.75,20.9 184.34,20.67 184.849,20.889 C185.349,21.109 185.579,21.7 185.359,22.209 C185.189,22.579 184.83,22.809 184.439,22.809 C184.31,22.81 184.17,22.78 184.04,22.72 Z M164.67,15.21 C164.149,15.04 163.87,14.47 164.04,13.95 C164.22,13.42 164.79,13.139 165.31,13.32 C165.831,13.5 166.11,14.06 165.94,14.59 C165.8,15 165.411,15.27 164.99,15.27 C164.88,15.27 164.779,15.25 164.67,15.21 Z M20.239,11.53 C20.08,11 20.38,10.45 20.91,10.29 C21.45,10.14 22,10.44 22.16,10.97 C22.309,11.5 22.01,12.05 21.479,12.21 C21.379,12.24 21.29,12.25 21.2,12.25 C20.76,12.25 20.359,11.97 20.239,11.53 Z M144.72,9.41 C144.18,9.28 143.85,8.74 143.99,8.2 C144.121,7.66 144.661,7.33 145.2,7.47 C145.73,7.6 146.06,8.14 145.93,8.68 C145.82,9.13 145.41,9.44 144.96,9.44 C144.88,9.44 144.8,9.43 144.72,9.41 Z M40.47,6.45 C40.36,5.91 40.71,5.38 41.26,5.28 C41.8,5.17 42.33,5.52 42.43,6.06 C42.54,6.6 42.19,7.13 41.65,7.24 C41.59,7.25 41.52,7.26 41.461,7.26 C40.989,7.26 40.569,6.93 40.47,6.45 Z M124.34,5.36 C123.79,5.28 123.42,4.77 123.5,4.22 C123.58,3.67 124.1,3.3 124.64,3.38 C125.19,3.47 125.56,3.98 125.48,4.52 C125.4,5.02 124.98,5.37 124.49,5.37 C124.439,5.37 124.39,5.37 124.34,5.36 Z M61.08,3.16 C61.01,2.61 61.41,2.11 61.96,2.05 C62.51,1.99 63,2.39 63.06,2.94 C63.121,3.49 62.73,3.98 62.18,4.04 C62.14,4.05 62.11,4.05 62.07,4.05 C61.569,4.05 61.13,3.67 61.08,3.16 Z M103.68,3.1 C103.13,3.06 102.71,2.59 102.75,2.04 C102.79,1.49 103.26,1.07 103.81,1.11 C104.36,1.14 104.78,1.62 104.74,2.17 C104.711,2.7 104.27,3.1 103.751,3.1 C103.729,3.1 103.71,3.1 103.68,3.1 Z M81.89,1.68 C81.88,1.13 82.31,0.67 82.86,0.66 C83.421,0.65 83.871,1.09 83.89,1.639 C83.9,2.189 83.46,2.649 82.911,2.66 C82.9,2.66 82.89,2.66 82.89,2.66 C82.34,2.66 81.899,2.23 81.89,1.68 Z" id="Shape"></path>
                <path d="M292.779,117.44 C292.509,117.44 292.25,117.33 292.069,117.14 C291.889,116.96 291.779,116.701 291.779,116.44 C291.779,116.17 291.889,115.92 292.069,115.73 C292.439,115.36 293.12,115.36 293.489,115.73 C293.67,115.92 293.779,116.17 293.779,116.44 C293.779,116.7 293.67,116.96 293.489,117.14 C293.3,117.33 293.05,117.44 292.779,117.44 Z" id="Shape"></path>
            </g>
            <g id="Group" transform="translate(0.000000, 144.000000)" fill="#1CCC9B">
                <path d="M79.521,138.364 C73.184,144.292 64.974,147.869 54.89,149.095 L54.89,173.013 L39.15,173.013 L39.15,148.891 C22.524,146.302 9.647,136.966 0.516,120.885 L11.963,112.708 C19.321,124.701 28.384,131.924 39.15,134.377 L39.15,88.791 L37.923,88.382 C29.201,84.702 22.285,80.341 17.175,75.299 C12.066,70.257 9.51,63.647 9.51,55.47 C9.51,47.293 12.27,40.479 17.788,35.028 C23.308,29.577 30.428,26.17 39.149,24.807 L39.149,0.481 L54.888,0.481 L54.888,24.398 C68.242,26.169 78.735,33.461 86.367,46.271 L75.533,54.653 C69.674,45.795 62.792,40.616 54.888,39.117 L54.888,79.797 L59.384,81.637 C68.923,85.589 76.248,90.257 81.359,95.64 C86.468,101.023 89.024,107.735 89.024,115.776 C89.025,124.906 85.856,132.436 79.521,138.364 Z M28.93,65.59 C31.246,68.247 34.654,70.666 39.151,72.847 L39.151,39.527 C30.02,41.707 25.456,46.954 25.456,55.267 C25.455,59.491 26.613,62.933 28.93,65.59 Z M68.176,128.348 C71.447,125.145 73.081,121.023 73.081,115.98 C73.081,111.21 71.549,107.361 68.482,104.43 C65.416,101.5 60.884,98.604 54.889,95.742 L54.889,134.786 C60.477,133.696 64.905,131.55 68.176,128.348 Z" id="Shape"></path>
                <path d="M191.843,119.455 C191.843,130.357 187.517,139.182 178.864,145.928 C170.211,152.674 158.799,156.047 144.626,156.047 C130.317,156.047 118.803,152.64 110.082,145.825 C101.36,139.012 97,130.153 97,119.251 C97,103.033 107.629,91.04 128.887,83.272 C111.854,75.368 103.336,64.329 103.336,50.156 C103.336,39.662 107.254,31.451 115.09,25.523 C122.925,19.594 132.771,16.63 144.626,16.63 C156.209,16.63 165.919,19.594 173.754,25.523 C181.59,31.451 185.508,39.662 185.508,50.156 C185.508,64.738 176.99,75.776 159.957,83.272 C181.214,91.04 191.843,103.102 191.843,119.455 Z M167.621,135.911 C173.004,131.618 175.695,125.929 175.695,118.842 C175.695,111.755 173.072,106.201 167.825,102.182 C162.579,98.161 154.777,94.379 144.421,90.836 C134.2,94.379 126.433,98.161 121.118,102.182 C115.804,106.202 113.146,111.755 113.146,118.842 C113.146,125.929 115.906,131.618 121.424,135.911 C126.944,140.204 134.677,142.35 144.624,142.35 C154.573,142.351 162.238,140.204 167.621,135.911 Z M125.309,64.977 C129.465,68.588 135.836,72.098 144.421,75.504 C153.006,72.098 159.377,68.554 163.533,64.874 C167.689,61.194 169.767,56.493 169.767,50.77 C169.767,44.365 167.416,39.356 162.714,35.745 C158.013,32.134 151.984,30.328 144.624,30.328 C137.13,30.328 130.997,32.134 126.228,35.745 C121.459,39.356 119.074,44.365 119.074,50.77 C119.074,56.629 121.152,61.365 125.309,64.977 Z" id="Shape"></path>
                <path d="M290.777,139.488 L290.777,153.798 L196.955,153.798 L196.955,149.709 L244.99,98.604 C253.302,89.882 259.333,82.625 263.08,76.833 C266.828,71.041 268.701,64.874 268.701,58.333 C268.701,50.837 266.35,44.466 261.649,39.22 C256.948,33.973 250.645,31.349 242.742,31.349 C234.565,31.349 228.024,34.075 223.119,39.527 C218.213,44.978 215.76,51.519 215.76,59.151 C215.76,62.967 216.169,66.714 216.987,70.394 L200.634,70.394 C199.681,66.714 199.203,62.762 199.203,58.538 C199.203,47.499 203.189,37.755 211.161,29.306 C219.133,20.857 229.66,16.632 242.742,16.632 C255.142,16.632 265.329,20.516 273.301,28.284 C281.273,36.052 285.259,45.796 285.259,57.515 C285.259,63.648 283.827,69.815 280.966,76.016 C278.105,82.216 275.004,87.395 271.665,91.552 C268.327,95.708 263.455,101.194 257.051,108.008 L227.207,139.488 L290.777,139.488 Z" id="Shape"></path>
                <path d="M360.029,116.897 C362.826,120.681 364.225,125.166 364.225,130.349 C364.225,137.26 361.901,142.896 357.252,147.256 C352.605,151.616 346.331,153.797 338.434,153.797 L304.871,153.797 L304.871,72.345 L332.882,72.345 C339.957,72.345 345.592,74.278 349.788,78.145 C353.983,82.012 356.081,86.949 356.081,92.955 C356.081,99.784 353.448,105.132 348.184,108.999 C353.284,110.479 357.232,113.112 360.029,116.897 Z M314.496,80.984 L314.496,106.284 L331.894,106.284 C336.501,106.284 340.039,105.132 342.506,102.828 C344.975,100.524 346.208,97.439 346.208,93.572 C346.208,89.705 344.975,86.64 342.506,84.378 C340.038,82.115 336.501,80.984 331.894,80.984 L314.496,80.984 Z M349.911,141.024 C352.872,138.268 354.353,134.628 354.353,130.102 C354.353,125.576 352.872,121.936 349.911,119.18 C346.949,116.423 342.795,115.045 337.448,115.045 L314.496,115.045 L314.496,145.158001 L337.448,145.158 C342.795,145.159 346.949,143.781 349.911,141.024 Z" id="Shape"></path>
                <path d="M416.55,98.879 C420.499,103.239 422.473,108.958 422.473,116.033 L422.473,153.798 L412.972,153.798 L412.972,117.145 C412.972,112.373 411.635,108.505 408.961,105.543 C406.287,102.581 402.648,101.101 398.04,101.101 C393.434,101.101 389.649,102.602 386.687,105.606 C383.726,108.609 382.245,112.455 382.245,117.145 L382.245,153.798 L372.744,153.798 L372.744,93.695 L381.628,93.695 L381.628,100.236 C386.07,94.97 392.24,92.338 400.138,92.338 C407.131,92.338 412.602,94.519 416.55,98.879 Z" id="Shape"></path>
            </g>
            <g id="Group" transform="translate(10.000000, 34.000000)">
                <g transform="translate(1.000000, 44.000000)" fill="#1CCC9B" id="Shape">
                    <path d="M15.735,25.615 C14.56,26.74 13.037,27.441 11.167,27.719 L11.167,32.232 L7.488,32.232 L7.488,27.681 C4.455,27.125 2.142,25.407 0.55,22.525 L3.318,20.477 C4.456,22.297 5.846,23.472 7.489,24.003 L7.489,16.988 C3.849,15.572 2.029,13.474 2.029,10.693 C2.029,9.151 2.535,7.856 3.546,6.806 C4.558,5.757 5.872,5.069 7.489,4.74 L7.489,0.228 L11.168,0.228 L11.168,4.665 C13.67,5.12 15.592,6.522 16.932,8.874 L14.202,10.921 C13.343,9.607 12.331,8.76 11.169,8.381 L11.169,14.562 L11.852,14.828 C15.619,16.294 17.501,18.455 17.501,21.311 C17.499,23.056 16.911,24.49 15.735,25.615 Z M7.488,12.97 L7.488,8.495 C6.503,8.95 6.009,9.671 6.009,10.656 C6.01,11.617 6.503,12.389 7.488,12.97 Z M13.518,21.388 C13.518,20.25 12.735,19.302 11.167,18.544 L11.167,24.08 C12.734,23.65 13.518,22.753 13.518,21.388 Z"></path>
                    <polygon points="30.539 3.604 30.539 28.63 26.519 28.63 26.519 8.344 21.438 9.975 20.453 6.449 29.137 3.604"></polygon>
                    <path d="M51.127,15.378 C52.416,16.73 53.061,18.468 53.061,20.591 C53.061,23.094 52.17,25.129 50.388,26.696 C48.606,28.263 46.45,29.047 43.923,29.047 C41.901,29.047 40.137,28.548 38.633,27.549 C37.129,26.551 35.96,25.242 35.125,23.625 L37.932,21.653 C39.549,24.13 41.508,25.369 43.809,25.369 C45.3,25.369 46.527,24.932 47.487,24.06 C48.448,23.188 48.928,22.044 48.928,20.628 C48.928,19.213 48.429,18.126 47.43,17.367 C46.432,16.608 45.01,16.229 43.164,16.229 L40.395,16.229 L40.395,15.129 L46.273,7.28 L36.907,7.28 L36.907,3.601 L52.492,3.601 L52.492,4.701 L46.425,12.853 C48.271,13.185 49.838,14.025 51.127,15.378 Z"></path>
                    <polygon points="65.912 3.604 65.912 28.63 61.892 28.63 61.892 8.344 56.811 9.975 55.826 6.449 64.51 3.604"></polygon>
                </g>
                <g transform="translate(2.000000, 0.000000)" fill="#00BFFF" id="Shape">
                    <path d="M5.262,0.524 C5.784,0.827 6.19,1.226 6.479,1.721 L5.444,2.519 C4.95,1.773 4.301,1.399 3.5,1.399 C3.107,1.399 2.776,1.495 2.506,1.686 C2.236,1.877 2.101,2.156 2.101,2.519 C2.101,2.837 2.199,3.08 2.395,3.248 C2.59,3.416 2.921,3.612 3.388,3.837 L4.423,4.313 C5.169,4.659 5.725,5.033 6.088,5.434 C6.452,5.835 6.634,6.34 6.634,6.947 C6.634,7.751 6.343,8.397 5.76,8.887 C5.177,9.377 4.438,9.622 3.542,9.622 C2.786,9.622 2.104,9.444 1.499,9.09 C0.893,8.735 0.412,8.244 0.058,7.619 L1.107,6.82 C1.789,7.8 2.595,8.291 3.528,8.291 C4.004,8.291 4.388,8.175 4.682,7.941 C4.976,7.707 5.123,7.394 5.123,7.002 C5.123,6.676 5.018,6.419 4.808,6.232 C4.598,6.044 4.25,5.839 3.766,5.615 L2.745,5.139 C2.064,4.83 1.534,4.476 1.157,4.075 C0.779,3.673 0.59,3.174 0.59,2.576 C0.59,1.829 0.87,1.224 1.43,0.762 C1.99,0.3 2.68,0.069 3.501,0.069 C4.151,0.068 4.739,0.221 5.262,0.524 Z"></path>
                    <polygon points="21.371 0.223 17.775 9.622 17.285 9.622 14.529 3.066 11.772 9.622 11.268 9.622 7.672 0.223 9.309 0.223 11.604 6.47 14.262 0.069 14.781 0.069 17.439 6.47 19.748 0.223"></polygon>
                    <polygon points="29.117 1.554 24.527 1.554 24.527 3.921 27.983 3.921 27.983 5.209 24.527 5.209 24.527 8.137 29.285 8.137 29.285 9.468 23.044 9.468 23.044 0.223 29.117 0.223"></polygon>
                    <path d="M37.559,1.497 C38.473,2.348 38.93,3.459 38.93,4.831 C38.93,6.194 38.471,7.309 37.552,8.172 C36.633,9.036 35.418,9.468 33.906,9.468 L31.01,9.468 L31.01,0.223 L33.906,0.223 C35.427,0.223 36.645,0.647 37.559,1.497 Z M32.493,1.567 L32.493,8.136 L33.892,8.136 C34.964,8.136 35.818,7.828 36.453,7.212 C37.087,6.596 37.404,5.802 37.404,4.83 C37.404,3.841 37.09,3.049 36.46,2.456 C35.83,1.863 34.975,1.566 33.893,1.566 L32.493,1.566 L32.493,1.567 Z"></path>
                    <polygon points="46.771 1.554 42.181 1.554 42.181 3.921 45.637 3.921 45.637 5.209 42.181 5.209 42.181 8.137 46.939 8.137 46.939 9.468 40.698 9.468 40.698 0.223 46.771 0.223"></polygon>
                    <polygon points="56.275 0.223 56.275 9.622 55.771 9.622 50.146 3.221 50.146 9.468 48.663 9.468 48.663 0.069 49.181 0.069 54.792 6.457 54.792 0.224 56.275 0.224"></polygon>
                </g>
                <rect id="Rectangle-path" fill="#00BFFF" x="0.185" y="25.597" width="159.308" height="1.122"></rect>
            </g>
            <g id="Group" transform="translate(279.000000, 346.000000)">
                <g transform="translate(1.000000, 46.000000)" fill="#1CCC9B" id="Shape">
                    <polygon points="18.025 12.709 7.597 17.107 18.025 21.505 18.025 25.107 0.923 17.675 0.923 16.537 18.025 9.105"></polygon>
                    <path d="M37.037,26.15 C35.862,27.275 34.339,27.976 32.469,28.254 L32.469,32.767 L28.79,32.767 L28.79,28.216 C25.757,27.66 23.444,25.942 21.852,23.06 L24.62,21.012 C25.758,22.832 27.148,24.007 28.791,24.538 L28.791,17.523 C25.151,16.107 23.331,14.009 23.331,11.228 C23.331,9.686 23.837,8.391 24.848,7.341 C25.86,6.292 27.174,5.604 28.791,5.275 L28.791,0.763 L32.47,0.763 L32.47,5.2 C34.972,5.655 36.894,7.057 38.234,9.409 L35.504,11.456 C34.645,10.142 33.633,9.295 32.471,8.916 L32.471,15.097 L33.154,15.363 C36.921,16.829 38.803,18.99 38.803,21.846 C38.801,23.591 38.213,25.025 37.037,26.15 Z M28.79,13.505 L28.79,9.03 C27.805,9.485 27.311,10.206 27.311,11.191 C27.312,12.152 27.805,12.924 28.79,13.505 Z M34.819,21.923 C34.819,20.785 34.036,19.837 32.468,19.079 L32.468,24.615 C34.036,24.186 34.819,23.288 34.819,21.923 Z"></path>
                    <polygon points="51.841 4.139 51.841 29.165 47.821 29.165 47.821 8.879 42.74 10.51 41.755 6.984 50.439 4.139 51.841 4.139"></polygon>
                </g>
                <g transform="translate(2.000000, 0.000000)" fill="#00BFFF" id="Shape">
                    <polygon points="9.558 0.825 9.558 10.224 8.075 10.224 8.075 4.425 5.43 7.899 4.926 7.899 2.268 4.425 2.268 10.224 0.785 10.224 0.785 0.825 1.303 0.825 5.179 5.994 9.055 0.825"></polygon>
                    <polygon points="17.959 2.311 13.369 2.311 13.369 4.678 16.825 4.678 16.825 5.967 13.369 5.967 13.369 8.894 18.127 8.894 18.127 10.225 11.886 10.225 11.886 0.98 17.959 0.98"></polygon>
                    <polygon points="25.169 10.225 22.93 6.779 20.705 10.225 18.998 10.225 22.118 5.504 19.194 0.98 20.901 0.98 22.944 4.258 24.959 0.98 26.652 0.98 23.783 5.518 26.862 10.225"></polygon>
                    <polygon points="29.833 10.225 28.35 10.225 28.35 0.98 29.833 0.98"></polygon>
                    <path d="M38.769,1.399 C39.464,1.783 40.012,2.3 40.414,2.955 L39.295,3.781 C38.605,2.717 37.662,2.184 36.468,2.184 C35.517,2.184 34.724,2.508 34.09,3.158 C33.455,3.806 33.138,4.621 33.138,5.602 C33.138,6.582 33.455,7.397 34.09,8.046 C34.724,8.694 35.517,9.019 36.468,9.019 C37.662,9.019 38.605,8.487 39.295,7.422 L40.414,8.249 C40.022,8.902 39.478,9.421 38.784,9.804 C38.089,10.187 37.312,10.378 36.454,10.378 C35.092,10.378 33.942,9.92 33.005,9.005 C32.068,8.09 31.599,6.955 31.599,5.602 C31.599,4.257 32.07,3.124 33.012,2.205 C33.954,1.286 35.102,0.825 36.454,0.825 C37.302,0.825 38.074,1.017 38.769,1.399 Z"></path>
                    <path d="M49.842,2.205 C50.789,3.125 51.262,4.258 51.262,5.602 C51.262,6.946 50.789,8.079 49.842,8.998 C48.896,9.918 47.75,10.378 46.407,10.378 C45.054,10.378 43.909,9.918 42.971,8.998 C42.033,8.078 41.565,6.946 41.565,5.602 C41.565,4.258 42.034,3.124 42.971,2.205 C43.908,1.286 45.054,0.825 46.407,0.825 C47.75,0.825 48.896,1.285 49.842,2.205 Z M44.042,3.15 C43.417,3.795 43.104,4.607 43.104,5.588 C43.104,6.578 43.416,7.398 44.042,8.047 C44.667,8.695 45.46,9.02 46.421,9.02 C47.372,9.02 48.163,8.696 48.793,8.047 C49.422,7.398 49.737,6.578 49.737,5.588 C49.737,4.617 49.42,3.807 48.785,3.158 C48.151,2.509 47.363,2.184 46.421,2.184 C45.46,2.185 44.667,2.507 44.042,3.15 Z"></path>
                </g>
                <rect id="Rectangle-path" fill="#00BFFF" x="0.255" y="26.354" width="159.307" height="1.122"></rect>
            </g>
        </g>
    </g>
</svg>