<?xml version="1.0" encoding="UTF-8"?>
<svg width="400mm" height="400mm" version="1.1" viewBox="0 0 400 400" xmlns="http://www.w3.org/2000/svg" xmlns:cc="http://creativecommons.org/ns#" xmlns:dc="http://purl.org/dc/elements/1.1/" xmlns:rdf="http://www.w3.org/1999/02/22-rdf-syntax-ns#">
<line x1="0" y1="20" x2="19.5" y2="20" style="stroke:rgb(0,0,0);stroke-width:0.1" />
<line x1="10.0" y1="40" x2="29.5" y2="40" style="stroke:rgb(0,0,0);stroke-width:0.1" />
<line x1="0" y1="60" x2="19.5" y2="60" style="stroke:rgb(0,0,0);stroke-width:0.1" />
<line x1="10.0" y1="80" x2="29.5" y2="80" style="stroke:rgb(0,0,0);stroke-width:0.1" />
<line x1="0" y1="100" x2="19.5" y2="100" style="stroke:rgb(0,0,0);stroke-width:0.1" />
<line x1="10.0" y1="120" x2="29.5" y2="120" style="stroke:rgb(0,0,0);stroke-width:0.1" />
<line x1="0" y1="140" x2="19.5" y2="140" style="stroke:rgb(0,0,0);stroke-width:0.1" />
<line x1="10.0" y1="160" x2="29.5" y2="160" style="stroke:rgb(0,0,0);stroke-width:0.1" />
<line x1="0" y1="180" x2="19.5" y2="180" style="stroke:rgb(0,0,0);stroke-width:0.1" />
<line x1="10.0" y1="200" x2="29.5" y2="200" style="stroke:rgb(0,0,0);stroke-width:0.1" />
<line x1="0" y1="220" x2="19.5" y2="220" style="stroke:rgb(0,0,0);stroke-width:0.1" />
<line x1="10.0" y1="240" x2="29.5" y2="240" style="stroke:rgb(0,0,0);stroke-width:0.1" />
<line x1="0" y1="260" x2="19.5" y2="260" style="stroke:rgb(0,0,0);stroke-width:0.1" />
<line x1="10.0" y1="280" x2="29.5" y2="280" style="stroke:rgb(0,0,0);stroke-width:0.1" />
<line x1="0" y1="300" x2="19.5" y2="300" style="stroke:rgb(0,0,0);stroke-width:0.1" />
<line x1="10.0" y1="320" x2="29.5" y2="320" style="stroke:rgb(0,0,0);stroke-width:0.1" />
<line x1="0" y1="340" x2="19.5" y2="340" style="stroke:rgb(0,0,0);stroke-width:0.1" />
<line x1="10.0" y1="360" x2="29.5" y2="360" style="stroke:rgb(0,0,0);stroke-width:0.1" />
<line x1="0" y1="380" x2="19.5" y2="380" style="stroke:rgb(0,0,0);stroke-width:0.1" />
<line x1="10.0" y1="400" x2="29.5" y2="400" style="stroke:rgb(0,0,0);stroke-width:0.1" />
<line x1="20" y1="20" x2="39.5" y2="20" style="stroke:rgb(0,0,0);stroke-width:0.1" />
<line x1="30.0" y1="40" x2="49.5" y2="40" style="stroke:rgb(0,0,0);stroke-width:0.1" />
<line x1="20" y1="60" x2="39.5" y2="60" style="stroke:rgb(0,0,0);stroke-width:0.1" />
<line x1="30.0" y1="80" x2="49.5" y2="80" style="stroke:rgb(0,0,0);stroke-width:0.1" />
<line x1="20" y1="100" x2="39.5" y2="100" style="stroke:rgb(0,0,0);stroke-width:0.1" />
<line x1="30.0" y1="120" x2="49.5" y2="120" style="stroke:rgb(0,0,0);stroke-width:0.1" />
<line x1="20" y1="140" x2="39.5" y2="140" style="stroke:rgb(0,0,0);stroke-width:0.1" />
<line x1="30.0" y1="160" x2="49.5" y2="160" style="stroke:rgb(0,0,0);stroke-width:0.1" />
<line x1="20" y1="180" x2="39.5" y2="180" style="stroke:rgb(0,0,0);stroke-width:0.1" />
<line x1="30.0" y1="200" x2="49.5" y2="200" style="stroke:rgb(0,0,0);stroke-width:0.1" />
<line x1="20" y1="220" x2="39.5" y2="220" style="stroke:rgb(0,0,0);stroke-width:0.1" />
<line x1="30.0" y1="240" x2="49.5" y2="240" style="stroke:rgb(0,0,0);stroke-width:0.1" />
<line x1="20" y1="260" x2="39.5" y2="260" style="stroke:rgb(0,0,0);stroke-width:0.1" />
<line x1="30.0" y1="280" x2="49.5" y2="280" style="stroke:rgb(0,0,0);stroke-width:0.1" />
<line x1="20" y1="300" x2="39.5" y2="300" style="stroke:rgb(0,0,0);stroke-width:0.1" />
<line x1="30.0" y1="320" x2="49.5" y2="320" style="stroke:rgb(0,0,0);stroke-width:0.1" />
<line x1="20" y1="340" x2="39.5" y2="340" style="stroke:rgb(0,0,0);stroke-width:0.1" />
<line x1="30.0" y1="360" x2="49.5" y2="360" style="stroke:rgb(0,0,0);stroke-width:0.1" />
<line x1="20" y1="380" x2="39.5" y2="380" style="stroke:rgb(0,0,0);stroke-width:0.1" />
<line x1="30.0" y1="400" x2="49.5" y2="400" style="stroke:rgb(0,0,0);stroke-width:0.1" />
<line x1="40" y1="20" x2="59.5" y2="20" style="stroke:rgb(0,0,0);stroke-width:0.1" />
<line x1="50.0" y1="40" x2="69.5" y2="40" style="stroke:rgb(0,0,0);stroke-width:0.1" />
<line x1="40" y1="60" x2="59.5" y2="60" style="stroke:rgb(0,0,0);stroke-width:0.1" />
<line x1="50.0" y1="80" x2="69.5" y2="80" style="stroke:rgb(0,0,0);stroke-width:0.1" />
<line x1="40" y1="100" x2="59.5" y2="100" style="stroke:rgb(0,0,0);stroke-width:0.1" />
<line x1="50.0" y1="120" x2="69.5" y2="120" style="stroke:rgb(0,0,0);stroke-width:0.1" />
<line x1="40" y1="140" x2="59.5" y2="140" style="stroke:rgb(0,0,0);stroke-width:0.1" />
<line x1="50.0" y1="160" x2="69.5" y2="160" style="stroke:rgb(0,0,0);stroke-width:0.1" />
<line x1="40" y1="180" x2="59.5" y2="180" style="stroke:rgb(0,0,0);stroke-width:0.1" />
<line x1="50.0" y1="200" x2="69.5" y2="200" style="stroke:rgb(0,0,0);stroke-width:0.1" />
<line x1="40" y1="220" x2="59.5" y2="220" style="stroke:rgb(0,0,0);stroke-width:0.1" />
<line x1="50.0" y1="240" x2="69.5" y2="240" style="stroke:rgb(0,0,0);stroke-width:0.1" />
<line x1="40" y1="260" x2="59.5" y2="260" style="stroke:rgb(0,0,0);stroke-width:0.1" />
<line x1="50.0" y1="280" x2="69.5" y2="280" style="stroke:rgb(0,0,0);stroke-width:0.1" />
<line x1="40" y1="300" x2="59.5" y2="300" style="stroke:rgb(0,0,0);stroke-width:0.1" />
<line x1="50.0" y1="320" x2="69.5" y2="320" style="stroke:rgb(0,0,0);stroke-width:0.1" />
<line x1="40" y1="340" x2="59.5" y2="340" style="stroke:rgb(0,0,0);stroke-width:0.1" />
<line x1="50.0" y1="360" x2="69.5" y2="360" style="stroke:rgb(0,0,0);stroke-width:0.1" />
<line x1="40" y1="380" x2="59.5" y2="380" style="stroke:rgb(0,0,0);stroke-width:0.1" />
<line x1="50.0" y1="400" x2="69.5" y2="400" style="stroke:rgb(0,0,0);stroke-width:0.1" />
<line x1="60" y1="20" x2="79.5" y2="20" style="stroke:rgb(0,0,0);stroke-width:0.1" />
<line x1="70.0" y1="40" x2="89.5" y2="40" style="stroke:rgb(0,0,0);stroke-width:0.1" />
<line x1="60" y1="60" x2="79.5" y2="60" style="stroke:rgb(0,0,0);stroke-width:0.1" />
<line x1="70.0" y1="80" x2="89.5" y2="80" style="stroke:rgb(0,0,0);stroke-width:0.1" />
<line x1="60" y1="100" x2="79.5" y2="100" style="stroke:rgb(0,0,0);stroke-width:0.1" />
<line x1="70.0" y1="120" x2="89.5" y2="120" style="stroke:rgb(0,0,0);stroke-width:0.1" />
<line x1="60" y1="140" x2="79.5" y2="140" style="stroke:rgb(0,0,0);stroke-width:0.1" />
<line x1="70.0" y1="160" x2="89.5" y2="160" style="stroke:rgb(0,0,0);stroke-width:0.1" />
<line x1="60" y1="180" x2="79.5" y2="180" style="stroke:rgb(0,0,0);stroke-width:0.1" />
<line x1="70.0" y1="200" x2="89.5" y2="200" style="stroke:rgb(0,0,0);stroke-width:0.1" />
<line x1="60" y1="220" x2="79.5" y2="220" style="stroke:rgb(0,0,0);stroke-width:0.1" />
<line x1="70.0" y1="240" x2="89.5" y2="240" style="stroke:rgb(0,0,0);stroke-width:0.1" />
<line x1="60" y1="260" x2="79.5" y2="260" style="stroke:rgb(0,0,0);stroke-width:0.1" />
<line x1="70.0" y1="280" x2="89.5" y2="280" style="stroke:rgb(0,0,0);stroke-width:0.1" />
<line x1="60" y1="300" x2="79.5" y2="300" style="stroke:rgb(0,0,0);stroke-width:0.1" />
<line x1="70.0" y1="320" x2="89.5" y2="320" style="stroke:rgb(0,0,0);stroke-width:0.1" />
<line x1="60" y1="340" x2="79.5" y2="340" style="stroke:rgb(0,0,0);stroke-width:0.1" />
<line x1="70.0" y1="360" x2="89.5" y2="360" style="stroke:rgb(0,0,0);stroke-width:0.1" />
<line x1="60" y1="380" x2="79.5" y2="380" style="stroke:rgb(0,0,0);stroke-width:0.1" />
<line x1="70.0" y1="400" x2="89.5" y2="400" style="stroke:rgb(0,0,0);stroke-width:0.1" />
<line x1="80" y1="20" x2="99.5" y2="20" style="stroke:rgb(0,0,0);stroke-width:0.1" />
<line x1="90.0" y1="40" x2="109.5" y2="40" style="stroke:rgb(0,0,0);stroke-width:0.1" />
<line x1="80" y1="60" x2="99.5" y2="60" style="stroke:rgb(0,0,0);stroke-width:0.1" />
<line x1="90.0" y1="80" x2="109.5" y2="80" style="stroke:rgb(0,0,0);stroke-width:0.1" />
<line x1="80" y1="100" x2="99.5" y2="100" style="stroke:rgb(0,0,0);stroke-width:0.1" />
<line x1="90.0" y1="120" x2="109.5" y2="120" style="stroke:rgb(0,0,0);stroke-width:0.1" />
<line x1="80" y1="140" x2="99.5" y2="140" style="stroke:rgb(0,0,0);stroke-width:0.1" />
<line x1="90.0" y1="160" x2="109.5" y2="160" style="stroke:rgb(0,0,0);stroke-width:0.1" />
<line x1="80" y1="180" x2="99.5" y2="180" style="stroke:rgb(0,0,0);stroke-width:0.1" />
<line x1="90.0" y1="200" x2="109.5" y2="200" style="stroke:rgb(0,0,0);stroke-width:0.1" />
<line x1="80" y1="220" x2="99.5" y2="220" style="stroke:rgb(0,0,0);stroke-width:0.1" />
<line x1="90.0" y1="240" x2="109.5" y2="240" style="stroke:rgb(0,0,0);stroke-width:0.1" />
<line x1="80" y1="260" x2="99.5" y2="260" style="stroke:rgb(0,0,0);stroke-width:0.1" />
<line x1="90.0" y1="280" x2="109.5" y2="280" style="stroke:rgb(0,0,0);stroke-width:0.1" />
<line x1="80" y1="300" x2="99.5" y2="300" style="stroke:rgb(0,0,0);stroke-width:0.1" />
<line x1="90.0" y1="320" x2="109.5" y2="320" style="stroke:rgb(0,0,0);stroke-width:0.1" />
<line x1="80" y1="340" x2="99.5" y2="340" style="stroke:rgb(0,0,0);stroke-width:0.1" />
<line x1="90.0" y1="360" x2="109.5" y2="360" style="stroke:rgb(0,0,0);stroke-width:0.1" />
<line x1="80" y1="380" x2="99.5" y2="380" style="stroke:rgb(0,0,0);stroke-width:0.1" />
<line x1="90.0" y1="400" x2="109.5" y2="400" style="stroke:rgb(0,0,0);stroke-width:0.1" />
<line x1="100" y1="20" x2="119.5" y2="20" style="stroke:rgb(0,0,0);stroke-width:0.1" />
<line x1="110.0" y1="40" x2="129.5" y2="40" style="stroke:rgb(0,0,0);stroke-width:0.1" />
<line x1="100" y1="60" x2="119.5" y2="60" style="stroke:rgb(0,0,0);stroke-width:0.1" />
<line x1="110.0" y1="80" x2="129.5" y2="80" style="stroke:rgb(0,0,0);stroke-width:0.1" />
<line x1="100" y1="100" x2="119.5" y2="100" style="stroke:rgb(0,0,0);stroke-width:0.1" />
<line x1="110.0" y1="120" x2="129.5" y2="120" style="stroke:rgb(0,0,0);stroke-width:0.1" />
<line x1="100" y1="140" x2="119.5" y2="140" style="stroke:rgb(0,0,0);stroke-width:0.1" />
<line x1="110.0" y1="160" x2="129.5" y2="160" style="stroke:rgb(0,0,0);stroke-width:0.1" />
<line x1="100" y1="180" x2="119.5" y2="180" style="stroke:rgb(0,0,0);stroke-width:0.1" />
<line x1="110.0" y1="200" x2="129.5" y2="200" style="stroke:rgb(0,0,0);stroke-width:0.1" />
<line x1="100" y1="220" x2="119.5" y2="220" style="stroke:rgb(0,0,0);stroke-width:0.1" />
<line x1="110.0" y1="240" x2="129.5" y2="240" style="stroke:rgb(0,0,0);stroke-width:0.1" />
<line x1="100" y1="260" x2="119.5" y2="260" style="stroke:rgb(0,0,0);stroke-width:0.1" />
<line x1="110.0" y1="280" x2="129.5" y2="280" style="stroke:rgb(0,0,0);stroke-width:0.1" />
<line x1="100" y1="300" x2="119.5" y2="300" style="stroke:rgb(0,0,0);stroke-width:0.1" />
<line x1="110.0" y1="320" x2="129.5" y2="320" style="stroke:rgb(0,0,0);stroke-width:0.1" />
<line x1="100" y1="340" x2="119.5" y2="340" style="stroke:rgb(0,0,0);stroke-width:0.1" />
<line x1="110.0" y1="360" x2="129.5" y2="360" style="stroke:rgb(0,0,0);stroke-width:0.1" />
<line x1="100" y1="380" x2="119.5" y2="380" style="stroke:rgb(0,0,0);stroke-width:0.1" />
<line x1="110.0" y1="400" x2="129.5" y2="400" style="stroke:rgb(0,0,0);stroke-width:0.1" />
<line x1="120" y1="20" x2="139.5" y2="20" style="stroke:rgb(0,0,0);stroke-width:0.1" />
<line x1="130.0" y1="40" x2="149.5" y2="40" style="stroke:rgb(0,0,0);stroke-width:0.1" />
<line x1="120" y1="60" x2="139.5" y2="60" style="stroke:rgb(0,0,0);stroke-width:0.1" />
<line x1="130.0" y1="80" x2="149.5" y2="80" style="stroke:rgb(0,0,0);stroke-width:0.1" />
<line x1="120" y1="100" x2="139.5" y2="100" style="stroke:rgb(0,0,0);stroke-width:0.1" />
<line x1="130.0" y1="120" x2="149.5" y2="120" style="stroke:rgb(0,0,0);stroke-width:0.1" />
<line x1="120" y1="140" x2="139.5" y2="140" style="stroke:rgb(0,0,0);stroke-width:0.1" />
<line x1="130.0" y1="160" x2="149.5" y2="160" style="stroke:rgb(0,0,0);stroke-width:0.1" />
<line x1="120" y1="180" x2="139.5" y2="180" style="stroke:rgb(0,0,0);stroke-width:0.1" />
<line x1="130.0" y1="200" x2="149.5" y2="200" style="stroke:rgb(0,0,0);stroke-width:0.1" />
<line x1="120" y1="220" x2="139.5" y2="220" style="stroke:rgb(0,0,0);stroke-width:0.1" />
<line x1="130.0" y1="240" x2="149.5" y2="240" style="stroke:rgb(0,0,0);stroke-width:0.1" />
<line x1="120" y1="260" x2="139.5" y2="260" style="stroke:rgb(0,0,0);stroke-width:0.1" />
<line x1="130.0" y1="280" x2="149.5" y2="280" style="stroke:rgb(0,0,0);stroke-width:0.1" />
<line x1="120" y1="300" x2="139.5" y2="300" style="stroke:rgb(0,0,0);stroke-width:0.1" />
<line x1="130.0" y1="320" x2="149.5" y2="320" style="stroke:rgb(0,0,0);stroke-width:0.1" />
<line x1="120" y1="340" x2="139.5" y2="340" style="stroke:rgb(0,0,0);stroke-width:0.1" />
<line x1="130.0" y1="360" x2="149.5" y2="360" style="stroke:rgb(0,0,0);stroke-width:0.1" />
<line x1="120" y1="380" x2="139.5" y2="380" style="stroke:rgb(0,0,0);stroke-width:0.1" />
<line x1="130.0" y1="400" x2="149.5" y2="400" style="stroke:rgb(0,0,0);stroke-width:0.1" />
<line x1="140" y1="20" x2="159.5" y2="20" style="stroke:rgb(0,0,0);stroke-width:0.1" />
<line x1="150.0" y1="40" x2="169.5" y2="40" style="stroke:rgb(0,0,0);stroke-width:0.1" />
<line x1="140" y1="60" x2="159.5" y2="60" style="stroke:rgb(0,0,0);stroke-width:0.1" />
<line x1="150.0" y1="80" x2="169.5" y2="80" style="stroke:rgb(0,0,0);stroke-width:0.1" />
<line x1="140" y1="100" x2="159.5" y2="100" style="stroke:rgb(0,0,0);stroke-width:0.1" />
<line x1="150.0" y1="120" x2="169.5" y2="120" style="stroke:rgb(0,0,0);stroke-width:0.1" />
<line x1="140" y1="140" x2="159.5" y2="140" style="stroke:rgb(0,0,0);stroke-width:0.1" />
<line x1="150.0" y1="160" x2="169.5" y2="160" style="stroke:rgb(0,0,0);stroke-width:0.1" />
<line x1="140" y1="180" x2="159.5" y2="180" style="stroke:rgb(0,0,0);stroke-width:0.1" />
<line x1="150.0" y1="200" x2="169.5" y2="200" style="stroke:rgb(0,0,0);stroke-width:0.1" />
<line x1="140" y1="220" x2="159.5" y2="220" style="stroke:rgb(0,0,0);stroke-width:0.1" />
<line x1="150.0" y1="240" x2="169.5" y2="240" style="stroke:rgb(0,0,0);stroke-width:0.1" />
<line x1="140" y1="260" x2="159.5" y2="260" style="stroke:rgb(0,0,0);stroke-width:0.1" />
<line x1="150.0" y1="280" x2="169.5" y2="280" style="stroke:rgb(0,0,0);stroke-width:0.1" />
<line x1="140" y1="300" x2="159.5" y2="300" style="stroke:rgb(0,0,0);stroke-width:0.1" />
<line x1="150.0" y1="320" x2="169.5" y2="320" style="stroke:rgb(0,0,0);stroke-width:0.1" />
<line x1="140" y1="340" x2="159.5" y2="340" style="stroke:rgb(0,0,0);stroke-width:0.1" />
<line x1="150.0" y1="360" x2="169.5" y2="360" style="stroke:rgb(0,0,0);stroke-width:0.1" />
<line x1="140" y1="380" x2="159.5" y2="380" style="stroke:rgb(0,0,0);stroke-width:0.1" />
<line x1="150.0" y1="400" x2="169.5" y2="400" style="stroke:rgb(0,0,0);stroke-width:0.1" />
<line x1="160" y1="20" x2="179.5" y2="20" style="stroke:rgb(0,0,0);stroke-width:0.1" />
<line x1="170.0" y1="40" x2="189.5" y2="40" style="stroke:rgb(0,0,0);stroke-width:0.1" />
<line x1="160" y1="60" x2="179.5" y2="60" style="stroke:rgb(0,0,0);stroke-width:0.1" />
<line x1="170.0" y1="80" x2="189.5" y2="80" style="stroke:rgb(0,0,0);stroke-width:0.1" />
<line x1="160" y1="100" x2="179.5" y2="100" style="stroke:rgb(0,0,0);stroke-width:0.1" />
<line x1="170.0" y1="120" x2="189.5" y2="120" style="stroke:rgb(0,0,0);stroke-width:0.1" />
<line x1="160" y1="140" x2="179.5" y2="140" style="stroke:rgb(0,0,0);stroke-width:0.1" />
<line x1="170.0" y1="160" x2="189.5" y2="160" style="stroke:rgb(0,0,0);stroke-width:0.1" />
<line x1="160" y1="180" x2="179.5" y2="180" style="stroke:rgb(0,0,0);stroke-width:0.1" />
<line x1="170.0" y1="200" x2="189.5" y2="200" style="stroke:rgb(0,0,0);stroke-width:0.1" />
<line x1="160" y1="220" x2="179.5" y2="220" style="stroke:rgb(0,0,0);stroke-width:0.1" />
<line x1="170.0" y1="240" x2="189.5" y2="240" style="stroke:rgb(0,0,0);stroke-width:0.1" />
<line x1="160" y1="260" x2="179.5" y2="260" style="stroke:rgb(0,0,0);stroke-width:0.1" />
<line x1="170.0" y1="280" x2="189.5" y2="280" style="stroke:rgb(0,0,0);stroke-width:0.1" />
<line x1="160" y1="300" x2="179.5" y2="300" style="stroke:rgb(0,0,0);stroke-width:0.1" />
<line x1="170.0" y1="320" x2="189.5" y2="320" style="stroke:rgb(0,0,0);stroke-width:0.1" />
<line x1="160" y1="340" x2="179.5" y2="340" style="stroke:rgb(0,0,0);stroke-width:0.1" />
<line x1="170.0" y1="360" x2="189.5" y2="360" style="stroke:rgb(0,0,0);stroke-width:0.1" />
<line x1="160" y1="380" x2="179.5" y2="380" style="stroke:rgb(0,0,0);stroke-width:0.1" />
<line x1="170.0" y1="400" x2="189.5" y2="400" style="stroke:rgb(0,0,0);stroke-width:0.1" />
<line x1="180" y1="20" x2="199.5" y2="20" style="stroke:rgb(0,0,0);stroke-width:0.1" />
<line x1="190.0" y1="40" x2="209.5" y2="40" style="stroke:rgb(0,0,0);stroke-width:0.1" />
<line x1="180" y1="60" x2="199.5" y2="60" style="stroke:rgb(0,0,0);stroke-width:0.1" />
<line x1="190.0" y1="80" x2="209.5" y2="80" style="stroke:rgb(0,0,0);stroke-width:0.1" />
<line x1="180" y1="100" x2="199.5" y2="100" style="stroke:rgb(0,0,0);stroke-width:0.1" />
<line x1="190.0" y1="120" x2="209.5" y2="120" style="stroke:rgb(0,0,0);stroke-width:0.1" />
<line x1="180" y1="140" x2="199.5" y2="140" style="stroke:rgb(0,0,0);stroke-width:0.1" />
<line x1="190.0" y1="160" x2="209.5" y2="160" style="stroke:rgb(0,0,0);stroke-width:0.1" />
<line x1="180" y1="180" x2="199.5" y2="180" style="stroke:rgb(0,0,0);stroke-width:0.1" />
<line x1="190.0" y1="200" x2="209.5" y2="200" style="stroke:rgb(0,0,0);stroke-width:0.1" />
<line x1="180" y1="220" x2="199.5" y2="220" style="stroke:rgb(0,0,0);stroke-width:0.1" />
<line x1="190.0" y1="240" x2="209.5" y2="240" style="stroke:rgb(0,0,0);stroke-width:0.1" />
<line x1="180" y1="260" x2="199.5" y2="260" style="stroke:rgb(0,0,0);stroke-width:0.1" />
<line x1="190.0" y1="280" x2="209.5" y2="280" style="stroke:rgb(0,0,0);stroke-width:0.1" />
<line x1="180" y1="300" x2="199.5" y2="300" style="stroke:rgb(0,0,0);stroke-width:0.1" />
<line x1="190.0" y1="320" x2="209.5" y2="320" style="stroke:rgb(0,0,0);stroke-width:0.1" />
<line x1="180" y1="340" x2="199.5" y2="340" style="stroke:rgb(0,0,0);stroke-width:0.1" />
<line x1="190.0" y1="360" x2="209.5" y2="360" style="stroke:rgb(0,0,0);stroke-width:0.1" />
<line x1="180" y1="380" x2="199.5" y2="380" style="stroke:rgb(0,0,0);stroke-width:0.1" />
<line x1="190.0" y1="400" x2="209.5" y2="400" style="stroke:rgb(0,0,0);stroke-width:0.1" />
<line x1="200" y1="20" x2="219.5" y2="20" style="stroke:rgb(0,0,0);stroke-width:0.1" />
<line x1="210.0" y1="40" x2="229.5" y2="40" style="stroke:rgb(0,0,0);stroke-width:0.1" />
<line x1="200" y1="60" x2="219.5" y2="60" style="stroke:rgb(0,0,0);stroke-width:0.1" />
<line x1="210.0" y1="80" x2="229.5" y2="80" style="stroke:rgb(0,0,0);stroke-width:0.1" />
<line x1="200" y1="100" x2="219.5" y2="100" style="stroke:rgb(0,0,0);stroke-width:0.1" />
<line x1="210.0" y1="120" x2="229.5" y2="120" style="stroke:rgb(0,0,0);stroke-width:0.1" />
<line x1="200" y1="140" x2="219.5" y2="140" style="stroke:rgb(0,0,0);stroke-width:0.1" />
<line x1="210.0" y1="160" x2="229.5" y2="160" style="stroke:rgb(0,0,0);stroke-width:0.1" />
<line x1="200" y1="180" x2="219.5" y2="180" style="stroke:rgb(0,0,0);stroke-width:0.1" />
<line x1="210.0" y1="200" x2="229.5" y2="200" style="stroke:rgb(0,0,0);stroke-width:0.1" />
<line x1="200" y1="220" x2="219.5" y2="220" style="stroke:rgb(0,0,0);stroke-width:0.1" />
<line x1="210.0" y1="240" x2="229.5" y2="240" style="stroke:rgb(0,0,0);stroke-width:0.1" />
<line x1="200" y1="260" x2="219.5" y2="260" style="stroke:rgb(0,0,0);stroke-width:0.1" />
<line x1="210.0" y1="280" x2="229.5" y2="280" style="stroke:rgb(0,0,0);stroke-width:0.1" />
<line x1="200" y1="300" x2="219.5" y2="300" style="stroke:rgb(0,0,0);stroke-width:0.1" />
<line x1="210.0" y1="320" x2="229.5" y2="320" style="stroke:rgb(0,0,0);stroke-width:0.1" />
<line x1="200" y1="340" x2="219.5" y2="340" style="stroke:rgb(0,0,0);stroke-width:0.1" />
<line x1="210.0" y1="360" x2="229.5" y2="360" style="stroke:rgb(0,0,0);stroke-width:0.1" />
<line x1="200" y1="380" x2="219.5" y2="380" style="stroke:rgb(0,0,0);stroke-width:0.1" />
<line x1="210.0" y1="400" x2="229.5" y2="400" style="stroke:rgb(0,0,0);stroke-width:0.1" />
<line x1="220" y1="20" x2="239.5" y2="20" style="stroke:rgb(0,0,0);stroke-width:0.1" />
<line x1="230.0" y1="40" x2="249.5" y2="40" style="stroke:rgb(0,0,0);stroke-width:0.1" />
<line x1="220" y1="60" x2="239.5" y2="60" style="stroke:rgb(0,0,0);stroke-width:0.1" />
<line x1="230.0" y1="80" x2="249.5" y2="80" style="stroke:rgb(0,0,0);stroke-width:0.1" />
<line x1="220" y1="100" x2="239.5" y2="100" style="stroke:rgb(0,0,0);stroke-width:0.1" />
<line x1="230.0" y1="120" x2="249.5" y2="120" style="stroke:rgb(0,0,0);stroke-width:0.1" />
<line x1="220" y1="140" x2="239.5" y2="140" style="stroke:rgb(0,0,0);stroke-width:0.1" />
<line x1="230.0" y1="160" x2="249.5" y2="160" style="stroke:rgb(0,0,0);stroke-width:0.1" />
<line x1="220" y1="180" x2="239.5" y2="180" style="stroke:rgb(0,0,0);stroke-width:0.1" />
<line x1="230.0" y1="200" x2="249.5" y2="200" style="stroke:rgb(0,0,0);stroke-width:0.1" />
<line x1="220" y1="220" x2="239.5" y2="220" style="stroke:rgb(0,0,0);stroke-width:0.1" />
<line x1="230.0" y1="240" x2="249.5" y2="240" style="stroke:rgb(0,0,0);stroke-width:0.1" />
<line x1="220" y1="260" x2="239.5" y2="260" style="stroke:rgb(0,0,0);stroke-width:0.1" />
<line x1="230.0" y1="280" x2="249.5" y2="280" style="stroke:rgb(0,0,0);stroke-width:0.1" />
<line x1="220" y1="300" x2="239.5" y2="300" style="stroke:rgb(0,0,0);stroke-width:0.1" />
<line x1="230.0" y1="320" x2="249.5" y2="320" style="stroke:rgb(0,0,0);stroke-width:0.1" />
<line x1="220" y1="340" x2="239.5" y2="340" style="stroke:rgb(0,0,0);stroke-width:0.1" />
<line x1="230.0" y1="360" x2="249.5" y2="360" style="stroke:rgb(0,0,0);stroke-width:0.1" />
<line x1="220" y1="380" x2="239.5" y2="380" style="stroke:rgb(0,0,0);stroke-width:0.1" />
<line x1="230.0" y1="400" x2="249.5" y2="400" style="stroke:rgb(0,0,0);stroke-width:0.1" />
<line x1="240" y1="20" x2="259.5" y2="20" style="stroke:rgb(0,0,0);stroke-width:0.1" />
<line x1="250.0" y1="40" x2="269.5" y2="40" style="stroke:rgb(0,0,0);stroke-width:0.1" />
<line x1="240" y1="60" x2="259.5" y2="60" style="stroke:rgb(0,0,0);stroke-width:0.1" />
<line x1="250.0" y1="80" x2="269.5" y2="80" style="stroke:rgb(0,0,0);stroke-width:0.1" />
<line x1="240" y1="100" x2="259.5" y2="100" style="stroke:rgb(0,0,0);stroke-width:0.1" />
<line x1="250.0" y1="120" x2="269.5" y2="120" style="stroke:rgb(0,0,0);stroke-width:0.1" />
<line x1="240" y1="140" x2="259.5" y2="140" style="stroke:rgb(0,0,0);stroke-width:0.1" />
<line x1="250.0" y1="160" x2="269.5" y2="160" style="stroke:rgb(0,0,0);stroke-width:0.1" />
<line x1="240" y1="180" x2="259.5" y2="180" style="stroke:rgb(0,0,0);stroke-width:0.1" />
<line x1="250.0" y1="200" x2="269.5" y2="200" style="stroke:rgb(0,0,0);stroke-width:0.1" />
<line x1="240" y1="220" x2="259.5" y2="220" style="stroke:rgb(0,0,0);stroke-width:0.1" />
<line x1="250.0" y1="240" x2="269.5" y2="240" style="stroke:rgb(0,0,0);stroke-width:0.1" />
<line x1="240" y1="260" x2="259.5" y2="260" style="stroke:rgb(0,0,0);stroke-width:0.1" />
<line x1="250.0" y1="280" x2="269.5" y2="280" style="stroke:rgb(0,0,0);stroke-width:0.1" />
<line x1="240" y1="300" x2="259.5" y2="300" style="stroke:rgb(0,0,0);stroke-width:0.1" />
<line x1="250.0" y1="320" x2="269.5" y2="320" style="stroke:rgb(0,0,0);stroke-width:0.1" />
<line x1="240" y1="340" x2="259.5" y2="340" style="stroke:rgb(0,0,0);stroke-width:0.1" />
<line x1="250.0" y1="360" x2="269.5" y2="360" style="stroke:rgb(0,0,0);stroke-width:0.1" />
<line x1="240" y1="380" x2="259.5" y2="380" style="stroke:rgb(0,0,0);stroke-width:0.1" />
<line x1="250.0" y1="400" x2="269.5" y2="400" style="stroke:rgb(0,0,0);stroke-width:0.1" />
<line x1="260" y1="20" x2="279.5" y2="20" style="stroke:rgb(0,0,0);stroke-width:0.1" />
<line x1="270.0" y1="40" x2="289.5" y2="40" style="stroke:rgb(0,0,0);stroke-width:0.1" />
<line x1="260" y1="60" x2="279.5" y2="60" style="stroke:rgb(0,0,0);stroke-width:0.1" />
<line x1="270.0" y1="80" x2="289.5" y2="80" style="stroke:rgb(0,0,0);stroke-width:0.1" />
<line x1="260" y1="100" x2="279.5" y2="100" style="stroke:rgb(0,0,0);stroke-width:0.1" />
<line x1="270.0" y1="120" x2="289.5" y2="120" style="stroke:rgb(0,0,0);stroke-width:0.1" />
<line x1="260" y1="140" x2="279.5" y2="140" style="stroke:rgb(0,0,0);stroke-width:0.1" />
<line x1="270.0" y1="160" x2="289.5" y2="160" style="stroke:rgb(0,0,0);stroke-width:0.1" />
<line x1="260" y1="180" x2="279.5" y2="180" style="stroke:rgb(0,0,0);stroke-width:0.1" />
<line x1="270.0" y1="200" x2="289.5" y2="200" style="stroke:rgb(0,0,0);stroke-width:0.1" />
<line x1="260" y1="220" x2="279.5" y2="220" style="stroke:rgb(0,0,0);stroke-width:0.1" />
<line x1="270.0" y1="240" x2="289.5" y2="240" style="stroke:rgb(0,0,0);stroke-width:0.1" />
<line x1="260" y1="260" x2="279.5" y2="260" style="stroke:rgb(0,0,0);stroke-width:0.1" />
<line x1="270.0" y1="280" x2="289.5" y2="280" style="stroke:rgb(0,0,0);stroke-width:0.1" />
<line x1="260" y1="300" x2="279.5" y2="300" style="stroke:rgb(0,0,0);stroke-width:0.1" />
<line x1="270.0" y1="320" x2="289.5" y2="320" style="stroke:rgb(0,0,0);stroke-width:0.1" />
<line x1="260" y1="340" x2="279.5" y2="340" style="stroke:rgb(0,0,0);stroke-width:0.1" />
<line x1="270.0" y1="360" x2="289.5" y2="360" style="stroke:rgb(0,0,0);stroke-width:0.1" />
<line x1="260" y1="380" x2="279.5" y2="380" style="stroke:rgb(0,0,0);stroke-width:0.1" />
<line x1="270.0" y1="400" x2="289.5" y2="400" style="stroke:rgb(0,0,0);stroke-width:0.1" />
<line x1="280" y1="20" x2="299.5" y2="20" style="stroke:rgb(0,0,0);stroke-width:0.1" />
<line x1="290.0" y1="40" x2="309.5" y2="40" style="stroke:rgb(0,0,0);stroke-width:0.1" />
<line x1="280" y1="60" x2="299.5" y2="60" style="stroke:rgb(0,0,0);stroke-width:0.1" />
<line x1="290.0" y1="80" x2="309.5" y2="80" style="stroke:rgb(0,0,0);stroke-width:0.1" />
<line x1="280" y1="100" x2="299.5" y2="100" style="stroke:rgb(0,0,0);stroke-width:0.1" />
<line x1="290.0" y1="120" x2="309.5" y2="120" style="stroke:rgb(0,0,0);stroke-width:0.1" />
<line x1="280" y1="140" x2="299.5" y2="140" style="stroke:rgb(0,0,0);stroke-width:0.1" />
<line x1="290.0" y1="160" x2="309.5" y2="160" style="stroke:rgb(0,0,0);stroke-width:0.1" />
<line x1="280" y1="180" x2="299.5" y2="180" style="stroke:rgb(0,0,0);stroke-width:0.1" />
<line x1="290.0" y1="200" x2="309.5" y2="200" style="stroke:rgb(0,0,0);stroke-width:0.1" />
<line x1="280" y1="220" x2="299.5" y2="220" style="stroke:rgb(0,0,0);stroke-width:0.1" />
<line x1="290.0" y1="240" x2="309.5" y2="240" style="stroke:rgb(0,0,0);stroke-width:0.1" />
<line x1="280" y1="260" x2="299.5" y2="260" style="stroke:rgb(0,0,0);stroke-width:0.1" />
<line x1="290.0" y1="280" x2="309.5" y2="280" style="stroke:rgb(0,0,0);stroke-width:0.1" />
<line x1="280" y1="300" x2="299.5" y2="300" style="stroke:rgb(0,0,0);stroke-width:0.1" />
<line x1="290.0" y1="320" x2="309.5" y2="320" style="stroke:rgb(0,0,0);stroke-width:0.1" />
<line x1="280" y1="340" x2="299.5" y2="340" style="stroke:rgb(0,0,0);stroke-width:0.1" />
<line x1="290.0" y1="360" x2="309.5" y2="360" style="stroke:rgb(0,0,0);stroke-width:0.1" />
<line x1="280" y1="380" x2="299.5" y2="380" style="stroke:rgb(0,0,0);stroke-width:0.1" />
<line x1="290.0" y1="400" x2="309.5" y2="400" style="stroke:rgb(0,0,0);stroke-width:0.1" />
<line x1="300" y1="20" x2="319.5" y2="20" style="stroke:rgb(0,0,0);stroke-width:0.1" />
<line x1="310.0" y1="40" x2="329.5" y2="40" style="stroke:rgb(0,0,0);stroke-width:0.1" />
<line x1="300" y1="60" x2="319.5" y2="60" style="stroke:rgb(0,0,0);stroke-width:0.1" />
<line x1="310.0" y1="80" x2="329.5" y2="80" style="stroke:rgb(0,0,0);stroke-width:0.1" />
<line x1="300" y1="100" x2="319.5" y2="100" style="stroke:rgb(0,0,0);stroke-width:0.1" />
<line x1="310.0" y1="120" x2="329.5" y2="120" style="stroke:rgb(0,0,0);stroke-width:0.1" />
<line x1="300" y1="140" x2="319.5" y2="140" style="stroke:rgb(0,0,0);stroke-width:0.1" />
<line x1="310.0" y1="160" x2="329.5" y2="160" style="stroke:rgb(0,0,0);stroke-width:0.1" />
<line x1="300" y1="180" x2="319.5" y2="180" style="stroke:rgb(0,0,0);stroke-width:0.1" />
<line x1="310.0" y1="200" x2="329.5" y2="200" style="stroke:rgb(0,0,0);stroke-width:0.1" />
<line x1="300" y1="220" x2="319.5" y2="220" style="stroke:rgb(0,0,0);stroke-width:0.1" />
<line x1="310.0" y1="240" x2="329.5" y2="240" style="stroke:rgb(0,0,0);stroke-width:0.1" />
<line x1="300" y1="260" x2="319.5" y2="260" style="stroke:rgb(0,0,0);stroke-width:0.1" />
<line x1="310.0" y1="280" x2="329.5" y2="280" style="stroke:rgb(0,0,0);stroke-width:0.1" />
<line x1="300" y1="300" x2="319.5" y2="300" style="stroke:rgb(0,0,0);stroke-width:0.1" />
<line x1="310.0" y1="320" x2="329.5" y2="320" style="stroke:rgb(0,0,0);stroke-width:0.1" />
<line x1="300" y1="340" x2="319.5" y2="340" style="stroke:rgb(0,0,0);stroke-width:0.1" />
<line x1="310.0" y1="360" x2="329.5" y2="360" style="stroke:rgb(0,0,0);stroke-width:0.1" />
<line x1="300" y1="380" x2="319.5" y2="380" style="stroke:rgb(0,0,0);stroke-width:0.1" />
<line x1="310.0" y1="400" x2="329.5" y2="400" style="stroke:rgb(0,0,0);stroke-width:0.1" />
<line x1="320" y1="20" x2="339.5" y2="20" style="stroke:rgb(0,0,0);stroke-width:0.1" />
<line x1="330.0" y1="40" x2="349.5" y2="40" style="stroke:rgb(0,0,0);stroke-width:0.1" />
<line x1="320" y1="60" x2="339.5" y2="60" style="stroke:rgb(0,0,0);stroke-width:0.1" />
<line x1="330.0" y1="80" x2="349.5" y2="80" style="stroke:rgb(0,0,0);stroke-width:0.1" />
<line x1="320" y1="100" x2="339.5" y2="100" style="stroke:rgb(0,0,0);stroke-width:0.1" />
<line x1="330.0" y1="120" x2="349.5" y2="120" style="stroke:rgb(0,0,0);stroke-width:0.1" />
<line x1="320" y1="140" x2="339.5" y2="140" style="stroke:rgb(0,0,0);stroke-width:0.1" />
<line x1="330.0" y1="160" x2="349.5" y2="160" style="stroke:rgb(0,0,0);stroke-width:0.1" />
<line x1="320" y1="180" x2="339.5" y2="180" style="stroke:rgb(0,0,0);stroke-width:0.1" />
<line x1="330.0" y1="200" x2="349.5" y2="200" style="stroke:rgb(0,0,0);stroke-width:0.1" />
<line x1="320" y1="220" x2="339.5" y2="220" style="stroke:rgb(0,0,0);stroke-width:0.1" />
<line x1="330.0" y1="240" x2="349.5" y2="240" style="stroke:rgb(0,0,0);stroke-width:0.1" />
<line x1="320" y1="260" x2="339.5" y2="260" style="stroke:rgb(0,0,0);stroke-width:0.1" />
<line x1="330.0" y1="280" x2="349.5" y2="280" style="stroke:rgb(0,0,0);stroke-width:0.1" />
<line x1="320" y1="300" x2="339.5" y2="300" style="stroke:rgb(0,0,0);stroke-width:0.1" />
<line x1="330.0" y1="320" x2="349.5" y2="320" style="stroke:rgb(0,0,0);stroke-width:0.1" />
<line x1="320" y1="340" x2="339.5" y2="340" style="stroke:rgb(0,0,0);stroke-width:0.1" />
<line x1="330.0" y1="360" x2="349.5" y2="360" style="stroke:rgb(0,0,0);stroke-width:0.1" />
<line x1="320" y1="380" x2="339.5" y2="380" style="stroke:rgb(0,0,0);stroke-width:0.1" />
<line x1="330.0" y1="400" x2="349.5" y2="400" style="stroke:rgb(0,0,0);stroke-width:0.1" />
<line x1="340" y1="20" x2="359.5" y2="20" style="stroke:rgb(0,0,0);stroke-width:0.1" />
<line x1="350.0" y1="40" x2="369.5" y2="40" style="stroke:rgb(0,0,0);stroke-width:0.1" />
<line x1="340" y1="60" x2="359.5" y2="60" style="stroke:rgb(0,0,0);stroke-width:0.1" />
<line x1="350.0" y1="80" x2="369.5" y2="80" style="stroke:rgb(0,0,0);stroke-width:0.1" />
<line x1="340" y1="100" x2="359.5" y2="100" style="stroke:rgb(0,0,0);stroke-width:0.1" />
<line x1="350.0" y1="120" x2="369.5" y2="120" style="stroke:rgb(0,0,0);stroke-width:0.1" />
<line x1="340" y1="140" x2="359.5" y2="140" style="stroke:rgb(0,0,0);stroke-width:0.1" />
<line x1="350.0" y1="160" x2="369.5" y2="160" style="stroke:rgb(0,0,0);stroke-width:0.1" />
<line x1="340" y1="180" x2="359.5" y2="180" style="stroke:rgb(0,0,0);stroke-width:0.1" />
<line x1="350.0" y1="200" x2="369.5" y2="200" style="stroke:rgb(0,0,0);stroke-width:0.1" />
<line x1="340" y1="220" x2="359.5" y2="220" style="stroke:rgb(0,0,0);stroke-width:0.1" />
<line x1="350.0" y1="240" x2="369.5" y2="240" style="stroke:rgb(0,0,0);stroke-width:0.1" />
<line x1="340" y1="260" x2="359.5" y2="260" style="stroke:rgb(0,0,0);stroke-width:0.1" />
<line x1="350.0" y1="280" x2="369.5" y2="280" style="stroke:rgb(0,0,0);stroke-width:0.1" />
<line x1="340" y1="300" x2="359.5" y2="300" style="stroke:rgb(0,0,0);stroke-width:0.1" />
<line x1="350.0" y1="320" x2="369.5" y2="320" style="stroke:rgb(0,0,0);stroke-width:0.1" />
<line x1="340" y1="340" x2="359.5" y2="340" style="stroke:rgb(0,0,0);stroke-width:0.1" />
<line x1="350.0" y1="360" x2="369.5" y2="360" style="stroke:rgb(0,0,0);stroke-width:0.1" />
<line x1="340" y1="380" x2="359.5" y2="380" style="stroke:rgb(0,0,0);stroke-width:0.1" />
<line x1="350.0" y1="400" x2="369.5" y2="400" style="stroke:rgb(0,0,0);stroke-width:0.1" />
<line x1="360" y1="20" x2="379.5" y2="20" style="stroke:rgb(0,0,0);stroke-width:0.1" />
<line x1="370.0" y1="40" x2="389.5" y2="40" style="stroke:rgb(0,0,0);stroke-width:0.1" />
<line x1="360" y1="60" x2="379.5" y2="60" style="stroke:rgb(0,0,0);stroke-width:0.1" />
<line x1="370.0" y1="80" x2="389.5" y2="80" style="stroke:rgb(0,0,0);stroke-width:0.1" />
<line x1="360" y1="100" x2="379.5" y2="100" style="stroke:rgb(0,0,0);stroke-width:0.1" />
<line x1="370.0" y1="120" x2="389.5" y2="120" style="stroke:rgb(0,0,0);stroke-width:0.1" />
<line x1="360" y1="140" x2="379.5" y2="140" style="stroke:rgb(0,0,0);stroke-width:0.1" />
<line x1="370.0" y1="160" x2="389.5" y2="160" style="stroke:rgb(0,0,0);stroke-width:0.1" />
<line x1="360" y1="180" x2="379.5" y2="180" style="stroke:rgb(0,0,0);stroke-width:0.1" />
<line x1="370.0" y1="200" x2="389.5" y2="200" style="stroke:rgb(0,0,0);stroke-width:0.1" />
<line x1="360" y1="220" x2="379.5" y2="220" style="stroke:rgb(0,0,0);stroke-width:0.1" />
<line x1="370.0" y1="240" x2="389.5" y2="240" style="stroke:rgb(0,0,0);stroke-width:0.1" />
<line x1="360" y1="260" x2="379.5" y2="260" style="stroke:rgb(0,0,0);stroke-width:0.1" />
<line x1="370.0" y1="280" x2="389.5" y2="280" style="stroke:rgb(0,0,0);stroke-width:0.1" />
<line x1="360" y1="300" x2="379.5" y2="300" style="stroke:rgb(0,0,0);stroke-width:0.1" />
<line x1="370.0" y1="320" x2="389.5" y2="320" style="stroke:rgb(0,0,0);stroke-width:0.1" />
<line x1="360" y1="340" x2="379.5" y2="340" style="stroke:rgb(0,0,0);stroke-width:0.1" />
<line x1="370.0" y1="360" x2="389.5" y2="360" style="stroke:rgb(0,0,0);stroke-width:0.1" />
<line x1="360" y1="380" x2="379.5" y2="380" style="stroke:rgb(0,0,0);stroke-width:0.1" />
<line x1="370.0" y1="400" x2="389.5" y2="400" style="stroke:rgb(0,0,0);stroke-width:0.1" />
<line x1="380" y1="20" x2="399.5" y2="20" style="stroke:rgb(0,0,0);stroke-width:0.1" />
<line x1="390.0" y1="40" x2="409.5" y2="40" style="stroke:rgb(0,0,0);stroke-width:0.1" />
<line x1="380" y1="60" x2="399.5" y2="60" style="stroke:rgb(0,0,0);stroke-width:0.1" />
<line x1="390.0" y1="80" x2="409.5" y2="80" style="stroke:rgb(0,0,0);stroke-width:0.1" />
<line x1="380" y1="100" x2="399.5" y2="100" style="stroke:rgb(0,0,0);stroke-width:0.1" />
<line x1="390.0" y1="120" x2="409.5" y2="120" style="stroke:rgb(0,0,0);stroke-width:0.1" />
<line x1="380" y1="140" x2="399.5" y2="140" style="stroke:rgb(0,0,0);stroke-width:0.1" />
<line x1="390.0" y1="160" x2="409.5" y2="160" style="stroke:rgb(0,0,0);stroke-width:0.1" />
<line x1="380" y1="180" x2="399.5" y2="180" style="stroke:rgb(0,0,0);stroke-width:0.1" />
<line x1="390.0" y1="200" x2="409.5" y2="200" style="stroke:rgb(0,0,0);stroke-width:0.1" />
<line x1="380" y1="220" x2="399.5" y2="220" style="stroke:rgb(0,0,0);stroke-width:0.1" />
<line x1="390.0" y1="240" x2="409.5" y2="240" style="stroke:rgb(0,0,0);stroke-width:0.1" />
<line x1="380" y1="260" x2="399.5" y2="260" style="stroke:rgb(0,0,0);stroke-width:0.1" />
<line x1="390.0" y1="280" x2="409.5" y2="280" style="stroke:rgb(0,0,0);stroke-width:0.1" />
<line x1="380" y1="300" x2="399.5" y2="300" style="stroke:rgb(0,0,0);stroke-width:0.1" />
<line x1="390.0" y1="320" x2="409.5" y2="320" style="stroke:rgb(0,0,0);stroke-width:0.1" />
<line x1="380" y1="340" x2="399.5" y2="340" style="stroke:rgb(0,0,0);stroke-width:0.1" />
<line x1="390.0" y1="360" x2="409.5" y2="360" style="stroke:rgb(0,0,0);stroke-width:0.1" />
<line x1="380" y1="380" x2="399.5" y2="380" style="stroke:rgb(0,0,0);stroke-width:0.1" />
<line x1="390.0" y1="400" x2="409.5" y2="400" style="stroke:rgb(0,0,0);stroke-width:0.1" />
