<?xml version="1.0" encoding="UTF-8" standalone="no"?>
<!-- Created with Inkscape (http://www.inkscape.org/) -->

<svg
   xmlns:dc="http://purl.org/dc/elements/1.1/"
   xmlns:cc="http://creativecommons.org/ns#"
   xmlns:rdf="http://www.w3.org/1999/02/22-rdf-syntax-ns#"
   xmlns:svg="http://www.w3.org/2000/svg"
   xmlns="http://www.w3.org/2000/svg"
   xmlns:sodipodi="http://sodipodi.sourceforge.net/DTD/sodipodi-0.dtd"
   xmlns:inkscape="http://www.inkscape.org/namespaces/inkscape"
   width="210mm"
   height="297mm"
   viewBox="0 0 210 297"
   version="1.1"
   id="svg229"
   inkscape:version="0.92.3 (2405546, 2018-03-11)"
   sodipodi:docname="new.svg">
  <defs
     id="defs223" />
  <sodipodi:namedview
     id="base"
     pagecolor="#ffffff"
     bordercolor="#666666"
     borderopacity="1.0"
     inkscape:pageopacity="0.0"
     inkscape:pageshadow="2"
     inkscape:zoom="0.98994949"
     inkscape:cx="-19.370877"
     inkscape:cy="886.69893"
     inkscape:document-units="mm"
     inkscape:current-layer="layer1"
     showgrid="false"
     inkscape:window-width="1920"
     inkscape:window-height="1080"
     inkscape:window-x="1920"
     inkscape:window-y="0"
     inkscape:window-maximized="0" />
  <metadata
     id="metadata226">
    <rdf:RDF>
      <cc:Work
         rdf:about="">
        <dc:format>image/svg+xml</dc:format>
        <dc:type
           rdf:resource="http://purl.org/dc/dcmitype/StillImage" />
        <dc:title></dc:title>
      </cc:Work>
    </rdf:RDF>
  </metadata>
  <g
     inkscape:label="Layer 1"
     inkscape:groupmode="layer"
     id="layer1">
    <rect
       style="fill:none;fill-opacity:1;fill-rule:evenodd;stroke:#000000;stroke-width:0.2;stroke-miterlimit:7;stroke-dasharray:none;stroke-dashoffset:0;stroke-opacity:1"
       id="rect1165-0"
       width="12"
       height="12"
       x="13.946687"
       y="20.969879" />
    <rect
       style="fill:none;fill-opacity:1;fill-rule:evenodd;stroke:#000000;stroke-width:0.2;stroke-miterlimit:7;stroke-dasharray:none;stroke-dashoffset:0;stroke-opacity:1"
       id="rect1165-0-1"
       width="12"
       height="12"
       x="13.946824"
       y="36.969879" />
    <rect
       style="opacity:1;fill:none;fill-opacity:1;fill-rule:evenodd;stroke:#000000;stroke-width:0.1341837;stroke-miterlimit:7;stroke-dasharray:none;stroke-dashoffset:0;stroke-opacity:1"
       id="rect1247"
       width="55.665798"
       height="47.520519"
       x="9.1132364"
       y="12.118996" />
    <text
       xml:space="preserve"
       id="text1251-6-5"
       style="font-style:normal;font-weight:normal;font-size:3.52778029px;line-height:1.25;font-family:sans-serif;white-space:pre;shape-inside:url(#rect1253-5-5);fill:#ff00ff;fill-opacity:1;stroke:none;stroke-width:1"
       x="-5.8422384"
       y="-27.226631"><tspan
         style="stroke-width:1"
         x="22.220261"
         y="52.698906"
         id="tspan42"><tspan
           style="fill:#ff00ff;stroke-width:1"
           id="tspan40">12mm
</tspan></tspan></text>
    <text
       xml:space="preserve"
       style="font-style:normal;font-weight:normal;font-size:9.19839001px;line-height:1.25;font-family:sans-serif;letter-spacing:-0.32424399px;fill:#ff0000;fill-opacity:1;stroke:none;stroke-width:0.22995999"
       x="17.546661"
       y="16.916252"
       id="text1407"><tspan
         sodipodi:role="line"
         id="tspan1405"
         x="17.546661"
         y="16.916252"
         style="font-style:normal;font-variant:normal;font-weight:normal;font-stretch:normal;font-size:5.29166651px;font-family:'Franklin Gothic Heavy';-inkscape-font-specification:'Franklin Gothic Heavy, ';fill:#ff0000;stroke-width:0.22995999">Kitchen Microscope</tspan><tspan
         sodipodi:role="line"
         x="17.546661"
         y="28.414238"
         style="font-style:normal;font-variant:normal;font-weight:normal;font-stretch:normal;font-family:'Franklin Gothic Heavy';-inkscape-font-specification:'Franklin Gothic Heavy, ';fill:#ff0000;stroke-width:0.22995999"
         id="tspan1409" /><tspan
         sodipodi:role="line"
         x="17.546661"
         y="39.912224"
         style="font-style:normal;font-variant:normal;font-weight:normal;font-stretch:normal;font-family:'Franklin Gothic Heavy';-inkscape-font-specification:'Franklin Gothic Heavy, ';fill:#ff0000;stroke-width:0.22995999"
         id="tspan1411" /></text>
    <text
       xml:space="preserve"
       style="font-style:normal;font-weight:normal;font-size:4.90581989px;line-height:0.80000001;font-family:sans-serif;letter-spacing:-0.64558333px;fill:#ff0000;fill-opacity:1;stroke:none;stroke-width:0.22995999"
       x="44.572723"
       y="21.752289"
       id="text1415"><tspan
         sodipodi:role="line"
         id="tspan1413"
         x="44.572723"
         y="21.752289"
         style="font-size:4.90581989px;fill:#ff0000;stroke-width:0.22995999"
         dx="1.1559588"
         dy="-0.71269643">Slides</tspan></text>
    <rect
       style="opacity:1;fill:none;fill-opacity:1;fill-rule:evenodd;stroke:#00ff00;stroke-width:0.11587033;stroke-miterlimit:7;stroke-dasharray:none;stroke-dashoffset:0;stroke-opacity:1"
       id="rect1424"
       width="31.314056"
       height="35.1119"
       x="11.498742"
       y="18.85601" />
    <rect
       width="0"
       style="opacity:1;fill:none;fill-opacity:1;fill-rule:evenodd;stroke:#000000;stroke-width:0.2;stroke-miterlimit:7;stroke-dasharray:none;stroke-dashoffset:0;stroke-opacity:1"
       id="rect1426"
       height="10.715625"
       x="81.917152"
       y="36.686035" />
    <text
       xml:space="preserve"
       id="text1610"
       style="font-style:normal;font-weight:normal;font-size:2.46943998px;line-height:1.25;font-family:sans-serif;white-space:pre;shape-inside:url(#rect1612);fill:#ff00ff;fill-opacity:1;stroke:none;stroke-width:1"
       x="9.8182039"
       y="-15.701477"><tspan
         style="stroke-width:1"
         x="36.540863"
         y="58.252647"
         id="tspan75"><tspan
           style="fill:#ff00ff;stroke-width:1"
           id="tspan73">mk0.5 24th May 2021</tspan></tspan></text>
    <rect
       style="fill:none;fill-opacity:1;fill-rule:evenodd;stroke:#000000;stroke-width:0.2;stroke-miterlimit:7;stroke-dasharray:none;stroke-dashoffset:0;stroke-opacity:1"
       id="rect1165-0-3"
       width="12"
       height="12"
       x="29.019699"
       y="20.969879" />
    <rect
       style="fill:none;fill-opacity:1;fill-rule:evenodd;stroke:#000000;stroke-width:0.2;stroke-miterlimit:7;stroke-dasharray:none;stroke-dashoffset:0;stroke-opacity:1"
       id="rect1165-0-1-6"
       width="12"
       height="12"
       x="29.019836"
       y="36.969879" />
  </g>
</svg>
