-------------------------------------------------------------------------------
Test set: com.theo.myjhipster.web.rest.errors.ExceptionTranslatorIntTest
-------------------------------------------------------------------------------
Tests run: 11, Failures: 0, Errors: 0, Skipped: 0, Time elapsed: 1.123 s - in com.theo.myjhipster.web.rest.errors.ExceptionTranslatorIntTest
