-------------------------------------------------------------------------------
Test set: com.theo.myjhipster.service.mapper.UserMapperTest
-------------------------------------------------------------------------------
Tests run: 8, Failures: 0, Errors: 0, Skipped: 0, Time elapsed: 0.05 s - in com.theo.myjhipster.service.mapper.UserMapperTest
