{
    "_id": "q3rusmFU38VwxSb1",
    "data": {
        "actionCategory": {
            "value": ""
        },
        "actionType": {
            "value": "passive"
        },
        "actions": {
            "value": null
        },
        "description": {
            "value": "<p>Part of your body has an obvious, fiendish appearance. Your hands end in razor-sharp claws, you have hooves instead of feet, sharp teeth fill your mouth, or a whipping tail extends from your spine.</p>\n<p>You gain your choice of one of the following unarmed attacks. The attack is in the brawling group and has the listed damage die and traits.</p>\n<ul>\n<li><strong>Claw</strong> [[/r {1d4}[slashing]]]{1d4 slashing} (agile, finesse, unarmed, versatile piercing)</li>\n<li><strong>Hoof</strong> [[/r {1d6}[bludgeoning]]]{1d6 bludgeoning} (finesse, unarmed)</li>\n<li><strong>Jaws</strong> [[/r {1d6}[piercing]]]{1d6 piercing} (finesse, unarmed)</li>\n<li><strong>Tail</strong> [[/r {1d4}[bludgeoning]]]{1d4 bludgeoning} (agile, finesse, unarmed)</li>\n</ul>\n<p><strong>Special</strong> You can select this feat only at 1st level, and you can't retrain into or out of this feat, nor can you change the type of attack you gained.</p>"
        },
        "featType": {
            "value": "ancestry"
        },
        "level": {
            "value": 1
        },
        "location": "",
        "prerequisites": {
            "value": []
        },
        "rules": [
            {
                "category": "unarmed",
                "damage": {
                    "base": {
                        "damageType": "bludgeoning",
                        "dice": 1,
                        "die": "d6"
                    }
                },
                "group": "brawling",
                "key": "Strike",
                "label": "Hoof",
                "range": null,
                "traits": [
                    "finesse",
                    "unarmed"
                ]
            }
        ],
        "source": {
            "value": "Pathfinder Advanced Player's Guide"
        },
        "traits": {
            "custom": "",
            "rarity": {
                "value": "common"
            },
            "value": [
                "tiefling"
            ]
        }
    },
    "effects": [],
    "flags": {},
    "img": "systems/pf2e/icons/features/feats/feats.webp",
    "name": "Form Of The Fiend (Hoof)",
    "type": "feat"
}
