{
    "_id": "hhzrxLk2HBc2RYj3",
    "content": "<p>Play at the start of your turn.</p>\n<hr />\n<p>For the rest of your turn, you gain a climb Speed and a swim Speed equal to half your Speed. If you make a horizontal @Compendium[pf2e.actionspf2e.Leap]{Leap}, increase the distance jumped by 10 feet.</p>",
    "flags": {},
    "name": "Channel Life Force",
    "permission": {
        "default": 0
    }
}
