{
    "_id": "XusuxqmXWPYc0JYA",
    "data": {
        "actionCategory": {
            "value": ""
        },
        "actionType": {
            "value": "passive"
        },
        "actions": {
            "value": null
        },
        "description": {
            "value": "<p>You act as a conduit for your companions just as your stories are a conduit between teller and listener. When you @Compendium[pf2e.actionspf2e.Spin Tale]{Spin a Tale} and the hero of your tale Casts a Spell against the villain, you warp the world, allowing the hero to calculate range and cover to the villain from your space instead of their own if they prefer. The hero must choose to calculate both range and cover from the same space; they can't use one space for range and the other for cover.</p>"
        },
        "featType": {
            "value": "archetype"
        },
        "level": {
            "value": 6
        },
        "location": "",
        "prerequisites": {
            "value": [
                {
                    "value": "Folklorist Dedication"
                }
            ]
        },
        "rules": [],
        "source": {
            "value": "Pathfinder #170: Spoken on the Song Wind"
        },
        "traits": {
            "custom": "",
            "rarity": {
                "value": "common"
            },
            "value": [
                "archetype",
                "auditory",
                "linguistic",
                "magical"
            ]
        }
    },
    "effects": [],
    "flags": {},
    "img": "systems/pf2e/icons/default-icons/feat.svg",
    "name": "Narrative Conduit",
    "type": "feat"
}
