{
    "_id": "YJQJxskQf8VqDt8G",
    "content": "<h1>Provocator</h1>\n<p>The provocator is a gladiator who mixes brilliant performance with mastery of weapons.</span></p>\n<h2 style=\"text-align: left;\"><a class=\"entity-link\" draggable=\"true\" data-pack=\"pf2e.feats-srd\" data-id=\"VJ3wIsfmabK02SNg\"><i class=\"fas fa-suitcase\"></i> Provocator Dedication</a> Feat 10</h2>\n<p style=\"box-sizing: border-box; user-select: text; color: #191813; font-family: Roboto, system, -apple-system, sans-serif; font-size: 13px;\"><span style=\"box-sizing: border-box; user-select: text; display: block;\"><strong style=\"box-sizing: border-box; user-select: text;\">Prerequisites</strong> Strength 14, Charisma 14<br style=\"box-sizing: border-box; user-select: text;\"><strong style=\"box-sizing: border-box; user-select: text;\">Access</strong> Successfully defeat the eberarks in the Irorium.<br style=\"box-sizing: border-box; user-select: text;\"></span></p>\n<hr style=\"box-sizing: border-box; user-select: text; color: #191813; font-family: Roboto, system, -apple-system, sans-serif; font-size: 13px;\">\n<p style=\"box-sizing: border-box; user-select: text; color: #191813; font-family: Roboto, system, -apple-system, sans-serif; font-size: 13px;\">For you, fighting is as much about style as skill. You become trained in simple weapons, martial weapons, and one advanced weapon of your choice. When you critically succeed at an attack roll using your chosen advanced weapon, you also apply the critical specialization of that weapon. You become an expert in Performance and your choice of either Acrobatics or Athletics. If you were an expert in all three of these skills, you instead become an expert in a skill of your choice.<br style=\"box-sizing: border-box; user-select: text;\"><br style=\"box-sizing: border-box; user-select: text;\"><strong style=\"box-sizing: border-box; user-select: text;\">Special</strong> You can't select another dedication feat until you have gained two other feats from the provocator archetype.</p>\n<h2><a class=\"entity-link\" draggable=\"true\" data-pack=\"pf2e.feats-srd\" data-id=\"lmAuoHPxzQdaSUmN\"><i class=\"fas fa-suitcase\"></i> Cartwheel Dodge</a> Feat 12</h2>\n<p style=\"box-sizing: border-box; user-select: text; color: #191813; font-family: Roboto, system, -apple-system, sans-serif; font-size: 13px;\"><span style=\"box-sizing: border-box; user-select: text; display: block;\"><strong style=\"box-sizing: border-box; user-select: text;\">Prerequisites</strong> <span style=\"white-space: nowrap; background-color: #dddddd;\">Provocator Dedication</span><br style=\"box-sizing: border-box; user-select: text;\"><strong style=\"box-sizing: border-box; user-select: text;\">Requirements</strong> You aren't encumbered or overburdened.<br style=\"box-sizing: border-box; user-select: text;\"><strong style=\"box-sizing: border-box; user-select: text;\">Trigger</strong> You succeed or critically succeed at a Reflex saving throw.<br style=\"box-sizing: border-box; user-select: text;\"></span></p>\n<hr style=\"box-sizing: border-box; user-select: text; color: #191813; font-family: Roboto, system, -apple-system, sans-serif; font-size: 13px;\">\n<p style=\"box-sizing: border-box; user-select: text; color: #191813; font-family: Roboto, system, -apple-system, sans-serif; font-size: 13px;\">You Step up to 10 feet.</p>\n<h2><a class=\"entity-link\" draggable=\"true\" data-pack=\"pf2e.feats-srd\" data-id=\"isdTXU8bV7ZVOAuQ\"><i class=\"fas fa-suitcase\"></i> Flourishing Finish</a> Feat 12</h2>\n<p style=\"box-sizing: border-box; user-select: text; color: #191813; font-family: Roboto, system, -apple-system, sans-serif; font-size: 13px;\"><span style=\"box-sizing: border-box; user-select: text; display: block;\"><strong style=\"box-sizing: border-box; user-select: text;\">Prerequisites</strong> <span style=\"white-space: nowrap; background-color: #dddddd;\">Provocator Dedication</span><br style=\"box-sizing: border-box; user-select: text;\"><strong style=\"box-sizing: border-box; user-select: text;\">Requirements</strong> Your last action was a Strike that dropped an opponent to 0 Hit Points.<br style=\"box-sizing: border-box; user-select: text;\"></span></p>\n<hr style=\"box-sizing: border-box; user-select: text; color: #191813; font-family: Roboto, system, -apple-system, sans-serif; font-size: 13px;\">\n<p style=\"box-sizing: border-box; user-select: text; color: #191813; font-family: Roboto, system, -apple-system, sans-serif; font-size: 13px;\">Attempt a Performance check, comparing the result to the Will DC of each foe within 30 feet who can see you. Regardless of the result, each target is immune to your Flourishing Finish for 10 minutes.</p>\n<hr style=\"box-sizing: border-box; user-select: text; color: #191813; font-family: Roboto, system, -apple-system, sans-serif; font-size: 13px;\">\n<p style=\"box-sizing: border-box; user-select: text; color: #191813; font-family: Roboto, system, -apple-system, sans-serif; font-size: 13px;\"><strong style=\"box-sizing: border-box; user-select: text;\">Critical Success</strong> The target is <span style=\"white-space: nowrap; background-color: #dddddd;\">Frightened</span> 2.<br style=\"box-sizing: border-box; user-select: text;\"><strong style=\"box-sizing: border-box; user-select: text;\">Success</strong> The target is frightened 1.</p>\n<h2><a class=\"entity-link\" draggable=\"true\" data-pack=\"pf2e.feats-srd\" data-id=\"IdKfWg48qMieuzl7\"><i class=\"fas fa-suitcase\"></i> Murderer's Circle</a> Feat 14</h2>\n<p style=\"box-sizing: border-box; user-select: text; color: #191813; font-family: Roboto, system, -apple-system, sans-serif; font-size: 13px;\"><span style=\"box-sizing: border-box; user-select: text; display: block;\"><strong style=\"box-sizing: border-box; user-select: text;\">Prerequisites</strong> <span style=\"white-space: nowrap; background-color: #dddddd;\">Provocator Dedication</span><br style=\"box-sizing: border-box; user-select: text;\"></span></p>\n<hr style=\"box-sizing: border-box; user-select: text; color: #191813; font-family: Roboto, system, -apple-system, sans-serif; font-size: 13px;\">\n<p style=\"box-sizing: border-box; user-select: text; color: #191813; font-family: Roboto, system, -apple-system, sans-serif; font-size: 13px;\">You Strike a target within reach and then Step to any other open space adjacent to that target. Your target is then flat-footed against your next Strike this turn.</p>\n<h2><a class=\"entity-link\" draggable=\"true\" data-pack=\"pf2e.feats-srd\" data-id=\"ZTxiM8NExDmxHJDf\"><i class=\"fas fa-suitcase\"></i> Pin to the Spot</a> Feat 14</h2>\n<p style=\"box-sizing: border-box; user-select: text; color: #191813; font-family: Roboto, system, -apple-system, sans-serif; font-size: 13px;\"><span style=\"box-sizing: border-box; user-select: text; display: block;\"><strong style=\"box-sizing: border-box; user-select: text;\">Prerequisites</strong> <span style=\"white-space: nowrap; background-color: #dddddd;\">Provocator Dedication</span><br style=\"box-sizing: border-box; user-select: text;\"></span></p>\n<hr style=\"box-sizing: border-box; user-select: text; color: #191813; font-family: Roboto, system, -apple-system, sans-serif; font-size: 13px;\">\n<p style=\"box-sizing: border-box; user-select: text; color: #191813; font-family: Roboto, system, -apple-system, sans-serif; font-size: 13px;\">You Strike a target within reach. If you hit and deal damage, the target is also Restrained as if you had critically succeeded at an Athletics check to <span style=\"white-space: nowrap; background-color: #dddddd;\">Grapple</span>.</p>\n<h2><a class=\"entity-link\" draggable=\"true\" data-pack=\"pf2e.feats-srd\" data-id=\"giupBd3dyOwdeoFl\"><i class=\"fas fa-suitcase\"></i> Performance Weapon Expert</a> Feat 16</h2>\n<p style=\"box-sizing: border-box; user-select: text; color: #191813; font-family: Roboto, system, -apple-system, sans-serif; font-size: 13px;\"><span style=\"box-sizing: border-box; user-select: text; display: block;\"><strong style=\"box-sizing: border-box; user-select: text;\">Prerequisites</strong> Provocator Dedication, expert in any kind of weapon or unarmed attack<br style=\"box-sizing: border-box; user-select: text;\"></span></p>\n<hr style=\"box-sizing: border-box; user-select: text; color: #191813; font-family: Roboto, system, -apple-system, sans-serif; font-size: 13px;\">\n<p style=\"box-sizing: border-box; user-select: text; color: #191813; font-family: Roboto, system, -apple-system, sans-serif; font-size: 13px;\">Your experience has made you better with a wide variety of weapons. Your proficiency ranks for simple weapons and martial weapons increase to expert, as does your proficiency rank for your chosen advanced weapon.</p>",
    "flags": {},
    "name": "Provocator",
    "permission": {
        "default": 0
    }
}
