{
    "_id": "cPORMYYrqMaPfjnx",
    "content": "<table class=\"pf2-table\">\n<thead>\n<tr>\n<th>\n<h3><strong>Name</strong></h3>\n</th>\n<th>\n<h3><strong>Crit Effect</strong></h3>\n</th>\n<th>\n<h3><strong>Type</strong></h3>\n</th>\n</tr>\n</thead>\n<tbody>\n<tr>\n<td>\n<h3>Back Breaker</h3>\n</td>\n<td>\n<h3>Until healed, the target is clumsy 2 and enfeebled 2.</h3>\n</td>\n<td>\n<h3>Bludgeoning</h3>\n</td>\n</tr>\n<tr>\n<td>\n<h3>Deep Wound</h3>\n</td>\n<td>\n<h3>The target is sickened 3.</h3>\n</td>\n<td>\n<h3>Piercing</h3>\n</td>\n</tr>\n<tr>\n<td>\n<h3>Brow Cut</h3>\n</td>\n<td>\n<h3>Normal damage. The target takes 1d4 persistent bleed damage. Until the bleed ends, all creatures are concealed to the target.</h3>\n</td>\n<td>\n<h3>Slashing</h3>\n</td>\n</tr>\n<tr>\n<td>\n<h3>Mystical Thwart</h3>\n</td>\n<td>\n<h3>The target can't activate magic items, cast spells, or use Quick Alchemy until the end of its next turn.</h3>\n</td>\n<td>\n<h3>Bomb or Spell</h3>\n</td>\n</tr>\n</tbody>\n</table>\n<h3 style=\"text-align: left;\"> </h3>",
    "flags": {},
    "name": "Critical Hit Deck #47",
    "permission": {
        "default": 0
    }
}
