{
    "_id": "kvQc6aNvJaBH6rEC",
    "content": "<table class=\"pf2-table\">\n<thead>\n<tr>\n<th>\n<h3><strong>Name</strong></h3>\n</th>\n<th>\n<h3><strong>Crit Effect</strong></h3>\n</th>\n<th>\n<h3><strong>Type</strong></h3>\n</th>\n</tr>\n</thead>\n<tbody>\n<tr>\n<td>\n<h3>Ruptured Spleen</h3>\n</td>\n<td>\n<h3>Normal damage. The target takes 1 persistent bleed damage that can't be removed until the target has been subject to magical healing.</h3>\n</td>\n<td>\n<h3>Bludgeoning</h3>\n</td>\n</tr>\n<tr>\n<td>\n<h3>Muscle Severed</h3>\n</td>\n<td>\n<h3>Normal damage. Until healed, the target is clumsy 3 and enfeebled 3.</h3>\n</td>\n<td>\n<h3>Piercing</h3>\n</td>\n</tr>\n<tr>\n<td>\n<h3>Lean into the Blow</h3>\n</td>\n<td>\n<h3>Triple damage. You drop your weapon.</h3>\n</td>\n<td>\n<h3>Slashing</h3>\n</td>\n</tr>\n<tr>\n<td>\n<h3>Funny Bone</h3>\n</td>\n<td>\n<h3>The target laughs uncontrollably until the end of its next turn. While laughing, it is slowed 1 and can't use reactions.</h3>\n</td>\n<td>\n<h3>Bomb or Spell</h3>\n</td>\n</tr>\n</tbody>\n</table>\n<h3 style=\"text-align: left;\"> </h3>",
    "flags": {},
    "name": "Critical Hit Deck #24",
    "permission": {
        "default": 0
    }
}
