{
    "_id": "TpAMy8tb5LrRgvqN",
    "content": "<h1>Hathor (Mistress of Jubilation) [CG]</h1><p><strong>Hathor</strong> is a member of the pantheon often worshiped in Ancient Osirion.</p><p><strong>Edicts</strong> Give wealth to new families, aid traders and miners, support musicians, protect and encourage lovers</p><p><strong>Anathema</strong> Discriminate or slight someone based on appearance, intentionally disfigure a creature, refuse food to the starving</p><p><strong>Follower Alignments</strong> NG, CG</span></p><p></span></p><h2>Devotee Benefits</h2><div><div><strong>Divine Ability</strong> Strength or Charisma</div><div><strong>Divine Font</strong> heal</div><div><strong>Divine Skill</strong> Performance</div><div><strong>Favored Weapon</strong> shortsword</div><div><strong>Domains</strong> family, passion, sun, wealth</div><div><strong>Cleric Spells</strong> 1st: charm, 2nd: tree shape, 8th: uncontrollable dance</div></div>",
    "flags": {},
    "name": "Hathor",
    "permission": {
        "default": 0
    }
}
