{
    "_id": "Zw8nhcpRxinoYRSa",
    "content": "<h1>Elven Pantheon [CG]</h1><p>The traditional deities of the elven pantheon are @Compendium[pf2e.deities.Calistria]{Calistria}, @Compendium[pf2e.deities.Desna]{Desna}, @Compendium[pf2e.deities.Findeladlara]{Findeladlara} (goddess of twilight and traditional art and architecture), @Compendium[pf2e.deities.Ketephys]{Ketephys} (god of hunting and the moon), and @Compendium[pf2e.deities.Yuelral]{Yuelral} (goddess of gems, craft, and magic). Elves have also adopted @Compendium[pf2e.deities.Alseta]{Alseta}, a minor goddess of doors and transitions, as their patron of teleportation and aiudara (commonly known as elf gates). Most elves value magic, beauty, freedom, and friendship as part of a fulfilling life and tend to worship all of the deities together as exemplars of these values. Alongside full-blooded elves, many half-elves-whether raised by elves or seeking a closer connection to their elven heritage- worship the elven pantheon.</p><p><strong>Edicts</strong> learn and appreciate traditional elven arts, crafts, and magic, explore the worlds outside and within</p><p><strong>Anathema</strong> irreparably damage the natural environment (such as by overhunting or strip mining), have an unhealthy obsession or attachment</p><p><strong>Areas of Concern</strong> elves, magic, nature, tradition</p><p><strong>Follower Alignments</strong> NG, CG, CN</p><p><strong>Pantheon Members</strong> @Compendium[pf2e.deities.Alseta]{Alseta}, @Compendium[pf2e.deities.Calistria]{Calistria}, @Compendium[pf2e.deities.Desna]{Desna}, @Compendium[pf2e.deities.Findeladlara]{Findeladlara}, @Compendium[pf2e.deities.Ketephys]{Ketephys}, @Compendium[pf2e.deities.Yuelral]{Yuelral}</span></p><p></span></p><h2>Devotee Benefits</h2><div><div><strong>Divine Ability</strong> Dexterity or Intelligence</div><div><strong>Divine Font</strong> heal</div><div><strong>Divine Skill</strong> Survival</div><div><strong>Favored Weapon</strong> longbow or shortbow</div><div><strong>Domains</strong> creation, magic, moon, nature</div><div><strong>Cleric Spells</strong> 1st: shillelagh, 2nd: shape wood, 5th: tree stride</div></div>",
    "flags": {},
    "name": "Elven Pantheon",
    "permission": {
        "default": 0
    }
}
