{
    "_id": "DS9sDOWkXrz2xmHi",
    "data": {
        "actionCategory": {
            "value": "offensive"
        },
        "actionType": {
            "value": "action"
        },
        "actions": {
            "value": 3
        },
        "description": {
            "value": "<p><strong>Requirements</strong> You are wielding a bow</p>\n<hr />\n<p>You @Compendium[pf2e.actionspf2e.Cast a Spell]{Cast a Spell} that takes 1 or 2 actions to cast and requires a spell attack roll. The effects of the spell do not occur immediately but are imbued into the bow you're wielding.</p>\n<p>Make a @Compendium[pf2e.actionspf2e.Strike]{Strike} with that bow. Your spell flies with the ammunition, using your attack roll result to determine the effects of both the Strike and the spell. This counts as two attacks for your multiple attack penalty, but you don't apply the penalty until after you've completed both attacks.</p>"
        },
        "requirements": {
            "value": ""
        },
        "rules": [],
        "source": {
            "value": "Pathfinder Advanced Player's Guide"
        },
        "traits": {
            "custom": "",
            "rarity": {
                "value": "common"
            },
            "value": []
        },
        "trigger": {
            "value": ""
        },
        "weapon": {
            "value": ""
        }
    },
    "effects": [],
    "flags": {},
    "img": "systems/pf2e/icons/actions/ThreeActions.webp",
    "name": "Eldritch Shot",
    "type": "action"
}
