{
    "_id": "KFpBT6FPfSFhxQ27",
    "data": {
        "ability": {
            "value": ""
        },
        "area": {
            "areaType": "",
            "value": ""
        },
        "autoHeightenLevel": {
            "value": null
        },
        "category": {
            "value": "spell"
        },
        "components": {
            "focus": false,
            "material": false,
            "somatic": true,
            "verbal": true
        },
        "cost": {
            "value": ""
        },
        "damage": {
            "value": {}
        },
        "description": {
            "value": "<p>You transform your companion into its juvenile form, such as a cub, foal, kitten, puppy, or piglet, making the target appear harmless. It becomes Tiny (if it was larger), and its reach is reduced to 0 feet. All of its Speeds are halved (to a minimum Speed of 5 feet), and it gains weakness 5 to physical damage. In all other ways, its abilities and statistics are unchanged.</p>\n<p>If your companion uses a hostile action, <em>juvenile companion</em> ends. This spell has no effect on a companion that doesn't have a juvenile form.</p>\n<p>@Compendium[pf2e.spell-effects.Spell Effect: Juvenile Companion]{Spell Effect: Juvenile Companion}</p>\n<hr />\n<p><strong>Heightened (2nd)</strong> The duration increases to 1 hour.</p>"
        },
        "duration": {
            "value": "10 minutes"
        },
        "hasCounteractCheck": {
            "value": false
        },
        "level": {
            "value": 1
        },
        "location": {
            "value": ""
        },
        "materials": {
            "value": ""
        },
        "range": {
            "value": "touch"
        },
        "rules": [],
        "save": {
            "basic": "",
            "value": ""
        },
        "school": {
            "value": "transmutation"
        },
        "source": {
            "value": "Pathfinder Secrets of Magic"
        },
        "spellType": {
            "value": "utility"
        },
        "sustained": {
            "value": false
        },
        "target": {
            "value": "your companion"
        },
        "time": {
            "value": "2"
        },
        "traditions": {
            "custom": "",
            "value": [
                "primal"
            ]
        },
        "traits": {
            "custom": "",
            "rarity": {
                "value": "common"
            },
            "value": [
                "polymorph"
            ]
        }
    },
    "effects": [],
    "flags": {},
    "img": "systems/pf2e/icons/spells/juvenile-companion.webp",
    "name": "Juvenile Companion",
    "type": "spell"
}
