{
    "_id": "Nbgf8zvHimdQqIu6",
    "data": {
        "description": {
            "value": "<p>You leap upon your sword as it soars through the air for up to 10 minutes. You gain a fly Speed of 25 feet or your land Speed, whichever is slower, but you can't Strike with your weapon except via the weapon's other activation. You can Dismiss the activation, and it ends automatically if you cease holding the weapon with at least one hand.</p>"
        },
        "duration": {
            "expiry": "turn-start",
            "sustained": false,
            "unit": "minutes",
            "value": 10
        },
        "level": {
            "value": 1
        },
        "rules": [
            {
                "key": "BaseSpeed",
                "selector": "fly",
                "value": "min(25, @attributes.speed.value)"
            }
        ],
        "source": {
            "value": "Pathfinder Lost Omens: The Grand Bazaar"
        },
        "start": {
            "initiative": null,
            "value": 0
        },
        "target": null,
        "tokenIcon": {
            "show": true
        },
        "traits": {
            "custom": "",
            "rarity": {
                "value": "common"
            },
            "value": []
        }
    },
    "effects": [],
    "flags": {},
    "img": "systems/pf2e/icons/equipment/weapons/greatsword.webp",
    "name": "Effect: Skyrider Sword",
    "type": "effect"
}
