{
    "_id": "4NKyZVkmWjDyyIYZ",
    "data": {
        "actionCategory": {
            "value": ""
        },
        "actionType": {
            "value": "passive"
        },
        "actions": {
            "value": null
        },
        "description": {
            "value": "<p>You favor bows and other elegant weapons. You are trained with @Compendium[pf2e.equipment-srd.Longbow]{Longbows}, @Compendium[pf2e.equipment-srd.Composite Longbow]{Composite Longbows}, @Compendium[pf2e.equipment-srd.Longsword]{Longswords}, @Compendium[pf2e.equipment-srd.Rapier]{Rapiers}, @Compendium[pf2e.equipment-srd.Shortbow]{Shortbows}, and @Compendium[pf2e.equipment-srd.Composite Shortbow]{Composite Shortbows}.</p>\n<p>In addition, you gain access to all uncommon elf weapons. For the purpose of determining your proficiency, martial elf weapons are simple weapons and advanced elf weapons are martial weapons.</p>"
        },
        "featType": {
            "value": "ancestry"
        },
        "level": {
            "value": 1
        },
        "location": "",
        "prerequisites": {
            "value": []
        },
        "rules": [
            {
                "key": "ActiveEffectLike",
                "mode": "upgrade",
                "path": "data.martial.weapon-base-longbow.rank",
                "value": 1
            },
            {
                "key": "ActiveEffectLike",
                "mode": "upgrade",
                "path": "data.martial.weapon-base-composite-longbow.rank",
                "value": 1
            },
            {
                "key": "ActiveEffectLike",
                "mode": "upgrade",
                "path": "data.martial.weapon-base-longsword.rank",
                "value": 1
            },
            {
                "key": "ActiveEffectLike",
                "mode": "upgrade",
                "path": "data.martial.weapon-base-rapier.rank",
                "value": 1
            },
            {
                "key": "ActiveEffectLike",
                "mode": "upgrade",
                "path": "data.martial.weapon-base-shortbow.rank",
                "value": 1
            },
            {
                "key": "ActiveEffectLike",
                "mode": "upgrade",
                "path": "data.martial.weapon-base-composite-shortbow.rank",
                "value": 1
            },
            {
                "key": "LinkedProficiency",
                "predicate": {
                    "all": [
                        "weapon:trait:elf",
                        "weapon:category:advanced"
                    ]
                },
                "sameAs": "martial",
                "slug": "advanced-elf-weapons"
            },
            {
                "key": "LinkedProficiency",
                "predicate": {
                    "all": [
                        "weapon:trait:elf",
                        "weapon:category:martial"
                    ]
                },
                "sameAs": "simple",
                "slug": "martial-elf-weapons"
            }
        ],
        "source": {
            "value": "Pathfinder Core Rulebook"
        },
        "traits": {
            "custom": "",
            "rarity": {
                "value": "common"
            },
            "value": [
                "elf"
            ]
        }
    },
    "effects": [],
    "flags": {},
    "img": "systems/pf2e/icons/features/feats/feats.webp",
    "name": "Elven Weapon Familiarity",
    "type": "feat"
}
