{
    "_id": "KcozzlkFAqShDEzo",
    "data": {
        "actionCategory": {
            "value": "interaction"
        },
        "actionType": {
            "value": "passive"
        },
        "actions": {
            "value": null
        },
        "description": {
            "value": "<p>Your metabolism is slow, allowing you to go for days without food and process maladies at a slower rate. You can go for 1 week without food before you begin to starve Additionally, the onset times and lengths of stages for all diseases and poisons that affect you are increased by 50%. If the onset time or stage is instant or lasts only 1 round, this ability has no effect.</p>"
        },
        "featType": {
            "value": "heritage"
        },
        "level": {
            "value": 1
        },
        "location": "",
        "prerequisites": {
            "value": []
        },
        "rules": [],
        "source": {
            "value": ""
        },
        "traits": {
            "custom": "",
            "rarity": {
                "value": "common"
            },
            "value": [
                "heritage",
                "shisk"
            ]
        }
    },
    "effects": [],
    "flags": {},
    "img": "systems/pf2e/icons/default-icons/feat.svg",
    "name": "Stronggut Shisk",
    "type": "feat"
}
