{
    "_id": "qTmjEC528YnvPgXE",
    "data": {
        "actionCategory": {
            "value": ""
        },
        "actionType": {
            "value": "passive"
        },
        "actions": {
            "value": null
        },
        "description": {
            "value": "<p><strong>Moderate Boon (Single Use)</strong>: Your heart beats with a determined valor.</p>\n<p>Once, Iomedae ends all negative effects affecting you, unless they are from an artifact, deity, or similarly powerful source; she also restores all lost Hit Points and replenishes your spells, Focus Points, and other daily resources.</p>"
        },
        "featType": {
            "value": "deityboon"
        },
        "level": {
            "value": 0
        },
        "prerequisites": {
            "value": []
        },
        "rules": [],
        "source": {
            "value": ""
        },
        "traits": {
            "custom": "",
            "rarity": {
                "value": "common"
            },
            "selected": {},
            "value": []
        }
    },
    "effects": [],
    "flags": {},
    "img": "systems/pf2e/icons/deity/Iomedae.webp",
    "name": "Iomedae - Moderate Boon",
    "type": "feat"
}
