{
    "_id": "A37XqON6QRPzQhp7",
    "content": "<h1>Hshurha (Duchess of All Winds) [NE]</h1><p><strong>Hshurha</strong>, Duchess of All Winds, is the elemental lord of air, last breaths, and windstorms. She rules the Plane of Air from her translucent palace, Verglas Precessional, surrounded by her court of air elementals, planar dignitaries, and favored guests. The Duchess is naturally invisible, and her true form-if she even has such a thing-is a mystery. Cruel and tyrannical, Hshurha enjoys toying with outsiders in her realm, and she is known to be especially vicious toward creatures with solid forms. She creates and destroys magnificent ice and dust sculptures according to her tumultuous whims, and her machinations often seem convoluted and nonsensical, even to her inner circle. Most on the plane both respect and fear her.</p><p>The lord of air is worshipped by air elementals as a mother goddess, by invisible stalkers, and by cultists who enjoy catering to capricious whims and unpredictable storms. Despite her cool peace with djinn, some believe she consorts with efreet or uses her invisible stalkers to weaken the djinn's hold on her plane.</p><p><strong>Edicts</strong> Revel in formlessness and freedom, humiliate terrestrial creatures, kill foes via falling or hazards from high winds</p><p><strong>Anathema</strong> Deny a flying creature the ability to fly, walk on the earth if you could easily travel otherwise</p><p><strong>Areas of Concern</strong> air, last breaths, and windstorms</p><p><strong>Follower Alignments</strong> N, LE, NE, CE</span></p><p></span></p><h2>Devotee Benefits</h2><div><div><strong>Divine Ability</strong> Strength or Dexterity</div><div><strong>Divine Font</strong> harm</div><div><strong>Divine Skill</strong> Stealth</div><div><strong>Favored Weapon</strong> longbow</div><div><strong>Domains</strong> air, cold, destruction, dust</div><div><strong>Cleric Spells</strong> 1st: gust of wind, 2nd: summon elemental (air only), 4th: gaseous form</div></div>",
    "flags": {},
    "name": "Hshurha",
    "permission": {
        "default": 0
    }
}
