{
    "_id": "fU7d5P6WrfAirgip",
    "data": {
        "actionCategory": {
            "value": ""
        },
        "actionType": {
            "value": "passive"
        },
        "actions": {
            "value": null
        },
        "description": {
            "value": "<p>Your tumbling catches your foe off guard. When you @Compendium[pf2e.actionspf2e.Tumble Through]{Tumble Through} successfully, the foe you Tumbled Through is @Compendium[pf2e.conditionitems.Flat-Footed]{Flat-Footed} against the next attack you make before the end of your turn.</p>"
        },
        "featType": {
            "value": "class"
        },
        "level": {
            "value": 2
        },
        "prerequisites": {
            "value": []
        },
        "rules": [],
        "source": {
            "value": "Pathfinder Advanced Player's Guide"
        },
        "traits": {
            "custom": "",
            "rarity": {
                "value": "common"
            },
            "value": [
                "swashbuckler"
            ]
        }
    },
    "effects": [],
    "flags": {},
    "img": "systems/pf2e/icons/features/feats/feats.webp",
    "name": "Tumble Behind (Swashbuckler)",
    "type": "feat"
}
