{
    "_id": "UH2sT6eW5e31Xytd",
    "data": {
        "description": {
            "value": "<p>Granted by <em>@Compendium[pf2e.spells-srd.Dutiful Challenge]{Dutiful Challenge}</em></p>"
        },
        "duration": {
            "expiry": "turn-start",
            "sustained": false,
            "unit": "minutes",
            "value": 1
        },
        "level": {
            "value": 4
        },
        "rules": [
            {
                "key": "ToggleProperty",
                "label": "Attacking target of Dutiful Challenge",
                "property": "flags.pf2e.rollOptions.all.dutiful-challenge"
            },
            {
                "key": "FlatModifier",
                "label": "Dutiful Challenge (against other targets)",
                "predicate": {
                    "not": [
                        "dutiful-challenge"
                    ]
                },
                "selector": "attack",
                "type": "status",
                "value": {
                    "brackets": [
                        {
                            "end": 6,
                            "start": 4,
                            "value": -1
                        },
                        {
                            "end": 9,
                            "start": 9,
                            "value": -2
                        },
                        {
                            "start": 10,
                            "value": -3
                        }
                    ],
                    "field": "item|data.level.value"
                }
            },
            {
                "key": "FlatModifier",
                "label": "Dutiful Challenge (against other targets)",
                "predicate": {
                    "not": [
                        "dutiful-challenge"
                    ]
                },
                "selector": "damage",
                "type": "status",
                "value": {
                    "brackets": [
                        {
                            "end": 6,
                            "start": 4,
                            "value": -1
                        },
                        {
                            "end": 9,
                            "start": 9,
                            "value": -2
                        },
                        {
                            "start": 10,
                            "value": -3
                        }
                    ],
                    "field": "item|data.level.value"
                }
            },
            {
                "key": "FlatModifier",
                "label": "Dutiful Challenge (against other targets)",
                "predicate": {
                    "not": [
                        "dutiful-challenge"
                    ]
                },
                "selector": "skill-check",
                "type": "status",
                "value": {
                    "brackets": [
                        {
                            "end": 6,
                            "start": 4,
                            "value": -1
                        },
                        {
                            "end": 9,
                            "start": 9,
                            "value": -2
                        },
                        {
                            "start": 10,
                            "value": -3
                        }
                    ],
                    "field": "item|data.level.value"
                }
            }
        ],
        "source": {
            "value": ""
        },
        "start": {
            "initiative": null,
            "value": 0
        },
        "target": null,
        "tokenIcon": {
            "show": true
        },
        "traits": {
            "custom": "",
            "rarity": {
                "value": "common"
            },
            "value": []
        }
    },
    "effects": [],
    "flags": {},
    "img": "systems/pf2e/icons/spells/dutiful-challenge.webp",
    "name": "Spell Effect: Dutiful Challenge",
    "type": "effect"
}
