{
    "_id": "HI2xA7LCpNPkpV03",
    "data": {
        "attributes": {
            "ac": {
                "value": 34
            },
            "hardness": 18,
            "hasHealth": true,
            "hp": {
                "details": "",
                "max": 72,
                "temp": 0,
                "tempmax": 0,
                "value": 72
            },
            "stealth": {
                "details": "(Master) or DC 37 Perception (master) to notice what appear to be screaming ghostly faces in the crystals.",
                "value": 27
            }
        },
        "creatureType": "",
        "details": {
            "description": "Three clusters of gleaming, colorful crystals are corrupted with necromantic energy that causes them to reflect negative emotions. All three must be disabled or destroyed to negate the hazard.",
            "disable": "Thievery DC 29 (master) to carefully fracture the crystals or Crafting DC 27 (expert) to place objects to stop the resonance, both disabling one 5-foot patch of crystals.",
            "isComplex": true,
            "level": {
                "value": 13
            },
            "reset": "The wailing crystals deactivate and reset once no living creatures are within 20 feet.",
            "routine": "(3 actions) The hazard uses each action for an Anguished Shriek. The wailing crystals lose 1 action for each 5-foot patch of crystals that is broken or destroyed."
        },
        "saves": {
            "fortitude": {
                "saveDetail": "",
                "value": 26
            },
            "reflex": {
                "saveDetail": "",
                "value": 18
            },
            "will": {
                "saveDetail": "",
                "value": 0
            }
        },
        "source": {
            "value": ""
        },
        "statusEffects": [],
        "traits": {
            "ci": [],
            "di": {
                "custom": "",
                "selected": {},
                "value": [
                    "critical-hits",
                    "object-immunities",
                    "precision"
                ]
            },
            "dr": [],
            "dv": [],
            "rarity": {
                "value": "common"
            },
            "size": {
                "value": "med"
            },
            "traits": {
                "custom": "",
                "value": [
                    "environmental",
                    "magical"
                ]
            }
        }
    },
    "effects": [],
    "flags": {},
    "img": "systems/pf2e/icons/default-icons/hazard.svg",
    "items": [
        {
            "_id": "MuK4kIpfXEUbojeB",
            "data": {
                "actionCategory": {
                    "value": ""
                },
                "actionType": {
                    "value": "passive"
                },
                "actions": {
                    "value": null
                },
                "description": {
                    "value": ""
                },
                "requirements": {
                    "value": ""
                },
                "rules": [],
                "slug": null,
                "source": {
                    "value": ""
                },
                "traits": {
                    "custom": "",
                    "rarity": {
                        "value": "common"
                    },
                    "selected": {},
                    "value": []
                },
                "trigger": {
                    "value": ""
                },
                "weapon": {
                    "value": ""
                }
            },
            "effects": [],
            "flags": {},
            "img": "systems/pf2e/icons/default-icons/action.svg",
            "name": "HP is 72 for each 5 foot patch",
            "sort": 100000,
            "type": "action"
        },
        {
            "_id": "HH6SL5ftuMn3NSHu",
            "data": {
                "actionCategory": {
                    "value": ""
                },
                "actionType": {
                    "value": "reaction"
                },
                "actions": {
                    "value": null
                },
                "description": {
                    "value": "<p data-visibility=\"gm\"><strong>Trigger</strong>: A living creature approaches within 20 feet of a wailing crystal.</p>\n<p><strong>Effect</strong>: A despairing chorus of cries echoes off the crystals, working its way into the minds of all living creatures in Jewelgate Way Station, affecting them with <em>@Compendium[pf2e.spells-srd.Crushing Despair]{Crushing Despair}</em>(7th level, DC 33). The hazard rolls initiative.</p>"
                },
                "requirements": {
                    "value": ""
                },
                "rules": [],
                "slug": null,
                "source": {
                    "value": ""
                },
                "traits": {
                    "custom": "",
                    "rarity": {
                        "value": "common"
                    },
                    "selected": {
                        "occult": "Occult"
                    },
                    "value": [
                        "occult"
                    ]
                },
                "trigger": {
                    "value": ""
                },
                "weapon": {
                    "value": ""
                }
            },
            "effects": [],
            "flags": {},
            "img": "systems/pf2e/icons/actions/Reaction.webp",
            "name": "Echoing Cry",
            "sort": 200000,
            "type": "action"
        },
        {
            "_id": "whQM5kvewGUXnnLe",
            "data": {
                "actionCategory": {
                    "value": ""
                },
                "actionType": {
                    "value": "action"
                },
                "actions": {
                    "value": null
                },
                "description": {
                    "value": "<p>A shrieking, distorted face composed of writhing necromantic energy lances out of the crystals to target a random living creature within 20 feet. The target takes [[/r {4d6}[mental]]]{4d6 mental damage} and [[/r {4d6}[sonic]]]{4d6 sonic damage} (<span data-pf2-check=\"will\" data-pf2-dc=\"33\" data-pf2-traits=\"emotion,enchantment,mental,occult,sonic,damaging-effect\" data-pf2-label=\"Anguished Shriek DC\" data-pf2-show-dc=\"gm\">basic Will</span> save).</p>"
                },
                "requirements": {
                    "value": ""
                },
                "rules": [],
                "slug": null,
                "source": {
                    "value": ""
                },
                "traits": {
                    "custom": "",
                    "rarity": {
                        "value": "common"
                    },
                    "selected": {
                        "emotion": "Emotion",
                        "enchantment": "Enchantment",
                        "mental": "Mental",
                        "occult": "Occult",
                        "sonic": "Sonic"
                    },
                    "value": [
                        "emotion",
                        "enchantment",
                        "mental",
                        "occult",
                        "sonic"
                    ]
                },
                "trigger": {
                    "value": ""
                },
                "weapon": {
                    "value": ""
                }
            },
            "effects": [],
            "flags": {},
            "img": "systems/pf2e/icons/actions/OneAction.webp",
            "name": "Anguished Shriek",
            "sort": 300000,
            "type": "action"
        }
    ],
    "name": "Wailing Crystals",
    "token": {
        "disposition": 0,
        "height": 1,
        "img": "systems/pf2e/icons/default-icons/hazard.svg",
        "name": "Wailing Crystals",
        "width": 1
    },
    "type": "hazard"
}
