{
    "_id": "JoxEspM0kbCop7og",
    "data": {
        "actionCategory": {
            "value": "offensive"
        },
        "actionType": {
            "value": "action"
        },
        "actions": {
            "value": 1
        },
        "description": {
            "value": "<p><strong>Requirements</strong> You're holding a book.</p>\n<hr />\n<p>You raise up the book you're holding and flip it open to defend yourself and expedite your studies. The book remains raised until the start of your next turn. While you have a book raised, you gain a +2 circumstance bonus to AC and a +1 circumstance bonus to Recall Knowledge to identify creatures using a skill related to the subject of the book (Arcana if you're using your spellbook). This bonus is in addition to any item bonus the book normally gives to the check.</p>\n<p>If you have @Compendium[pf2e.feats-srd.Shield Block]{Shield Block}, you can use the tome for that feat (Hardness 3, HP 12, BT 6) as though it were a shield. Whenever you use an ability that allows you to Raise a Shield, such as Emergency Targe, you can Raise a Tome instead, changing any requirements that normally require a shield to apply to your book.</p>"
        },
        "featType": {
            "value": "class"
        },
        "level": {
            "value": 1
        },
        "location": "",
        "prerequisites": {
            "value": []
        },
        "rules": [],
        "source": {
            "value": ""
        },
        "traits": {
            "custom": "",
            "rarity": {
                "value": "common"
            },
            "value": [
                "magus"
            ]
        }
    },
    "effects": [],
    "flags": {},
    "img": "systems/pf2e/icons/features/feats/feats.webp",
    "name": "Raise a Tome",
    "type": "feat"
}
