{
    "_id": "K1mmFJ3QSjNkHm2L",
    "content": "<h1>Dual-Weapon Warrior</h1>\n<p>You're able to effortlessly fight with multiple weapons simultaneously, weaving your weapons together into a storm of quick attacks. To you, continual offense is the best form of defense, and you leave little room for your foes to avoid your whirlwind of weapons.</p>\n<p>Additional Feats: 6th @Compendium[pf2e.feats-srd.Twin Parry]{Twin Parry}; 12th @Compendium[pf2e.feats-srd.Twin Riposte]{Twin Riposte}; 16th @Compendium[pf2e.feats-srd.Improved Twin Riposte (Fighter)]{Improved Twin Riposte}, @Compendium[pf2e.feats-srd.Two-Weapon Flurry]{Two-Weapon Flurry}; 18th @Compendium[pf2e.feats-srd.Twinned Defense (Fighter)]{Twinned Defense}</p>\n<h2>@Compendium[pf2e.feats-srd.Dual-Weapon Warrior Dedication]{Dual-Weapon Warrior Dedication} Feat 2</h2>\n<p>You're exceptional in your use of two weapons. You gain the Double Slice fighter feat. This serves as Double Slice for the purpose of meeting prerequisites.</p>\n<p><strong>Special</strong> You can't select another dedication feat until you have gained two other feats from the Dual-Weapon Warrior archetype.</p>\n<h2>@Compendium[pf2e.feats-srd.Dual Thrower]{Dual Thrower} Feat 4</h2>\n<p><strong>Prerequisites</strong> Dual-Weapon Warrior Dedication</p>\n<hr />\n<p>You know how to throw two weapons as easily as strike with them. Whenever a dual-weapon warrior feat allows you to make a melee Strike, you can instead make a ranged Strike with a thrown weapon or a one-handed ranged weapon you are wielding. Any effects from these feats that apply to one-handed melee weapons or melee Strikes also apply to one-handed ranged weapons and ranged Strikes.</p>\n<h2>@Compendium[pf2e.feats-srd.Dual-Weapon Reload]{Dual-Weapon Reload} Feat 4</h2>\n<p><strong>Prerequisites</strong> Dual-Weapon Warrior Dedication</p>\n<p><strong>Requirements</strong> You are wielding two one-handed weapons, each in a different hand, one of which is a ranged weapon.</p>\n<hr />\n<p>You carry your ammunition in a way that allows you to reload while holding two weapons. You Interact to reload a one-handed ranged weapon you're holding. Unlike most Interact actions, you don't need a free hand to reload your ranged weapon in this way.</p>\n<h2>@Compendium[pf2e.feats-srd.Flensing Slice]{Flensing Slice} Feat 8</h2>\n<p><strong>Prerequisites</strong> Dual-Weapon Warrior Dedication</p>\n<p><strong>Requirements</strong> Your last action was a Double Slice, and both attacks hit the target.</p>\n<hr />\n<p>When you hit with both attacks with Double Slice, you flense the target, making it bleed and creating a weak spot. The target takes [[/r 1d8 #persistent bleed]] @Compendium[pf2e.conditionitems.Persistent Damage]{Persistent Bleed Damage} per weapon damage die of whichever of the weapons you used that has the most weapon damage dice (maximum 4d8 for a major striking weapon). The target becomes flat-footed, and its resistances to any physical damage types are reduced by 5; these two effects last until the beginning of your next turn.</p>\n<h2>@Compendium[pf2e.feats-srd.Dual-Weapon Blitz]{Dual-Weapon Blitz} Feat 10</h2>\n<p><strong>Prerequisites</strong> Dual-Weapon Warrior Dedication</p>\n<p><strong>Requirements</strong> You are wielding two one-handed melee weapons, each in a different hand.</p>\n<hr />\n<p>You attack as you dash among foes. Stride up to your Speed. At any point during this movement, you can Strike once with each of the two required weapons. These Strikes can be against the same or different targets, as you see fit.</p>\n<h2>@Compendium[pf2e.feats-srd.Dual Onslaught]{Dual Onslaught} Feat 14</h2>\n<p><strong>Prerequisites</strong> Dual-Weapon Dedication</p>\n<hr />\n<p>When you lash out with both weapons, you leave no room for the target to escape your attack. When you use Double Slice, if you miss with both Strikes, choose one of the two weapons and apply the effects of a hit with that weapon. You can't choose a weapon if your attack roll with that weapon was a critical failure, meaning you still miss entirely if both attack rolls were critical failures.</p>\n",
    "flags": {},
    "name": "Dual-Weapon Warrior",
    "permission": {
        "default": 0
    }
}
