{
    "_id": "pe6cHJzzMm5Tr25G",
    "data": {
        "actionCategory": {
            "value": ""
        },
        "actionType": {
            "value": "action"
        },
        "actions": {
            "value": 2
        },
        "description": {
            "value": "<p><strong>Frequency</strong> once per day</p>\n<hr />\n<p>You unfold your wings for travel and can keep them unfolded for 10 minutes. You gain a fly Speed equal to your land Speed while your wings are unfurled. If you have Fledgling Flight, you gain a +10-foot status bonus to your fly Speed with Juvenile Flight. As normal, since your fly Speed is derived from your land Speed, this status bonus isn't cumulative with a status bonus to your land Speed, if you have one.</p>"
        },
        "featType": {
            "value": "ancestry"
        },
        "level": {
            "value": 9
        },
        "location": "",
        "prerequisites": {
            "value": []
        },
        "rules": [],
        "source": {
            "value": "Pathfinder Lost Omens: Ancestry Guide"
        },
        "traits": {
            "custom": "",
            "rarity": {
                "value": "common"
            },
            "value": [
                "strix"
            ]
        }
    },
    "effects": [],
    "flags": {},
    "img": "systems/pf2e/icons/features/feats/feats.webp",
    "name": "Juvenile Flight",
    "type": "feat"
}
