{
    "_id": "6RjilN93bgy34y3H",
    "data": {
        "actionCategory": {
            "value": ""
        },
        "actionType": {
            "value": "passive"
        },
        "actions": {
            "value": null
        },
        "description": {
            "value": "<p style=\"text-align: left;\">You have learned limited divine magic from your Red Mantis training. You gain the Cast a Spell activity. You're a prepared spellcaster, able to prepare two cantrips and one 1st-level spell each day. You prepare these spells from a Red Mantis assassin spellbook, similar to a wizard's, containing three cantrips and two 1st-level spells. All the spells in your Red Mantis assassin spellbook, from this and later feats, must be either transmutation or illusion spells from the arcane spell list or a spell from the following list: <em>@Compendium[pf2e.spells-srd.Clairaudience]{Clairaudience}</em>, <em>@Compendium[pf2e.spells-srd.Clairvoyance]{Clairvoyance}</em>, <em>@Compendium[pf2e.spells-srd.Darkness]{Darkness}</em>, <em>@Compendium[pf2e.spells-srd.Dimension Door]{Dimension Door}</em>, <em>@Compendium[pf2e.spells-srd.Modify Memory]{Modify Memory}</em>, <em>@Compendium[pf2e.spells-srd.Obscuring Mist]{Obscuring Mist}</em>, <em>@Compendium[pf2e.spells-srd.Paralyze]{Paralyze}</em><em>@Compendium[pf2e.spells-srd.See Invisibility]{See Invisibility}</em>, <em>@Compendium[pf2e.spells-srd.True Strike]{True Strike}</em>. Regardless of their usual magical tradition, your Red Mantis assassin spells are divine spells, as are any Red Mantis focus spells you gain.</p>\n<p style=\"text-align: left;\">You can prepare two cantrips and one 1st-level spell each day from those found in your Red Mantis assassin spellbook. You're trained in spell attack rolls and spell DCs for casting divine spells. Your key spellcasting ability for these spells is Charisma.</p>"
        },
        "featType": {
            "value": "archetype"
        },
        "identified": {
            "value": true
        },
        "level": {
            "value": 4
        },
        "prerequisites": {
            "value": [
                {
                    "value": "trained in Religion"
                },
                {
                    "value": "Red Mantis Assassin Dedication"
                }
            ]
        },
        "rules": [],
        "source": {
            "value": "Pathfinder Lost Omens: World Guide"
        },
        "traits": {
            "custom": "",
            "rarity": {
                "value": "common"
            },
            "value": [
                "archetype"
            ]
        }
    },
    "effects": [],
    "flags": {},
    "img": "systems/pf2e/icons/features/feats/feats.webp",
    "name": "Basic Red Mantis Magic",
    "type": "feat"
}
