{
    "_id": "G9l2g7sDpPVbZJza",
    "data": {
        "actionCategory": {
            "value": ""
        },
        "actionType": {
            "value": "action"
        },
        "actions": {
            "value": 1
        },
        "description": {
            "value": "<p><strong>Requirements</strong> You are adjacent to a creature that is at least</p>\n<p>one size larger than you and is willing to be your mount.</p>\n<hr />\n<p>You and your mount can spring into action at a moment's notice. You @Compendium[pf2e.actionspf2e.Mount]{Mount} the creature and @Compendium[pf2e.actionspf2e.Command an Animal]{Command an Animal} to issue it an order of your choice.</p>"
        },
        "featType": {
            "value": "archetype"
        },
        "level": {
            "value": 4
        },
        "prerequisites": {
            "value": [
                {
                    "value": "Cavalier Dedication"
                },
                {
                    "value": "expert in Nature"
                }
            ]
        },
        "rules": [],
        "source": {
            "value": "Pathfinder Advanced Player's Guide"
        },
        "traits": {
            "custom": "",
            "rarity": {
                "value": "common"
            },
            "value": [
                "archetype",
                "skill"
            ]
        }
    },
    "effects": [],
    "flags": {},
    "img": "systems/pf2e/icons/features/feats/feats.webp",
    "name": "Quick Mount",
    "type": "feat"
}
