{
    "_id": "u3YfcJh1C4w6n75j",
    "content": "<h1>Raumya (The Evil Prince) [NE]</h1><p><strong>Edicts</strong> Improve yourself with music and literature, take what you want, seek power above others</p><p><strong>Anathema</strong> Abuse a loyal subject, harm or kill a non-combatant</p><p><strong>Follower Alignments</strong> NG, N, LE, NE</span></p><p></span></p><h2>Devotee Benefits</h2><div><div><strong>Divine Ability</strong> Strength or Charisma</div><div><strong>Divine Font</strong> harm or heal</div><div><strong>Divine Skill</strong> Performance</div><div><strong>Favored Weapon</strong> trident</div><div><strong>Domains</strong> confidence, knowledge, might, wealth</div><div><strong>Cleric Spells</strong> 1st: true strike, 2nd: invisibility, 4th: weapon storm</div></div>",
    "flags": {},
    "name": "Raumya",
    "permission": {
        "default": 0
    }
}
