{
    "_id": "S38CM3hyr7DnsmRR",
    "data": {
        "description": {
            "value": "<p>If the @Compendium[pf2e.pathfinder-bestiary.Astradaemon]{Astradaemon} successfully kills a creature with Devour Soul, the astradaemon gains 10 temporary Hit Points and a +2 status bonus to attack and damage rolls for 1 day.</p>"
        },
        "duration": {
            "expiry": "turn-start",
            "sustained": false,
            "unit": "days",
            "value": 1
        },
        "level": {
            "value": 1
        },
        "rules": [
            {
                "key": "TempHP",
                "value": 10
            },
            {
                "key": "FlatModifier",
                "label": "Effect: Devour Soul",
                "selector": "attack",
                "type": "status",
                "value": 2
            },
            {
                "key": "FlatModifier",
                "label": "Effect: Devour Soul",
                "selector": "damage",
                "type": "status",
                "value": 2
            }
        ],
        "source": {
            "value": ""
        },
        "start": {
            "initiative": null,
            "value": 0
        },
        "target": null,
        "tokenIcon": {
            "show": true
        },
        "traits": {
            "custom": "",
            "rarity": {
                "value": "common"
            },
            "value": []
        }
    },
    "effects": [],
    "flags": {},
    "img": "systems/pf2e/icons/spells/eject-soul.webp",
    "name": "Effect: Devour Soul (Victim Level 15 or Higher)",
    "type": "effect"
}
