{
    "_id": "AGznaQpn2cE6jz9H",
    "data": {
        "actionCategory": {
            "value": ""
        },
        "actionType": {
            "value": "passive"
        },
        "actions": {
            "value": null
        },
        "description": {
            "value": "<p>You can hang by your tail from any suitable anchor point, such as a tree branch, balcony, or rocky outcropping (subject to the GM's discretion), typically while climbing. While hanging, you have free use of all your other limbs, so you can perform tasks that require both hands, such as firing a bow or swinging a greatsword.</p>"
        },
        "featType": {
            "value": "ancestry"
        },
        "level": {
            "value": 9
        },
        "location": "",
        "prerequisites": {
            "value": [
                {
                    "value": "Flexible Tail"
                }
            ]
        },
        "rules": [],
        "source": {
            "value": "Pathfinder Lost Omens: Ancestry Guide"
        },
        "traits": {
            "custom": "",
            "rarity": {
                "value": "common"
            },
            "value": [
                "lizardfolk"
            ]
        }
    },
    "effects": [],
    "flags": {},
    "img": "systems/pf2e/icons/features/feats/feats.webp",
    "name": "Dangle",
    "type": "feat"
}
