{
    "_id": "rDYDTCVUa5GS3uTE",
    "data": {
        "attributes": {
            "ac": {
                "value": 25
            },
            "hardness": 6,
            "hasHealth": true,
            "hp": {
                "details": "; <strong>Iron Maiden Hardness</strong> 12; <strong>Iron Maiden HP</strong> 46 (BT 23)",
                "max": 24,
                "temp": 0,
                "tempmax": 0,
                "value": 24
            },
            "stealth": {
                "details": "(expert)",
                "value": 20
            }
        },
        "creatureType": "",
        "details": {
            "description": "A pressure plate hidden on the floor before an iron maiden causes the torture device to snap shut and trap the triggering creature inside.",
            "disable": "DC 28 Thievery to disable the pressure plate",
            "isComplex": false,
            "level": {
                "value": 8
            },
            "reset": "The pressure plate must be reset manually.",
            "routine": ""
        },
        "saves": {
            "fortitude": {
                "saveDetail": "",
                "value": 0
            },
            "reflex": {
                "saveDetail": "",
                "value": 0
            },
            "will": {
                "saveDetail": "",
                "value": 0
            }
        },
        "source": {
            "value": "Pathfinder #158: Sixty Feet Under"
        },
        "statusEffects": [],
        "traits": {
            "ci": [],
            "di": {
                "custom": "",
                "selected": {},
                "value": [
                    "precision",
                    "critical-hits",
                    "object-immunities"
                ]
            },
            "dr": [],
            "dv": [],
            "rarity": {
                "value": "common"
            },
            "size": {
                "value": "med"
            },
            "traits": {
                "custom": "",
                "value": [
                    "mechanical",
                    "trap"
                ]
            }
        }
    },
    "effects": [],
    "flags": {},
    "img": "systems/pf2e/icons/default-icons/hazard.svg",
    "items": [
        {
            "_id": "Y7LWmp8wJgF4O24C",
            "data": {
                "actionCategory": {
                    "value": "offensive"
                },
                "actionType": {
                    "value": "reaction"
                },
                "actions": {
                    "value": null
                },
                "description": {
                    "value": "<p data-visibility=\"gm\"><strong>Trigger</strong> A creature steps onto the trap's pressure plate (indicated on the map);</p>\n<p><strong>Effect</strong> The front of the iron maiden slams shut with incredible force and locks itself. The triggering creature takes [[/r {4d10+10}[piercing]]]{4d10+10 piercing damage} and [[/r 2d6 #persistent bleed]] @Compendium[pf2e.conditionitems.Persistent Damage]{Persistent Bleed Damage} (<span data-pf2-check=\"reflex\" data-pf2-dc=\"26\" data-pf2-traits=\"damaging-effect\" data-pf2-label=\"Slam Shut DC\" data-pf2-show-dc=\"gm\">basic Reflex</span> save; if the creature critically succeeds, they avoid the trap completely). The triggering creature is also immobilized. The victim can end their immobilization only once a creature outside the iron maiden unlocks the device (requiring two successful <span data-pf2-check=\"thievery\" data-pf2-dc=\"28\" data-pf2-traits=\"manipulate,action:disable-a-device\" data-pf2-label=\"Unlock Iron Maiden DC\" data-pf2-show-dc=\"gm\">Thievery</span> checks to Disable a Device) or breaks the iron maiden, after which the trapped creature must succeed at a DC 25 check to Escape the trap's spike-lined interior.</p>"
                },
                "requirements": {
                    "value": ""
                },
                "rules": [],
                "slug": null,
                "source": {
                    "value": ""
                },
                "traits": {
                    "custom": "",
                    "rarity": {
                        "value": "common"
                    },
                    "value": []
                },
                "trigger": {
                    "value": ""
                },
                "weapon": {
                    "value": ""
                }
            },
            "effects": [],
            "flags": {},
            "img": "systems/pf2e/icons/actions/Reaction.webp",
            "name": "Slam Shut",
            "sort": 100000,
            "type": "action"
        }
    ],
    "name": "Iron Maiden Trap",
    "token": {
        "disposition": 0,
        "height": 1,
        "img": "systems/pf2e/icons/default-icons/hazard.svg",
        "name": "Iron Maiden Trap",
        "width": 1
    },
    "type": "hazard"
}
