{
    "_id": "r6SFB1PzKsagDXff",
    "content": "<h1>Lady Nanbyo (The Widow of Suffering) [CE]</h1><p><strong>Edicts</strong> Revel in destruction, make natural disasters worse, allow natural disasters take their due</p><p><strong>Anathema</strong> Allow a natural disaster to completely destroy a community or leave a group with no survivors</p><p><strong>Follower Alignments</strong> NE, CE</span></p><p></span></p><h2>Devotee Benefits</h2><div><div><strong>Divine Ability</strong> Strength or Constitution</div><div><strong>Divine Font</strong> harm</div><div><strong>Divine Skill</strong> Nature</div><div><strong>Favored Weapon</strong> warhammer</div><div><strong>Domains</strong> destruction, fire, plague, water</div><div><strong>Cleric Spells</strong> 1st: burning hands, 5th: control water, 6th: dragon form</div></div>",
    "flags": {},
    "name": "Lady Nanbyo",
    "permission": {
        "default": 0
    }
}
