{
    "_id": "48z7BPYIZJIgj3x5",
    "data": {
        "actionCategory": {
            "value": ""
        },
        "actionType": {
            "value": "passive"
        },
        "actions": {
            "value": null
        },
        "description": {
            "value": "<p>You make sure that your allies push themselves while traveling. You gain the @Compendium[pf2e.feats-srd.Caravan Leader]{Caravan Leader} and @Compendium[pf2e.feats-srd.Pick Up The Pace]{Pick Up The Pace} general feats, even if you don't meet the prerequisites.</p>"
        },
        "featType": {
            "value": "ancestry"
        },
        "level": {
            "value": 13
        },
        "location": "",
        "prerequisites": {
            "value": []
        },
        "rules": [],
        "source": {
            "value": "Pathfinder Lost Omens: Ancestry Guide"
        },
        "traits": {
            "custom": "",
            "rarity": {
                "value": "common"
            },
            "value": [
                "hobgoblin"
            ]
        }
    },
    "effects": [],
    "flags": {},
    "img": "systems/pf2e/icons/features/feats/feats.webp",
    "name": "We March On",
    "type": "feat"
}
