{
    "_id": "Upf1LXtWNJ6eB5sm",
    "data": {
        "actionCategory": {
            "value": ""
        },
        "actionType": {
            "value": "passive"
        },
        "actions": {
            "value": null
        },
        "description": {
            "value": "<p>This class feature alters your spellcasting class feature (such as Arcane Spellcasting for the wizard or Divine Spellcasting for the cleric). If you choose this class archetype, you must select @Compendium[pf2e.feats-srd.Flexible Spellcaster Dedication]{Flexible Spellcaster Dedication} as your 2nd-level class feat.</p>\n<p><strong>Prerequisites</strong>: You must have a class, such as clerics, druids, witches, and wizards, that prepares spells in spell slots using the same number of prepared spells per day.</p>\n<p><strong>Flexible Spellcaster Adjustments</strong>: You learn spells as normal for your class (a wizard uses a spellbook, a witch teaches spells to their familiar, and so on), but change your spellcasting from your class as follows.</p>\n<ul>\n<li>You can cast fewer spells each day. Your number of spell slots per day don't advance from 2 to 3 spells at even levels.</li>\n<li>Reduce the number of cantrips you gain from your class by 2. This archetype doesn't change the way you prepare cantrips.</li>\n<li>During your daily preparations, you prepare a spell collection rather than preparing spells into each spell slot individually. The number of spells in your spell collection each day equals the total number of spell slots you get each day from your class spells. Select these spells from the same source as normal, such as from a spellbook for a wizard.</li>\n<li>You can cast any of the spells in your collection by using a spell slot of an appropriate level. For instance, if you were level 1 and had <em>@Compendium[pf2e.spells-srd.Feather Fall]{Feather Fall}</em> and <em>@Compendium[pf2e.spells-srd.Magic Missile]{Magic Missile}</em> in your spell collection, you could cast <em>feather fall</em> twice that day, <em>magic missile</em> twice, or each spell once.</li>\n<li>Extra spell slots you gain that have additional restrictions, like the wizard's specialist school spells or the cleric's divine font spells, don't change due to this archetype, nor do such spells count toward the number of spells you place in your spell collection.</li>\n</ul>\n<h3>RESTRICTED SPELL SLOTS</h3>\n<p>When applying this archetype to a class that grants additional spell slots with restrictions, such as the specialist wizard's specialist school spells or the cleric's divine bond, you still gain those additional slots, but they work as normal for your class, and they don't add more spells to your spell collection. A healing font grants you additional spell slots to cast <em>@Compendium[pf2e.spells-srd.Heal]{Heal}</em> spells of the highest level you can cast, but doesn't add <em>heal</em> to your spell collection. A harming font does the same for the <em>@Compendium[pf2e.spells-srd.Harm]{Harm}</em> spell. As a specialist wizard, you prepare one spell per level from your specialty school, which also aren't added to your spell collection.</p>\n<h3>HEIGHTENING SPELLS</h3>\n<p>Once you gain 2nd-level spells, you can heighten any spell in your spell collection to any level you can cast,similar to a spontaneous spellcaster's signature spells. The only restriction is that you must select at least one 1st-level spell for your collection each time you prepare, ensuring that you can use all your spell slots each day.</p>\n<h3>ADJUDICATING CLASS FEATS AND FEATURES</h3>\n<p>Some of your class feats or features might rely on the fact that you prepare spells in spell slots. While some class feats might no longer work or be necessary with the flexible spellcaster archetype, in many cases you can make a simple replacement and continue using the class feat. The following class feats simply require replacing \"a spell you have prepared\" or \"a prepared spell\" for \"a spell in your collection\" or \"a spell slot.\" For example, in @Compendium[pf2e.feats-srd.Counterspell (Prepared)]{Counterspell}, you'd replace \"a spell you have prepared\" in the trigger for \"a spell in your collection\" and \"expend a prepared spell\" for \"expend a spell slot.\" Similarly, in @Compendium[pf2e.classfeatures.Arcane Bond]{Arcane Bond}, you'd replace \"cast one spell you prepared today and already cast\" with \"cast one spell in your collection you've already cast today.\"</p>\n<p>The Counterspell and @Compendium[pf2e.feats-srd.Leyline Conduit]{Leyline Conduit} feats in the Core Rulebook need these substitutions, as does @Compendium[pf2e.feats-srd.Form Retention]{Form Retention} from the Advanced Player's Guide. @Compendium[pf2e.feats-srd.Spell Mastery]{Spell Mastery} provides additional restricted spells, like divine font or specialist spells; you can take it, but it doesn't add to your collection and works like normal prepared spells.</p>\n<h3>DISALLOWED FEATS</h3>\n<p>The following feats from the Core Rulebook aren't available for a flexible spellcaster: @Compendium[pf2e.feats-srd.Call of the Wild]{Call of the Wild}, @Compendium[pf2e.feats-srd.Clever Counterspell]{Clever Counterspell}, @Compendium[pf2e.feats-srd.Infinite Possibilities]{Infinite Possibilities}, @Compendium[pf2e.feats-srd.Reprepare Spell]{Reprepare Spell}, and @Compendium[pf2e.feats-srd.Spell Combination]{Spell Combination}. The disallowed feats from the Advanced Player's Guide are as follows: @Compendium[pf2e.feats-srd.Elemental Summons]{Elemental Summons}, @Compendium[pf2e.feats-srd.Miraculous Possibility]{Miraculous Possibility}, @Compendium[pf2e.feats-srd.Rites Of Convocation]{Rites Of Convocation}, and @Compendium[pf2e.feats-srd.Rites Of Transfiguration]{Rites Of Transfiguration}.</p>\n<hr />\n<h3><strong>Flexible Spellcaster Spells Per Day</strong></h3>\n<table class=\"pf2-table\" style=\"width: 651px;\">\n<thead>\n<tr>\n<th>Your Level</th>\n<th>Cantrips</th>\n<th>1st</th>\n<th>2nd</th>\n<th>3rd</th>\n<th>4th</th>\n<th>5th</th>\n<th>6th</th>\n<th>7th</th>\n<th>8th</th>\n<th>9th</th>\n<th>10th</th>\n</tr>\n</thead>\n<tbody>\n<tr>\n<td>1</td>\n<td>3</td>\n<td>2</td>\n<td>-</td>\n<td>-</td>\n<td>-</td>\n<td>-</td>\n<td>-</td>\n<td>-</td>\n<td>-</td>\n<td>-</td>\n<td>-</td>\n</tr>\n<tr>\n<td>2</td>\n<td>4</td>\n<td>2</td>\n<td>-</td>\n<td>-</td>\n<td>-</td>\n<td>-</td>\n<td>-</td>\n<td>-</td>\n<td>-</td>\n<td>-</td>\n<td>-</td>\n</tr>\n<tr>\n<td>3</td>\n<td>4</td>\n<td>2</td>\n<td>2</td>\n<td>-</td>\n<td>-</td>\n<td>-</td>\n<td>-</td>\n<td>-</td>\n<td>-</td>\n<td>-</td>\n<td>-</td>\n</tr>\n<tr>\n<td>4</td>\n<td>5</td>\n<td>2</td>\n<td>2</td>\n<td>-</td>\n<td>-</td>\n<td>-</td>\n<td>-</td>\n<td>-</td>\n<td>-</td>\n<td>-</td>\n<td>-</td>\n</tr>\n<tr>\n<td>5</td>\n<td>5</td>\n<td>2</td>\n<td>2</td>\n<td>2</td>\n<td>-</td>\n<td>-</td>\n<td>-</td>\n<td>-</td>\n<td>-</td>\n<td>-</td>\n<td>-</td>\n</tr>\n<tr>\n<td>6</td>\n<td>5</td>\n<td>2</td>\n<td>2</td>\n<td>2</td>\n<td>-</td>\n<td>-</td>\n<td>-</td>\n<td>-</td>\n<td>-</td>\n<td>-</td>\n<td>-</td>\n</tr>\n<tr>\n<td>7</td>\n<td>5</td>\n<td>2</td>\n<td>2</td>\n<td>2</td>\n<td>2</td>\n<td>-</td>\n<td>-</td>\n<td>-</td>\n<td>-</td>\n<td>-</td>\n<td>-</td>\n</tr>\n<tr>\n<td>8</td>\n<td>5</td>\n<td>2</td>\n<td>2</td>\n<td>2</td>\n<td>2</td>\n<td>-</td>\n<td>-</td>\n<td>-</td>\n<td>-</td>\n<td>-</td>\n<td>-</td>\n</tr>\n<tr>\n<td>9</td>\n<td>5</td>\n<td>2</td>\n<td>2</td>\n<td>2</td>\n<td>2</td>\n<td>2</td>\n<td>-</td>\n<td>-</td>\n<td>-</td>\n<td>-</td>\n<td>-</td>\n</tr>\n<tr>\n<td>10</td>\n<td>5</td>\n<td>2</td>\n<td>2</td>\n<td>2</td>\n<td>2</td>\n<td>2</td>\n<td>-</td>\n<td>-</td>\n<td>-</td>\n<td>-</td>\n<td>-</td>\n</tr>\n<tr>\n<td>11</td>\n<td>5</td>\n<td>2</td>\n<td>2</td>\n<td>2</td>\n<td>2</td>\n<td>2</td>\n<td>2</td>\n<td>-</td>\n<td>-</td>\n<td>-</td>\n<td>-</td>\n</tr>\n<tr>\n<td>12</td>\n<td>5</td>\n<td>2</td>\n<td>2</td>\n<td>2</td>\n<td>2</td>\n<td>2</td>\n<td>2</td>\n<td>-</td>\n<td>-</td>\n<td>-</td>\n<td>-</td>\n</tr>\n<tr>\n<td>13</td>\n<td>5</td>\n<td>2</td>\n<td>2</td>\n<td>2</td>\n<td>2</td>\n<td>2</td>\n<td>2</td>\n<td>2</td>\n<td>-</td>\n<td>-</td>\n<td>-</td>\n</tr>\n<tr>\n<td>14</td>\n<td>5</td>\n<td>2</td>\n<td>2</td>\n<td>2</td>\n<td>2</td>\n<td>2</td>\n<td>2</td>\n<td>2</td>\n<td>-</td>\n<td>-</td>\n<td>-</td>\n</tr>\n<tr>\n<td>15</td>\n<td>5</td>\n<td>2</td>\n<td>2</td>\n<td>2</td>\n<td>2</td>\n<td>2</td>\n<td>2</td>\n<td>2</td>\n<td>2</td>\n<td>-</td>\n<td>-</td>\n</tr>\n<tr>\n<td>16</td>\n<td>5</td>\n<td>2</td>\n<td>2</td>\n<td>2</td>\n<td>2</td>\n<td>2</td>\n<td>2</td>\n<td>2</td>\n<td>2</td>\n<td>-</td>\n<td>-</td>\n</tr>\n<tr>\n<td>17</td>\n<td>5</td>\n<td>2</td>\n<td>2</td>\n<td>2</td>\n<td>2</td>\n<td>2</td>\n<td>2</td>\n<td>2</td>\n<td>2</td>\n<td>2</td>\n<td>-</td>\n</tr>\n<tr>\n<td>18</td>\n<td>5</td>\n<td>2</td>\n<td>2</td>\n<td>2</td>\n<td>2</td>\n<td>2</td>\n<td>2</td>\n<td>2</td>\n<td>2</td>\n<td>2</td>\n<td>-</td>\n</tr>\n<tr>\n<td>19</td>\n<td>5</td>\n<td>2</td>\n<td>2</td>\n<td>2</td>\n<td>2</td>\n<td>2</td>\n<td>2</td>\n<td>2</td>\n<td>2</td>\n<td>2</td>\n<td>*</td>\n</tr>\n<tr>\n<td>20</td>\n<td>5</td>\n<td>2</td>\n<td>2</td>\n<td>2</td>\n<td>2</td>\n<td>2</td>\n<td>2</td>\n<td>2</td>\n<td>2</td>\n<td>2</td>\n<td>*</td>\n</tr>\n<tr>\n<td style=\"color: white; width: 120px; background-color: #522e2c; text-align: center; height: 25px;\" colspan=\"12\">* Your class most likely has a class feature that gives you a single 10th level spell that works a bit differently from other slots. If so, flexible spellcaster doesn't change the way that spell works.</td>\n</tr>\n</tbody>\n</table>"
        },
        "featType": {
            "value": "classfeature"
        },
        "level": {
            "value": 1
        },
        "location": "",
        "prerequisites": {
            "value": [
                {
                    "value": "You must have a class, such as clerics, druids, witches, and wizards, that prepares spells in spell slots using the same number of prepared spells per day."
                }
            ]
        },
        "rules": [],
        "source": {
            "value": ""
        },
        "traits": {
            "custom": "",
            "rarity": {
                "value": "common"
            },
            "value": []
        }
    },
    "effects": [],
    "flags": {},
    "img": "systems/pf2e/icons/default-icons/feat.svg",
    "name": "Flexible Spell Preparation",
    "type": "feat"
}
