{
    "_id": "dxUbA1dUEcVHnU5s",
    "data": {
        "actionCategory": {
            "value": "interaction"
        },
        "actionType": {
            "value": "free"
        },
        "actions": {
            "value": null
        },
        "description": {
            "value": "<p><strong>Trigger</strong> Your turn begins.</p>\n<hr />\n<p>You can use unstable clockwork devices in your innovation to push your invention to act more quickly. You are @Compendium[pf2e.conditionitems.Quickened]{Quickened} for this turn. How you can use the extra action depends on your innovation.</p>\n<ul>\n<li><strong>Armor</strong> You can use the extra action to Step, Stride, or use another movement action granted by your innovation (such as Swim if you have the Diving Armor feat).</li>\n<li><strong>Construct</strong> You can use the extra action to Command your construct innovation (or to provide 1 of the actions if you spend 2 actions to Command your construct).</li>\n<li><strong>Weapon</strong> You can use the extra action to Strike with your innovation or Reload your innovation.</li>\n</ul>"
        },
        "featType": {
            "value": "class"
        },
        "level": {
            "value": 6
        },
        "location": "",
        "prerequisites": {
            "value": [
                {
                    "value": "armor, construct, or weapon innovation"
                }
            ]
        },
        "rules": [],
        "source": {
            "value": ""
        },
        "traits": {
            "custom": "",
            "rarity": {
                "value": "common"
            },
            "value": [
                "inventor",
                "manipulate",
                "unstable"
            ]
        }
    },
    "effects": [],
    "flags": {},
    "img": "systems/pf2e/icons/default-icons/feats.webp",
    "name": "Clockwork Celerity",
    "type": "feat"
}
