{
    "_id": "xZFT5JdEvDi7q467",
    "data": {
        "MAP": {
            "value": ""
        },
        "baseItem": "alchemical-bomb",
        "bonus": {
            "value": 0
        },
        "bonusDamage": {
            "value": null
        },
        "brokenThreshold": {
            "value": 0
        },
        "bulkCapacity": {
            "value": ""
        },
        "category": "martial",
        "collapsed": {
            "value": false
        },
        "containerId": {
            "value": ""
        },
        "damage": {
            "damageType": "fire",
            "dice": 1,
            "die": "d6",
            "value": ""
        },
        "description": {
            "value": "<p>A dwarven daisy is a string of dozens of firecrackers that create tiny, loud explosions. The string ends with a short, wrapped fuse. Pulling off the wrapping in a quick motion lights the fuse and is done as part of the action to Strike. A dwarven daisy deals the listed fire damage and splash damage. A dwarven daisy also has a chance to dazzle its target. A creature struck by a dwarven daisy must succeed at a <span data-pf2-check=\"fortitude\" data-pf2-traits=\"alchemical,bomb,consumable,fire,splash,damaging-effect\" data-pf2-label=\"Lesser Dwarven Daisy DC\" data-pf2-dc=\"16\" data-pf2-show-dc=\"all\">Fortitude</span> save or become @Compendium[pf2e.conditionitems.Dazzled]{Dazzled} for 1 round.</p>\n<hr />\n<p><strong>Activate</strong> <span class=\"pf2-icon\">A</span> Strike</p>\n<p>The firework deals 1d6 fire damage and 1 fire splash damage. The DC is 16.</p>"
        },
        "equipped": {
            "value": false
        },
        "equippedBulk": {
            "value": ""
        },
        "group": "bomb",
        "hands": {
            "value": ""
        },
        "hardness": {
            "value": 0
        },
        "hp": {
            "value": 0
        },
        "identification": {
            "misidentified": {},
            "status": "identified",
            "unidentified": {
                "data": {
                    "description": {
                        "value": ""
                    }
                },
                "img": "",
                "name": ""
            }
        },
        "invested": {
            "value": false
        },
        "level": {
            "value": 1
        },
        "maxHp": {
            "value": 0
        },
        "negateBulk": {
            "value": "0"
        },
        "potencyRune": {
            "value": null
        },
        "preciousMaterial": {
            "value": ""
        },
        "preciousMaterialGrade": {
            "value": ""
        },
        "price": {
            "value": "6 gp"
        },
        "property1": {
            "critDamage": "",
            "critDamageType": "",
            "critDice": null,
            "critDie": "",
            "criticalConditionType": "",
            "criticalConditionValue": null,
            "damageType": "",
            "dice": null,
            "die": "",
            "strikeConditionType": "",
            "strikeConditionValue": null,
            "value": ""
        },
        "propertyRune1": {
            "value": ""
        },
        "propertyRune2": {
            "value": ""
        },
        "propertyRune3": {
            "value": ""
        },
        "propertyRune4": {
            "value": ""
        },
        "quantity": {
            "value": 1
        },
        "range": 20,
        "reload": {
            "value": "1"
        },
        "rules": [
            {
                "key": "Note",
                "selector": "{item|_id}-damage",
                "text": "<p class='compact-text'><strong>Effect:</strong> Target must succeed at a <span data-pf2-saving-throw=\"fortitude\" data-pf2-traits=\"alchemical,bomb,consumable,fire,splash,damaging-effect\" data-pf2-label=\"Lesser Dwarven Daisy DC\" data-pf2-dc=\"16\" data-pf2-show-dc=\"all\">Fortitude</span> save or become @Compendium[pf2e.conditionitems.Dazzled]{Dazzled} for 1 round.</p>"
            }
        ],
        "size": {
            "value": "med"
        },
        "source": {
            "value": "Pathfinder Society Quest #5: The Dragon Who Stole Evoking Day"
        },
        "splashDamage": {
            "value": 1
        },
        "stackGroup": {
            "value": ""
        },
        "strikingRune": {
            "value": ""
        },
        "traits": {
            "custom": "",
            "rarity": {
                "value": "uncommon"
            },
            "value": [
                "alchemical",
                "bomb",
                "consumable",
                "fire",
                "splash"
            ]
        },
        "usage": {
            "value": "held-in-one-hand"
        },
        "weight": {
            "value": "L"
        }
    },
    "effects": [],
    "flags": {},
    "img": "systems/pf2e/icons/equipment/consumables/ammunition/dwarven-daisy.webp",
    "name": "Dwarven Daisy (Lesser)",
    "type": "weapon"
}
