{
    "_id": "zNcR1B6R6clmiFLM",
    "content": "<p>Play at the start of your turn.</p>\n<hr />\n<p>Select one untrained skill. You are trained in that skill until the end of your next turn. If you use that skill before the end of your next turn and succeed at your skill check, you keep this benefit until the end of the combat, or for 1 minute if not in combat.</p>",
    "flags": {},
    "name": "Daring Attempt",
    "permission": {
        "default": 0
    }
}
