{
    "_id": "fT37dtsByEIc3glC",
    "data": {
        "actionCategory": {
            "value": ""
        },
        "actionType": {
            "value": "passive"
        },
        "actions": {
            "value": null
        },
        "description": {
            "value": "<p>Scales grow across your body, protecting you against physical and magical threats. When you're unarmored, the scales give you a +2 status bonus to AC with a Dexterity cap of +2. Your resistance from Dragon Disciple Dedication increases to 3 + half your level.</p>"
        },
        "featType": {
            "value": "archetype"
        },
        "level": {
            "value": 4
        },
        "location": "",
        "prerequisites": {
            "value": [
                {
                    "value": "Dragon Disciple Dedication"
                }
            ]
        },
        "rules": [
            {
                "key": "FlatModifier",
                "predicate": {
                    "not": [
                        "self:armored"
                    ]
                },
                "selector": "ac",
                "type": "status",
                "value": 2
            },
            {
                "key": "DexterityModifierCap",
                "predicate": {
                    "not": [
                        "self:armored"
                    ]
                },
                "value": 2
            }
        ],
        "source": {
            "value": "Pathfinder Advanced Player's Guide"
        },
        "traits": {
            "custom": "",
            "rarity": {
                "value": "common"
            },
            "value": [
                "archetype"
            ]
        }
    },
    "effects": [],
    "flags": {},
    "img": "systems/pf2e/icons/features/feats/feats.webp",
    "name": "Scales Of The Dragon",
    "type": "feat"
}
