{
    "_id": "1xTQ3C9aySvCCPXw",
    "content": "<table class=\"pf2-table\">\n<thead>\n<tr>\n<th>\n<h3><strong>Name</strong></h3>\n</th>\n<th>\n<h3><strong>Crit Effect</strong></h3>\n</th>\n<th>\n<h3><strong>Type</strong></h3>\n</th>\n</tr>\n</thead>\n<tbody>\n<tr>\n<td>\n<h3>Thunder Strike</h3>\n</td>\n<td>\n<h3>The target is deafened until healed.</h3>\n</td>\n<td>\n<h3>Bludgeoning</h3>\n</td>\n</tr>\n<tr>\n<td>\n<h3>Nailed in Place</h3>\n</td>\n<td>\n<h3>As the bow critical specialization effect. If this is a melee weapon, you must drop the weapon to gain this effect. If this attack already has that effect, the Athletics check to pull free is DC 20 instead of DC 10.</h3>\n</td>\n<td>\n<h3>Piercing</h3>\n</td>\n</tr>\n<tr>\n<td>\n<h3>Decapitation</h3>\n</td>\n<td>\n<h3>Triple damage. The target must succeed at a Fortitude save or die.</h3>\n</td>\n<td>\n<h3>Slashing</h3>\n</td>\n</tr>\n<tr>\n<td>\n<h3>Returning Spell</h3>\n</td>\n<td>\n<h3>If a spell attack, the spell or spell slot is not expended.</h3>\n</td>\n<td>\n<h3>Bomb or Spell</h3>\n</td>\n</tr>\n</tbody>\n</table>\n<h3 style=\"text-align: left;\"> </h3>",
    "flags": {},
    "name": "Critical Hit Deck #35",
    "permission": {
        "default": 0
    }
}
