{
    "_id": "1Eceqc6zbMj2x0q9",
    "data": {
        "actionCategory": {
            "value": ""
        },
        "actionType": {
            "value": "passive"
        },
        "actions": {
            "value": null
        },
        "description": {
            "value": "<p>You've mastered the preparation of many types of food and drink. You gain a +1 circumstance bonus to checks to Craft food and drink, including potions. If you are a master in one of the prerequisite skills, this bonus increases to +2.</p>"
        },
        "featType": {
            "value": "skill"
        },
        "level": {
            "value": 1
        },
        "location": "",
        "prerequisites": {
            "value": [
                {
                    "value": "trained in Alcohol Lore, Cooking Lore, or Crafting"
                }
            ]
        },
        "rules": [
            {
                "key": "FlatModifier",
                "label": "Seasoned (craft food, drink & potions)",
                "predicate": {
                    "all": [
                        "action:craft"
                    ],
                    "any": [
                        "food",
                        "drink",
                        "potion"
                    ]
                },
                "selector": "crafting",
                "type": "circumstance",
                "value": {
                    "brackets": [
                        {
                            "end": 4,
                            "start": 3,
                            "value": 2
                        },
                        {
                            "end": 2,
                            "start": 1,
                            "value": 1
                        }
                    ],
                    "field": "actor|data.skills.cra.rank"
                }
            }
        ],
        "source": {
            "value": "Pathfinder Advanced Player's Guide"
        },
        "traits": {
            "custom": "",
            "rarity": {
                "value": "common"
            },
            "value": [
                "general",
                "skill"
            ]
        }
    },
    "effects": [],
    "flags": {},
    "img": "systems/pf2e/icons/features/feats/feats.webp",
    "name": "Seasoned",
    "type": "feat"
}
