{
    "_id": "rbiMK71SvGZGRLJ1",
    "data": {
        "actionCategory": {
            "value": "offensive"
        },
        "actionType": {
            "value": "action"
        },
        "actions": {
            "value": 1
        },
        "description": {
            "value": "<p><strong>Requirements</strong> You are unarmored.</p>\n<hr />\n<p>You enter the stance of an enraged phoenix, holding your fingers as rigid as deadly talons while moving with quick, flickering gestures that flicker with dancing flames. The only Strikes you can make are fire talon Strikes. These deal 1d4 fire damage; are in the brawling group; and have the agile, finesse, fire, nonlethal, and unarmed traits.</p>\n<p>While in Rain of Embers Stance, you gain a +1 status bonus to AC and fire resistance equal to half your level (minimum 1).</p>\n<p>@Compendium[pf2e.feat-effects.Stance: Rain of Embers Stance]{Stance: Rain of Embers Stance}</p>"
        },
        "featType": {
            "value": "class"
        },
        "level": {
            "value": 1
        },
        "location": "",
        "prerequisites": {
            "value": []
        },
        "rules": [],
        "source": {
            "value": "Pathfinder Lost Omens: Pathfinder Society Guide"
        },
        "traits": {
            "custom": "",
            "rarity": {
                "value": "rare"
            },
            "selected": {
                "monk": "Monk",
                "stance": "Stance"
            },
            "value": [
                "fire",
                "monk",
                "stance"
            ]
        }
    },
    "effects": [],
    "flags": {},
    "img": "systems/pf2e/icons/features/feats/feats.webp",
    "name": "Rain of Embers Stance",
    "type": "feat"
}
