{
    "_id": "EdVMwFRNV1LX1VWh",
    "data": {
        "actionCategory": {
            "value": ""
        },
        "actionType": {
            "value": "action"
        },
        "actions": {
            "value": 2
        },
        "description": {
            "value": "<p>You can balance on your toes to step carefully over obstructions.</p>\n<p>You @Compendium[pf2e.actionspf2e.Stride]{Stride} and then @Compendium[pf2e.actionspf2e.Step]{Step}, or Step and then Stride, ignoring difficult terrain during this movement.</p>"
        },
        "featType": {
            "value": "ancestry"
        },
        "level": {
            "value": 5
        },
        "prerequisites": {
            "value": []
        },
        "rules": [],
        "source": {
            "value": "Pathfinder Advanced Player's Guide"
        },
        "traits": {
            "custom": "",
            "rarity": {
                "value": "common"
            },
            "value": [
                "catfolk"
            ]
        }
    },
    "effects": [],
    "flags": {},
    "img": "systems/pf2e/icons/features/feats/feats.webp",
    "name": "Light Paws",
    "type": "feat"
}
