{
    "_id": "F3ZBkDEWZ24NOR2j",
    "data": {
        "actionCategory": {
            "value": ""
        },
        "actionType": {
            "value": "reaction"
        },
        "actions": {
            "value": null
        },
        "description": {
            "value": "<p><strong>Trigger</strong> An opponent critically hits you with a melee attack.</p>\n<hr />\n<p>You quickly whirl your blade, trying to deflect enough momentum to avoid the worst of the attack. Attempt a DC 16 flat check. If you succeed, the attack becomes a normal hit, instead of a critical hit.</p>"
        },
        "featType": {
            "value": "archetype"
        },
        "level": {
            "value": 10
        },
        "prerequisites": {
            "value": [
                {
                    "value": "Aldori Duelist Dedication"
                }
            ]
        },
        "rules": [],
        "source": {
            "value": "Pathfinder Lost Omens: World Guide"
        },
        "traits": {
            "custom": "",
            "rarity": {
                "value": "common"
            },
            "value": [
                "archetype"
            ]
        }
    },
    "effects": [],
    "flags": {},
    "img": "systems/pf2e/icons/features/feats/feats.webp",
    "name": "Saving Slash",
    "type": "feat"
}
