{
    "_id": "jmW8aZ5JGH3m6dL6",
    "data": {
        "actionCategory": {
            "value": ""
        },
        "actionType": {
            "value": "passive"
        },
        "actions": {
            "value": null
        },
        "description": {
            "value": "<p>You're adept at making contact with other ysoki. When you arrive at a new settlement, you automatically find the nearest ratfolk enclave by spending 1 day of downtime searching, provided one exists and its members aren't actively hiding from you. Once you've made contact, you gain a +1 circumstance bonus to Gather Information and Earn Income in the settlement.</p>"
        },
        "featType": {
            "value": "ancestry"
        },
        "level": {
            "value": 1
        },
        "location": "",
        "prerequisites": {
            "value": []
        },
        "rules": [],
        "source": {
            "value": "Pathfinder Lost Omens: Ancestry Guide"
        },
        "traits": {
            "custom": "",
            "rarity": {
                "value": "common"
            },
            "value": [
                "downtime",
                "ratfolk"
            ]
        }
    },
    "effects": [],
    "flags": {},
    "img": "systems/pf2e/icons/features/feats/feats.webp",
    "name": "Warren Friend",
    "type": "feat"
}
