{
    "_id": "FB7WRjQkNnCROiH8",
    "content": "<p>Play during your turn.</p>\n<hr />\n<p>Until the start of your next turn, each time an enemy would leave a space adjacent to you while using a move action, it must succeed at an Acrobatics or Athletics check against your Fortitude DC or the move action is disrupted.</p>",
    "flags": {},
    "name": "Hold the Line",
    "permission": {
        "default": 0
    }
}
