{
    "_id": "SlXLsuxBHeUyUPII",
    "data": {
        "actionCategory": {
            "value": ""
        },
        "actionType": {
            "value": "passive"
        },
        "actions": {
            "value": null
        },
        "description": {
            "value": "<p>Your dragon wings are now a permanent part of your body, giving you a fly Speed equal to your Speed. If you spend 1 Focus Point to cast <em>@Compendium[pf2e.spells-srd.Dragon Wings]{Dragon Wings}</em>, your fly Speed increases to 90 feet for the duration, unless your Speed is faster, and you gain the effects of <em>@Compendium[pf2e.spells-srd.Dragon Claws]{Dragon Claws}</em> for the duration.</p>"
        },
        "featType": {
            "value": "archetype"
        },
        "level": {
            "value": 18
        },
        "location": "",
        "prerequisites": {
            "value": [
                {
                    "value": "Dragon Disciple Dedication"
                },
                {
                    "value": "dragon wings sorcerer bloodline spell"
                }
            ]
        },
        "rules": [],
        "source": {
            "value": "Pathfinder #171: Hurricane's Howl"
        },
        "traits": {
            "custom": "",
            "rarity": {
                "value": "uncommon"
            },
            "value": []
        }
    },
    "effects": [],
    "flags": {},
    "img": "systems/pf2e/icons/default-icons/feats.webp",
    "name": "Mighty Wings",
    "type": "feat"
}
