{
    "_id": "FaCIC09UZubaw2LO",
    "content": "<p>Play after you end your movement adjacent to a creature that is larger than you.</p>\n<hr />\n<p>Move to the opposite side of that creature. This movement doesn't trigger any reactions based on movement.</p>",
    "flags": {},
    "name": "Tumble Through",
    "permission": {
        "default": 0
    }
}
