{
    "_id": "4Zj71naHbY6O9ggP",
    "data": {
        "description": {
            "value": "<p>@Compendium[pf2e.feats-srd.Bristle]{Bristle}</p>\n<p>You curl into a posture that splays out your bone spines. You gain a +1 circumstance bonus to AC until the start of your next turn.</p>\n<hr />\n<p><strong>Special</strong> If you have the @Compendium[pf2e.actionspf2e.Barbed Quills]{Barbed Quills} reaction or a quills unarmed attack, each gains a +1 circumstance bonus to damage rolls until the start of your next turn.</p>"
        },
        "duration": {
            "expiry": "turn-start",
            "sustained": false,
            "unit": "rounds",
            "value": 1
        },
        "level": {
            "value": 1
        },
        "rules": [
            {
                "key": "FlatModifier",
                "label": "Bristle",
                "selector": "ac",
                "type": "circumstance",
                "value": 1
            },
            {
                "key": "FlatModifier",
                "label": "Bristle",
                "predicate": {
                    "all": [
                        "shisk-quills"
                    ]
                },
                "selector": "damage",
                "type": "circumstance",
                "value": 1
            }
        ],
        "source": {
            "value": ""
        },
        "start": {
            "initiative": null,
            "value": 0
        },
        "target": null,
        "tokenIcon": {
            "show": true
        },
        "traits": {
            "custom": "",
            "rarity": {
                "value": "common"
            },
            "value": []
        }
    },
    "effects": [],
    "flags": {},
    "img": "systems/pf2e/icons/default-icons/effect.svg",
    "name": "Effect: Bristle",
    "type": "effect"
}
