{
    "_id": "QnuL1UEot8ptWNb1",
    "data": {
        "baseItem": null,
        "brokenThreshold": {
            "value": 0
        },
        "bulkCapacity": {
            "value": ""
        },
        "collapsed": {
            "value": false
        },
        "containerId": {
            "value": null
        },
        "description": {
            "value": "<p>This lockpick houses a small compartment containing many smaller picks and other miniature tools. The lockpick itself is surprisingly malleable, belying the components within. An almost-impossible number of other tools are hidden in the compartment, including an entire set of @Compendium[pf2e.equipment-srd.Thieves' Tools (Infiltrator)]{Infiltrator Thieves' Tools} and any @Compendium[pf2e.equipment-srd.Thieves' Tools (Infiltrator Picks)]{Replacement Picks (Infiltrator Picks)}, an @Compendium[pf2e.equipment-srd.Disguise Kit (Elite)]{Elite Disguise Kit} and any @Compendium[pf2e.equipment-srd.Disguise Kit (Elite Cosmetics)]{Replacement Cosmetics (Elite)}, and an @Compendium[pf2e.equipment-srd.Climbing Kit (Extreme)]{Extreme Climber's Kit}, all while still somehow remaining only light Bulk. This makes the encompassing lockpick a favorite discreet option for rogues infiltrating high society events, as formal wear generally has few pockets and only allows a character to wear a single tool kit of light Bulk.</p>"
        },
        "equipped": {
            "value": false
        },
        "equippedBulk": {
            "value": ""
        },
        "hardness": {
            "value": 0
        },
        "hp": {
            "value": 0
        },
        "identification": {
            "misidentified": {},
            "status": "identified",
            "unidentified": {
                "data": {
                    "description": {
                        "value": ""
                    }
                },
                "img": "",
                "name": ""
            }
        },
        "invested": {
            "value": null
        },
        "level": {
            "value": 8
        },
        "maxHp": {
            "value": 0
        },
        "negateBulk": {
            "value": "0"
        },
        "preciousMaterial": {
            "value": null
        },
        "preciousMaterialGrade": {
            "value": null
        },
        "price": {
            "value": "450 gp"
        },
        "quantity": {
            "value": 1
        },
        "rules": [],
        "size": {
            "value": "med"
        },
        "source": {
            "value": "Pathfinder Lost Omens: The Grand Bazaar"
        },
        "stackGroup": {
            "value": ""
        },
        "traits": {
            "custom": "",
            "rarity": {
                "value": "uncommon"
            },
            "value": [
                "conjuration",
                "extradimensional",
                "magical"
            ]
        },
        "usage": {
            "value": "held-in-one-hand"
        },
        "weight": {
            "value": "L"
        }
    },
    "effects": [],
    "flags": {},
    "img": "systems/pf2e/icons/default-icons/equipment.svg",
    "name": "Encompassing Lockpick",
    "type": "equipment"
}
