{
    "_id": "8CLTXqyjdzEMKnZC",
    "data": {
        "boosts": {
            "0": {
                "value": [
                    "dex",
                    "str"
                ]
            },
            "1": {
                "value": [
                    "cha",
                    "con",
                    "dex",
                    "int",
                    "str",
                    "wis"
                ]
            }
        },
        "description": {
            "value": "<p>You served as a crewmate aboard a military vessel or pirate ship and were responsible for the use and maintenance of the ship's cannons. A strong back and quick reflexes were equally important to you in your duties, and you know your way around explosives and the dangers that lie therein. These skills serve you well in your new life as an adventurer, as compared to the weight of a cannon, a gear load that makes your allies blanche just makes you laugh instead.</p>\n<p>Choose two ability boosts. One boost must be to <strong>Dexterity</strong> or <strong>Strength</strong>, and one is a free ability boost.</p>\n<p>You're trained in the Athletics skill and the Warfare Lore skill. You gain the @Compendium[pf2e.feats-srd.Hefty Hauler]{Hefty Hauler} skill feat.</p>"
        },
        "items": {
            "ab9pz": {
                "id": "C0Tcelg3BAPhML6J",
                "img": "systems/pf2e/icons/features/feats/feats.webp",
                "level": 1,
                "name": "Hefty Hauler",
                "pack": "pf2e.feats-srd"
            }
        },
        "rules": [],
        "source": {
            "value": ""
        },
        "trainedLore": "Warfare",
        "trainedSkills": {
            "custom": "",
            "value": [
                "ath"
            ]
        },
        "traits": {
            "custom": "",
            "rarity": {
                "value": "common"
            },
            "value": []
        }
    },
    "effects": [],
    "flags": {},
    "img": "systems/pf2e/icons/default-icons/background.svg",
    "name": "Cannoneer",
    "type": "background"
}
