{
    "_id": "Kl1O0WK37KMTumv1",
    "data": {
        "actionCategory": {
            "value": ""
        },
        "actionType": {
            "value": "reaction"
        },
        "actions": {
            "value": null
        },
        "description": {
            "value": "<p><strong>Frequency</strong> once per hour</p>\n<p><strong>Trigger</strong> You successfully use Stealth to @Compendium[pf2e.actionspf2e.Hide]{Hide} and become @Compendium[pf2e.conditionitems.Hidden]{Hidden} from all of your current foes, or use Stealth to @Compendium[pf2e.actionspf2e.Sneak]{Sneak} and become @Compendium[pf2e.conditionitems.Undetected]{Undetected} to all your current foes.</p>\n<hr />\n<p>When you put your mind to slipping out of sight, you disappear completely.</p>\n<p>You become @Compendium[pf2e.conditionitems.Invisible]{Invisible} for 1 minute, even if you use a hostile action. Not even <em>@Compendium[pf2e.spells-srd.Glitterdust]{Glitterdust}</em>, <em>@Compendium[pf2e.spells-srd.See Invisibility]{See Invisibility}</em>, or similar effects can reveal you, though creatures can still use the @Compendium[pf2e.actionspf2e.Seek]{Seek} action to locate you as normal.</p>"
        },
        "featType": {
            "value": "class"
        },
        "level": {
            "value": 20
        },
        "location": "",
        "prerequisites": {
            "value": [
                {
                    "value": "legendary in Stealth"
                }
            ]
        },
        "rules": [],
        "source": {
            "value": "Pathfinder Core Rulebook"
        },
        "traits": {
            "custom": "",
            "rarity": {
                "value": "common"
            },
            "value": [
                "rogue"
            ]
        }
    },
    "effects": [],
    "flags": {},
    "img": "systems/pf2e/icons/features/feats/feats.webp",
    "name": "Hidden Paragon",
    "type": "feat"
}
