{
    "_id": "tY3Zg0l14CdoKPpt",
    "data": {
        "actionCategory": {
            "value": ""
        },
        "actionType": {
            "value": "passive"
        },
        "actions": {
            "value": null
        },
        "description": {
            "value": "<p>You can create extraordinary-albeit volatile-alchemical wonders, though they have an unfortunate tendency to violently explode when you use them.</p>\n<p>When you use @Compendium[pf2e.feats-srd.Quick Alchemy]{Quick Alchemy}, you can create an alchemical item from your formula book whose level is up to 2 higher than your advanced alchemy level. You can spend up to 3 additional batches of @Compendium[pf2e.classfeatures.Infused Reagents]{Infused Reagents} when creating this item to stabilize it.</p>\n<p>Upon activating the item, attempt a DC 10 flat check; for every additional batch of @Compendium[pf2e.classfeatures.Infused Reagents]{Infused Reagents} you spent to create the item, reduce this DC by 2. On a success, the item functions normally. On a failure, the item explodes, dealing force damage to the user equal to twice the item's level (doubled on a critical failure).</p>"
        },
        "featType": {
            "value": "class"
        },
        "level": {
            "value": 10
        },
        "prerequisites": {
            "value": []
        },
        "rules": [],
        "source": {
            "value": "Pathfinder Advanced Player's Guide"
        },
        "traits": {
            "custom": "",
            "rarity": {
                "value": "common"
            },
            "value": [
                "alchemist"
            ]
        }
    },
    "effects": [],
    "flags": {},
    "img": "systems/pf2e/icons/features/feats/feats.webp",
    "name": "Unstable Concoction",
    "type": "feat"
}
