{
    "_id": "afJCG4vC5WF5h5IB",
    "data": {
        "description": {
            "value": "<p>If the target's claw attack already deals 1d6 slashing damage, it deals 1d8 instead.</p>"
        },
        "duration": {
            "expiry": "turn-start",
            "sustained": true,
            "unit": "minutes",
            "value": 1
        },
        "level": {
            "value": 2
        },
        "rules": [
            {
                "damageType": "slashing",
                "key": "DamageDice",
                "override": {
                    "dieSize": "d8"
                },
                "selector": "claw-damage"
            }
        ],
        "source": {
            "value": "Pathfinder #171: Hurricane's Howl"
        },
        "start": {
            "initiative": null,
            "value": 0
        },
        "target": null,
        "tokenIcon": {
            "show": true
        },
        "traits": {
            "custom": "",
            "rarity": {
                "value": "common"
            },
            "value": []
        }
    },
    "effects": [],
    "flags": {},
    "img": "systems/pf2e/icons/default-icons/effect.svg",
    "name": "Spell Effect: Clawsong (Damage Increase D8)",
    "type": "effect"
}
