{
    "_id": "FJ9D4qpeRhJvjHai",
    "content": "<p><strong>Deities</strong> @Compendium[pf2e.deities.Black Butterfly]{Black Butterfly}, @Compendium[pf2e.deities.Cosmic Caravan]{Cosmic Caravan}, @Compendium[pf2e.deities.Desna]{Desna}, @Compendium[pf2e.deities.Findeladlara]{Findeladlara}, @Compendium[pf2e.deities.Luhar]{Luhar}, @Compendium[pf2e.deities.Ma'at]{Ma'at}, @Compendium[pf2e.deities.Pulura]{Pulura}, @Compendium[pf2e.deities.The Path of the Heavens]{The Path of the Heavens}</p><p><strong>Domain Spell</strong> @Compendium[pf2e.spells-srd.Zenith Star]{Zenith Star}; <strong>Advanced Domain Spell</strong> @Compendium[pf2e.spells-srd.Asterism]{Asterism}</p><p><span id=\"ctl00_MainContent_DetailedOutput\">You command the power of the stars.</span></p><p></p>",
    "flags": {},
    "name": "Star Domain",
    "permission": {
        "default": 0
    }
}
