{
    "_id": "so4v9xjBFaoJ8EQs",
    "data": {
        "actionCategory": {
            "value": ""
        },
        "actionType": {
            "value": "passive"
        },
        "actions": {
            "value": null
        },
        "description": {
            "value": "<p>Your scent is preternaturally sharp, and you can always rely on your sense of smell to help guide you when your vision is compromised. When you target a Concealed or Hidden opponent while you are raging, you reduce the DC of the flat check to 3 for a concealed target or to 9 for a hidden one.</p>"
        },
        "featType": {
            "value": "class"
        },
        "level": {
            "value": 4
        },
        "prerequisites": {
            "value": [
                {
                    "value": "Acute Scent or precise or imprecise scent"
                }
            ]
        },
        "rules": [],
        "source": {
            "value": "Pathfinder Advanced Player's Guide"
        },
        "traits": {
            "custom": "",
            "rarity": {
                "value": "common"
            },
            "value": [
                "barbarian",
                "rage"
            ]
        }
    },
    "effects": [],
    "flags": {},
    "img": "systems/pf2e/icons/features/feats/feats.webp",
    "name": "Supernatural Senses",
    "type": "feat"
}
