{
    "_id": "92lgSEPFIDLvKOCF",
    "data": {
        "description": {
            "value": "<p>Your familiar helps you perform. Whenever you attempt a Performance check, if your familiar is nearby and can act, it accompanies you with chirps, claps, or its own miniature instrument. This grants you a +1 circumstance bonus, or +2 if you're a master in Performance.</p>"
        },
        "duration": {
            "expiry": "turn-start",
            "sustained": false,
            "unit": "unlimited",
            "value": -1
        },
        "level": {
            "value": 1
        },
        "rules": [],
        "source": {
            "value": ""
        },
        "start": {
            "initiative": null,
            "value": 0
        },
        "target": null,
        "tokenIcon": {
            "show": false
        },
        "traits": {
            "custom": "",
            "rarity": {
                "value": "common"
            },
            "value": []
        }
    },
    "effects": [],
    "flags": {},
    "img": "systems/pf2e/icons/actions/Passive.webp",
    "name": "Accompanist",
    "type": "effect"
}
