{
    "_id": "sKyJDfHdKacfbNOG",
    "data": {
        "baseItem": null,
        "brokenThreshold": {
            "value": 0
        },
        "bulkCapacity": {
            "value": ""
        },
        "collapsed": {
            "value": false
        },
        "containerId": {
            "value": ""
        },
        "description": {
            "value": "<p>This delicate necklace contains bottled whispers distilled from a source on the Astral Plane rumored to be connected to the first lie ever told.</p>\n<p>While wearing the necklace, you gain a +3 item bonus to Deception checks, and you can attempt to counteract effects that would force you to tell the truth or determine whether you are lying.</p>\n<p>Success on this counteract attempt lets you ignore the effect, rather than removing the effect entirely. The counteract level is 9, with a counteract modifier of [[/r 1d20+35]].</p>\n<p><strong>Activate</strong> <span class=\"pf2-icon\">T</span> Interact, envision, command</p>\n<p><strong>Effect</strong> You unstopper the vial and release the lie, creating the effect of a <em>@Compendium[pf2e.spells-srd.Fabricated Truth]{Fabricated Truth}</em> (DC 47). The vial is emptied and can never be activated again.</p>\n<hr />\n<p><strong>Craft Requirements</strong> Supply a casting of <em>fabricated truth</em>.</p>\n<hr />\n<p>Automatically applied effects:</p>\n<ul>\n<li>+3 item bonus to Deception checks</li>\n</ul>"
        },
        "equipped": {
            "value": false
        },
        "equippedBulk": {
            "value": ""
        },
        "hardness": {
            "value": 0
        },
        "hp": {
            "value": 0
        },
        "identification": {
            "misidentified": {},
            "status": "identified",
            "unidentified": {
                "data": {
                    "description": {
                        "value": ""
                    }
                },
                "img": "",
                "name": ""
            }
        },
        "invested": {
            "value": false
        },
        "level": {
            "value": 20
        },
        "maxHp": {
            "value": 0
        },
        "negateBulk": {
            "value": "0"
        },
        "preciousMaterial": {
            "value": ""
        },
        "preciousMaterialGrade": {
            "value": ""
        },
        "price": {
            "value": "60,000 gp"
        },
        "quantity": {
            "value": 1
        },
        "rules": [
            {
                "key": "FlatModifier",
                "selector": "deception",
                "type": "item",
                "value": 3
            }
        ],
        "size": {
            "value": "med"
        },
        "source": {
            "value": "Pathfinder Core Rulebook"
        },
        "stackGroup": {
            "value": ""
        },
        "traits": {
            "custom": "",
            "rarity": {
                "value": "rare"
            },
            "value": [
                "enchantment",
                "invested",
                "magical"
            ]
        },
        "usage": {
            "value": "worn"
        },
        "weight": {
            "value": "-"
        }
    },
    "effects": [],
    "flags": {},
    "img": "systems/pf2e/icons/equipment/worn-items/other-worn-items/whisper-of-the-first-lie.webp",
    "name": "Whisper of the First Lie",
    "type": "equipment"
}
