{
    "_id": "3LLHyUz0Nabuw46L",
    "data": {
        "attributes": {
            "ac": {
                "value": 15
            },
            "hardness": 0,
            "hasHealth": true,
            "hp": {
                "details": "",
                "max": 30,
                "temp": 0,
                "tempmax": 0,
                "value": 30
            },
            "stealth": {
                "details": "(trained) to spot the pressure plates",
                "value": 8
            }
        },
        "creatureType": "",
        "details": {
            "description": "Four pressure plates beneath the floorboards activate dragon-headed fountains on either side of the room, which spray boiling water across the area between them.",
            "disable": "DC 21 Thievery (trained) to disable each pressure plate, DC 16 to jam each fountain, or DC 18 to deflect a fountain's spray",
            "isComplex": false,
            "level": {
                "value": 2
            },
            "reset": "Once a pressure plate has been activated, it must be reset manually.",
            "routine": ""
        },
        "saves": {
            "fortitude": {
                "saveDetail": "",
                "value": 8
            },
            "reflex": {
                "saveDetail": "",
                "value": 5
            },
            "will": {
                "saveDetail": "",
                "value": 0
            }
        },
        "source": {
            "value": "Pathfinder #157: Devil at the Dreaming Palace"
        },
        "statusEffects": [],
        "traits": {
            "ci": [],
            "di": {
                "custom": "",
                "selected": {},
                "value": [
                    "precision",
                    "critical-hits",
                    "object-immunities"
                ]
            },
            "dr": [],
            "dv": [],
            "rarity": {
                "value": "common"
            },
            "size": {
                "value": "med"
            },
            "traits": {
                "custom": "",
                "value": [
                    "mechanical",
                    "trap"
                ]
            }
        }
    },
    "effects": [],
    "flags": {},
    "img": "systems/pf2e/icons/default-icons/hazard.svg",
    "items": [
        {
            "_id": "IVbYmIS1u62AEFZm",
            "data": {
                "actionCategory": {
                    "value": ""
                },
                "actionType": {
                    "value": "reaction"
                },
                "actions": {
                    "value": null
                },
                "description": {
                    "value": "<p data-visibility=\"gm\"><strong>Trigger</strong> Weight is placed on one of the squares marked with \"T\" on the map, triggering a pressure plate;</p>\n<p><strong>Effect</strong> The fountains spray boiling water across their own squares and the 10-foot-by-20-foot area between them (marked with dotted lines), dealing [[/r {4d6+4}[fire]]]{4d6+4 fire damage} to any creatures in the area (<span data-pf2-check=\"reflex\" data-pf2-dc=\"22\" data-pf2-traits=\"damaging-effect,fire,water\" data-pf2-label=\"Scalding Spray DC\" data-pf2-show-dc=\"gm\">basic Reflex</span> save).</p>"
                },
                "requirements": {
                    "value": ""
                },
                "rules": [],
                "slug": null,
                "source": {
                    "value": ""
                },
                "traits": {
                    "custom": "",
                    "rarity": {
                        "value": "common"
                    },
                    "selected": {
                        "fire": "Fire",
                        "water": "Water"
                    },
                    "value": [
                        "fire",
                        "water"
                    ]
                },
                "trigger": {
                    "value": ""
                },
                "weapon": {
                    "value": ""
                }
            },
            "effects": [],
            "flags": {},
            "img": "systems/pf2e/icons/actions/Reaction.webp",
            "name": "Scalding Spray",
            "sort": 100000,
            "type": "action"
        }
    ],
    "name": "Boiling Fountains",
    "token": {
        "disposition": 0,
        "height": 1,
        "img": "systems/pf2e/icons/default-icons/hazard.svg",
        "name": "Boiling Fountains",
        "width": 1
    },
    "type": "hazard"
}
