module sm-structure

go 1.19

require (
	gorm.io/driver/mysql v1.4.7
	gorm.io/gorm v1.24.6
)

require (
	github.com/go-sql-driver/mysql v1.7.0 // indirect
	github.com/jinzhu/inflection v1.0.0 // indirect
	github.com/jinzhu/now v1.1.5 // indirect
	github.com/joho/godotenv v1.5.1 // indirect
)
