{
    "id": "49b99ff86194381bac0d69ecbc8d2700",
    "link": "",
    "description": "",
    "date": "",
    "tags": [],
    "publishedAt": "",
    "crawledAt": "",
    "domain": "",
    "netloc": "",
    "annotations": {
        "ADUs": [
            {
                "id": "T1",
                "type": "MajorClaim",
                "starts": "277",
                "ends": "331",
                "segment": "εμένα, πιστεύω ακράδαντα ότι τα διαδικτυακά μαθήματα δεν πρέπει ποτέ να αντικαθιστούν τη μάθηση στην τάξη."
            },
            {
                "id": "T2",
                "type": "MajorClaim",
                "starts": "2063",
                "ends": "2140",
                "segment": "Από τα παραπάνω, μπορούμε εύκολα να καταλήξουμε στο συμπέρασμα ότι η μάθηση στην τάξη είναι ο καλύτερος τρόπος παροχής εκπαίδευσης για αυτούς τους λόγους."
            },
            {
                "id": "T3",
                "type": "Premise",
                "starts": "462",
                "ends": "525",
                "segment": "είναι ο καλύτερος τρόπος παροχής εκπαίδευσης σε σύγκριση με τα διαδικτυακά μαθήματα."
            },
            {
                "id": "T4",
                "type": "Premise",
                "starts": "535",
                "ends": "652",
                "segment": "Στο περιβάλλον της τάξης μπορείτε να μάθετε από τους συμμαθητές σας, επειδή εάν δείτε κάποιον από τους συμμαθητές σας που έχει καλύτερη απόδοση, θα σας αναγκάσει να κάνετε την απόδοσή σας πιο καλύτερη."
            },
            {
                "id": "T5",
                "type": "Premise",
                "starts": "667",
                "ends": "858",
                "segment": "Για παράδειγμα, όταν ήμουν στην πρώτη χρονιά στο B Com, δεν ήμουν σοβαρός στη μελέτη μου, αλλά όταν είδα κάποιους φίλους μου που πήραν καλύτερους βαθμούς από εμένα, με επηρέασε και σκόπευα να κάνω καλύτερα στα μαθήματά μου."
            },
            {
                "id": "T6",
                "type": "Premise",
                "starts": "868",
                "ends": "896",
                "segment": "να κάνω καλύτερα στα μαθήματά μου."
            },
            {
                "id": "T7",
                "type": "Claim",
                "starts": "377",
                "ends": "460",
                "segment": "Παραθέτω τους λόγους μου ως εξής.",
                "stance": [
                    {
                        "id": "A1",
                        "type": "For"
                    }
                ]
            },
            {
                "id": "T8",
                "type": "Claim",
                "starts": "969",
                "ends": "1015",
                "segment": "τάξη πρέπει να ολοκληρώσετε την εργασία μελέτης εγκαίρως.",
                "stance": [
                    {
                        "id": "A2",
                        "type": "For"
                    }
                ]
            },
            {
                "id": "T9",
                "type": "Premise",
                "starts": "906",
                "ends": "967",
                "segment": "Δεύτερον, στην εκμάθηση στην τάξη πρέπει να ολοκληρώσετε την εργασία μελέτης εγκαίρως."
            },
            {
                "id": "T10",
                "type": "Premise",
                "starts": "1026",
                "ends": "1104",
                "segment": "Επιπλέον, μπορείτε να μάθετε συμμετέχοντας σε ομαδικές μελέτες πώς να επικοινωνείτε με άλλους."
            },
            {
                "id": "T11",
                "type": "Premise",
                "starts": "1106",
                "ends": "1217",
                "segment": "Σας κάνει να επικοινωνείτε και φυσικά τις δεξιότητες των ομάδων σας καλύτερα, κάτι που μπορεί να σας βοηθήσει στο μέλλον και την καριέρα σας."
            },
            {
                "id": "T12",
                "type": "Claim",
                "starts": "1522",
                "ends": "1539",
                "segment": "από οποιοδήποτε καθηγητή μπορείτε να κάνετε ερωτήσεις πρόσωπο με πρόσωπο, θα καθαρίσει τις αμφιβολίες σας.",
                "stance": [
                    {
                        "id": "A3",
                        "type": "For"
                    }
                ]
            },
            {
                "id": "T13",
                "type": "Premise",
                "starts": "1226",
                "ends": "1390",
                "segment": "Τρίτον, οι καθηγητές διαδραματίζουν ζωτικό ρόλο στη μάθηση στην τάξη, οι περισσότεροι από τους οποίους είναι ειδικοί είναι τα θέματα τους και σας βοηθούν δίνοντας πολύτιμες πληροφορίες και χρήσιμες δεξιότητες."
            },
            {
                "id": "T14",
                "type": "Premise",
                "starts": "1392",
                "ends": "1510",
                "segment": "Μπορείτε να βελτιώσετε τις δεξιότητές σας με την εργασία κάτω από οποιοδήποτε καθηγητή μπορείτε να κάνετε ερωτήσεις πρόσωπο με πρόσωπο, θα καθαρίσει τις αμφιβολίες σας."
            },
            {
                "id": "T15",
                "type": "Premise",
                "starts": "1585",
                "ends": "1833",
                "segment": "Στο αποτέλεσμα μαθαίνετε γρήγορα."
            },
            {
                "id": "T16",
                "type": "Claim",
                "starts": "1856",
                "ends": "1930",
                "segment": "IBT και σε 1 μήνα ένιωσα ότι οι γνώσεις μου στα Αγγλικά βελτιώθηκαν γρηγορότερα .",
                "stance": [
                    {
                        "id": "A4",
                        "type": "Against"
                    }
                ]
            },
            {
                "id": "T18",
                "type": "Premise",
                "starts": "1936",
                "ends": "1995",
                "segment": "Είναι αναμφισβήτητο ότι τα διαδικτυακά μαθήματα έχουν κάποια πλεονεκτήματα, ώστε να μπορούν να χρησιμοποιηθούν ως συμπληρωματικά, αλλά δεν θα μπορούσαν να υποκαταστήσουν την υπάρχουσα μάθηση στην τάξη."
            }
        ],
        "Relations": [
            {
                "id": "R1",
                "type": "supports",
                "arg1": "T4",
                "arg2": "T3"
            },
            {
                "id": "R2",
                "type": "supports",
                "arg1": "T3",
                "arg2": "T7"
            },
            {
                "id": "R3",
                "type": "supports",
                "arg1": "T5",
                "arg2": "T7"
            },
            {
                "id": "R4",
                "type": "supports",
                "arg1": "T6",
                "arg2": "T7"
            },
            {
                "id": "R5",
                "type": "supports",
                "arg1": "T11",
                "arg2": "T8"
            },
            {
                "id": "R6",
                "type": "supports",
                "arg1": "T10",
                "arg2": "T8"
            },
            {
                "id": "R7",
                "type": "supports",
                "arg1": "T9",
                "arg2": "T8"
            },
            {
                "id": "R8",
                "type": "supports",
                "arg1": "T14",
                "arg2": "T12"
            },
            {
                "id": "R9",
                "type": "supports",
                "arg1": "T13",
                "arg2": "T12"
            },
            {
                "id": "R10",
                "type": "supports",
                "arg1": "T15",
                "arg2": "T12"
            },
            {
                "id": "R11",
                "type": "attacks",
                "arg1": "T18",
                "arg2": "T16"
            }
        ]
    },
    "content": "Εκπαίδευση στην τάξη έναντι της διαδικτυακής εκπαίδευσης Υπάρχουν μερικοί άνθρωποι που πιστεύουν ότι η εξ αποστάσεως εκπαίδευση και οι διαδικτυακές τάξεις υπολογιστών πρέπει να αντικαταστήσουν την εκμάθηση στην τάξη, ενώ υπάρχουν κάποια άτομα που διαφωνούν έντονα με αυτήν την άποψη. Όσον αφορά εμένα, πιστεύω ακράδαντα ότι τα διαδικτυακά μαθήματα δεν πρέπει ποτέ να αντικαθιστούν τη μάθηση στην τάξη. Παραθέτω τους λόγους μου ως εξής. Πρώτον, η εκμάθηση στην τάξη είναι ο καλύτερος τρόπος παροχής εκπαίδευσης σε σύγκριση με τα διαδικτυακά μαθήματα. Στο περιβάλλον της τάξης μπορείτε να μάθετε από τους συμμαθητές σας, επειδή εάν δείτε κάποιον από τους συμμαθητές σας που έχει καλύτερη απόδοση, θα σας αναγκάσει να κάνετε την απόδοσή σας πιο καλύτερη. Για παράδειγμα, όταν ήμουν στην πρώτη χρονιά στο B Com, δεν ήμουν σοβαρός στη μελέτη μου, αλλά όταν είδα κάποιους φίλους μου που πήραν καλύτερους βαθμούς από εμένα, με επηρέασε και σκόπευα να κάνω καλύτερα στα μαθήματά μου. Τελικά πήρα την 1η τάξη στις τελικές εξετάσεις. Δεύτερον, στην εκμάθηση στην τάξη πρέπει να ολοκληρώσετε την εργασία μελέτης εγκαίρως. Σας κάνει τέλειους σε δεξιότητες διαχείρισης χρόνου. Επιπλέον, μπορείτε να μάθετε συμμετέχοντας σε ομαδικές μελέτες πώς να επικοινωνείτε με άλλους. Σας κάνει να επικοινωνείτε και φυσικά τις δεξιότητες των ομάδων σας καλύτερα, κάτι που μπορεί να σας βοηθήσει στο μέλλον και την καριέρα σας. Τρίτον, οι καθηγητές διαδραματίζουν ζωτικό ρόλο στη μάθηση στην τάξη, οι περισσότεροι από τους οποίους είναι ειδικοί είναι τα θέματα τους και σας βοηθούν δίνοντας πολύτιμες πληροφορίες και χρήσιμες δεξιότητες. Μπορείτε να βελτιώσετε τις δεξιότητές σας με την εργασία κάτω από οποιοδήποτε καθηγητή μπορείτε να κάνετε ερωτήσεις πρόσωπο με πρόσωπο, θα καθαρίσει τις αμφιβολίες σας. Στο αποτέλεσμα μαθαίνετε γρήγορα. Για παράδειγμα, έχω την προσωπική μου εμπειρία. Για το Toefl IBT Coaching πρώτα ήμουν εξαρτημένος από κάποια διαδικτυακά μαθήματα, αλλά μετά από 1 μήνα συνειδητοποίησα ότι χάνω το χρόνο μου, γι &#39;αυτό μπήκα σε ένα ινστιτούτο για την προετοιμασία του Toefl IBT και σε 1 μήνα ένιωσα ότι οι γνώσεις μου στα Αγγλικά βελτιώθηκαν γρηγορότερα . Είναι αναμφισβήτητο ότι τα διαδικτυακά μαθήματα έχουν κάποια πλεονεκτήματα, ώστε να μπορούν να χρησιμοποιηθούν ως συμπληρωματικά, αλλά δεν θα μπορούσαν να υποκαταστήσουν την υπάρχουσα μάθηση στην τάξη. Από τα παραπάνω, μπορούμε εύκολα να καταλήξουμε στο συμπέρασμα ότι η μάθηση στην τάξη είναι ο καλύτερος τρόπος παροχής εκπαίδευσης για αυτούς τους λόγους."
}