{
    "id": "e17b7dc8166899f2ce59ea845fceed78",
    "link": "",
    "description": "",
    "date": "",
    "tags": [],
    "publishedAt": "",
    "crawledAt": "",
    "domain": "",
    "netloc": "",
    "annotations": {
        "ADUs": [
            {
                "id": "T1",
                "type": "MajorClaim",
                "starts": "317",
                "ends": "366",
                "segment": "τεχνολογία το επιτρέπει, εξακολουθώ να πιστεύω ότι ορισμένα μουσεία και γκαλερί τέχνης δεν θα εξαφανιστούν."
            },
            {
                "id": "T2",
                "type": "MajorClaim",
                "starts": "1469",
                "ends": "1568",
                "segment": "Συμπερασματικά, παραδέχομαι ότι η σύγχρονη τεχνολογία παρέχει έναν πιο βολικό και άνετο τρόπο για τους ανθρώπους να παρακολουθούν εκθέσεις, αλλά είναι απαραίτητο να διατηρηθούν μουσεία και γκαλερί τέχνης για τη σημασία της εκπαίδευσης και του πολιτισμού."
            },
            {
                "id": "T3",
                "type": "Claim",
                "starts": "1360",
                "ends": "1463",
                "segment": "Επιπλέον, τα μουσεία και οι γκαλερί τέχνης διατηρούν κάποιους πολιτισμούς.",
                "stance": [
                    {
                        "id": "A1",
                        "type": "Against"
                    }
                ]
            },
            {
                "id": "T4",
                "type": "Premise",
                "starts": "385",
                "ends": "440",
                "segment": "Από τη μία πλευρά, η τεχνολογία απλοποιεί πράγματι τη ζωή των ανθρώπων όλη την ώρα."
            },
            {
                "id": "T5",
                "type": "Claim",
                "starts": "453",
                "ends": "620",
                "segment": "Προφανώς, οι άνθρωποι που παρακολουθούν εκθέσεις στην τηλεόραση ή στο Διαδίκτυο στο σπίτι, εξοικονομούν χρόνο και χρήμα στο δρόμο, κάτι που γίνεται όλο και πιο σημαντικό ιδίως για τους ανθρώπους στη σύγχρονη κοινωνία.",
                "stance": [
                    {
                        "id": "A5",
                        "type": "Against"
                    }
                ]
            },
            {
                "id": "T6",
                "type": "Premise",
                "starts": "631",
                "ends": "742",
                "segment": "κάτι που γίνεται όλο και πιο σημαντικό ιδίως για τους ανθρώπους στη σύγχρονη κοινωνία."
            },
            {
                "id": "T7",
                "type": "Premise",
                "starts": "751",
                "ends": "812",
                "segment": "πρόσφατη έρευνα, οι ειδικοί προτείνουν ότι ο τρόπος ζωής των ατόμων στη σύγχρονη κοινωνία είναι ανθυγιεινός, επειδή δεν έχει σωματική άσκηση και πρόσωπο με πρόσωπο επικοινωνία."
            },
            {
                "id": "T8",
                "type": "Claim",
                "starts": "833",
                "ends": "919",
                "segment": "στη σύγχρονη κοινωνία είναι ανθυγιεινός, επειδή δεν έχει σωματική άσκηση και πρόσωπο με πρόσωπο επικοινωνία.",
                "stance": [
                    {
                        "id": "A3",
                        "type": "For"
                    }
                ]
            },
            {
                "id": "T9",
                "type": "Claim",
                "starts": "1260",
                "ends": "1330",
                "segment": "τηλεόραση ή φωτογραφίες, οπότε η καλύτερη μέθοδος για να μάθεις ένα πράγμα είναι να το βιώσεις.",
                "stance": [
                    {
                        "id": "A4",
                        "type": "For"
                    }
                ]
            },
            {
                "id": "T10",
                "type": "Premise",
                "starts": "1190",
                "ends": "1247",
                "segment": "το να βλέπεις το τοπίο αυτού του μέρους σε τηλεόραση ή φωτογραφίες, οπότε η καλύτερη μέθοδος για να μάθεις ένα πράγμα είναι να το βιώσεις."
            },
            {
                "id": "T11",
                "type": "Premise",
                "starts": "935",
                "ends": "1010",
                "segment": "πλευρά, η σημασία των μουσείων και των γκαλερί τέχνης είναι σαφής όσον αφορά την εκπαίδευση και τον πολιτισμό."
            },
            {
                "id": "T12",
                "type": "Premise",
                "starts": "1012",
                "ends": "1175",
                "segment": "Πρώτα απ &#39;όλα, τα αυθεντικά εκθέματα δεν μπορούν να προβληθούν πλήρως μόνο από εικόνες και βίντεο."
            }
        ],
        "Relations": [
            {
                "id": "R1",
                "type": "supports",
                "arg1": "T7",
                "arg2": "T6"
            },
            {
                "id": "R4",
                "type": "supports",
                "arg1": "T10",
                "arg2": "T9"
            },
            {
                "id": "R5",
                "type": "supports",
                "arg1": "T11",
                "arg2": "T8"
            },
            {
                "id": "R6",
                "type": "supports",
                "arg1": "T12",
                "arg2": "T8"
            },
            {
                "id": "R2",
                "type": "supports",
                "arg1": "T4",
                "arg2": "T5"
            },
            {
                "id": "R3",
                "type": "attacks",
                "arg1": "T6",
                "arg2": "T5"
            }
        ]
    },
    "content": "Μουσεία και γκαλερί τέχνης θα εξαφανιστούν σύντομα; Είναι πολύ κοινό ότι όλο και περισσότεροι άνθρωποι μπορούν να παρακολουθούν εκθέσεις μέσω τηλεόρασης ή διαδικτύου στο σπίτι λόγω της σύγχρονης τεχνολογίας. Ως εκ τούτου, ορισμένοι πιστεύουν ότι τα μουσεία και οι γκαλερί τέχνης θα εξαφανιστούν σύντομα. Αν και η σύγχρονη τεχνολογία το επιτρέπει, εξακολουθώ να πιστεύω ότι ορισμένα μουσεία και γκαλερί τέχνης δεν θα εξαφανιστούν. Από τη μία πλευρά, η τεχνολογία απλοποιεί πράγματι τη ζωή των ανθρώπων όλη την ώρα. Προφανώς, οι άνθρωποι που παρακολουθούν εκθέσεις στην τηλεόραση ή στο Διαδίκτυο στο σπίτι, εξοικονομούν χρόνο και χρήμα στο δρόμο, κάτι που γίνεται όλο και πιο σημαντικό ιδίως για τους ανθρώπους στη σύγχρονη κοινωνία. Ωστόσο, σύμφωνα με πρόσφατη έρευνα, οι ειδικοί προτείνουν ότι ο τρόπος ζωής των ατόμων στη σύγχρονη κοινωνία είναι ανθυγιεινός, επειδή δεν έχει σωματική άσκηση και πρόσωπο με πρόσωπο επικοινωνία. Από την άλλη πλευρά, η σημασία των μουσείων και των γκαλερί τέχνης είναι σαφής όσον αφορά την εκπαίδευση και τον πολιτισμό. Πρώτα απ &#39;όλα, τα αυθεντικά εκθέματα δεν μπορούν να προβληθούν πλήρως μόνο από εικόνες και βίντεο. Είναι σαν να ταξιδεύεις σε ένα μέρος είναι πολύ καλύτερο από το να βλέπεις το τοπίο αυτού του μέρους σε τηλεόραση ή φωτογραφίες, οπότε η καλύτερη μέθοδος για να μάθεις ένα πράγμα είναι να το βιώσεις. Επιπλέον, τα μουσεία και οι γκαλερί τέχνης διατηρούν κάποιους πολιτισμούς. Επομένως, αυτά τα κτίρια δεν θα εξαφανιστούν εκτός εάν οι άνθρωποι εγκαταλείψουν τον πολιτισμό τους. Συμπερασματικά, παραδέχομαι ότι η σύγχρονη τεχνολογία παρέχει έναν πιο βολικό και άνετο τρόπο για τους ανθρώπους να παρακολουθούν εκθέσεις, αλλά είναι απαραίτητο να διατηρηθούν μουσεία και γκαλερί τέχνης για τη σημασία της εκπαίδευσης και του πολιτισμού."
}