{
  "_index": "reindexed-v7-articles",
  "_type": "_doc",
  "_id": "f4ff66c725e1d7bb189a28ce87a04740bf2ae1f7",
  "_version": 1,
  "_score": null,
  "_source": {
    "feed_es_id": "f4ff66c725e1d7bb189a28ce87a04740bf2ae1f7",
    "feed_type": "rss",
    "feed_link": "https://www.briefingnews.gr/feed/rss",
    "feed_title": "Cumhuriyet: Η Άγκυρα ιδιωτικοποιεί την κρατική εταιρεία πετρελαίου",
    "description": "<p>Στην ιδιωτικοποίηση της κρατικής εταιρείας πετρελαίου, TPAO, προσανατολίζεται η τουρκικη κυβέρνηση, σύμφωνα με τουρκικά μέσα μαζικής ενημέρωσης.</p>\n<p>Η τουρκική εφημερίδα Cumhuriyet, έχει στο πρωτοσέλιδό της μια είδηση πως η τουρκική κυβέρνηση ετοιμάζει να ιδιωτικοποιήσει την εταιρία πετρελαίου αλλά και την εταιρία διανομής φυσικού αερίου. </p>\n<p><img src=\"https://www.in.gr/wp-content/uploads/2020/09/trao-586x600.jpg\" alt=\"\" width=\"586\" height=\"600\" class=\"alignnone size-medium wp-image-200604209\" /></p>\n<p>Η εταιρία πετρελαίου –από το Κατάρ -είναι αυτή που πραγματοποιεί έρευνες και με τα σεισμογραφικά αλλά και με τα γεωτρύπανα και σύμφωνα με την εφημερίδα ετοιμάζεται να μπει με τα κεφάλαιά της στην κρατική εταιρία.</p>\n<div class=\"twitter-tweet twitter-tweet-rendered\">\n<iframe id=\"twitter-widget-0\" title=\"Twitter Tweet\" src=\"https://platform.twitter.com/embed/index.html?creatorScreenName=in_gr&amp;dnt=true&amp;embedId=twitter-widget-0&amp;frame=false&amp;hideCard=false&amp;hideThread=false&amp;id=1306432698827890688&amp;lang=el&amp;origin=https%3A%2F%2Fwww.in.gr%2F2020%2F09%2F17%2Feconomy%2Fdiethnis-oikonomia%2Fcumhuriyet-pros-idiotikopoiisi-trao%2F&amp;siteScreenName=in_gr&amp;theme=light&amp;widgetsVersion=219d021%3A1598982042171&amp;width=500px\" frameborder=\"0\" scrolling=\"no\" width=\"320\" height=\"240\" data-tweet-id=\"1306432698827890688\"></iframe></div>",
    "link": "https://www.briefingnews.gr/ethnika/cumhuriyet-i-agkyra-idiotikopoiei-tin-kratiki-etaireia-petrelaioy",
    "category": [],
    "date": "2020-09-17T10:14:00Z",
    "likes": null,
    "dislikes": null,
    "posts": null,
    "posts_feed": null,
    "id": null,
    "thread": null,
    "forum": null,
    "isDeleted": null,
    "isClosed": null,
    "type": null,
    "slug": null,
    "guid": "325202",
    "item_type": "article",
    "redirect_url": "https://www.briefingnews.gr/ethnika/cumhuriyet-i-agkyra-idiotikopoiei-tin-kratiki-etaireia-petrelaioy",
    "title": "Cumhuriyet: Η Άγκυρα ιδιωτικοποιεί την κρατική εταιρεία πετρελαίου",
    "content": "Στην ιδιωτικοποίηση της κρατικής εταιρείας πετρελαίου, TPAO, προσανατολίζεται η τουρκικη κυβέρνηση, σύμφωνα με τουρκικά μέσα μαζικής ενημέρωσης.\n\nΗ τουρκική εφημερίδα Cumhuriyet, έχει στο πρωτοσέλιδό της μια είδηση πως η τουρκική κυβέρνηση ετοιμάζει να ιδιωτικοποιήσει την εταιρία πετρελαίου αλλά και την εταιρία διανομής φυσικού αερίου.\n\nΗ εταιρία πετρελαίου –από το Κατάρ -είναι αυτή που πραγματοποιεί έρευνες και με τα σεισμογραφικά αλλά και με τα γεωτρύπανα και σύμφωνα με την εφημερίδα ετοιμάζεται να μπει με τα κεφάλαιά της στην κρατική εταιρία.",
    "tags": [
      "Γενική Γραμματεία Πολιτικής Προστασίας"
    ],
    "publishedAt": "2020-09-17T10:14:28Z",
    "crawledAt": "2020-09-17T09:34:30Z",
    "top_image": "https://www.briefingnews.gr/sites/default/files/styles/slider__638x287_/public/articlesnew/eifhndjxcaaerwd.jpg?itok=DB1cR7m_",
    "domain": "briefingnews",
    "netloc": "www.briefingnews.gr"
  },
  "fields": {
    "date": [
      "2020-09-17T10:14:00.000Z",
      "2020-09-17T10:14:00.000Z"
    ],
    "feed_es_id": [
      "f4ff66c725e1d7bb189a28ce87a04740bf2ae1f7"
    ],
    "top_image": [
      "https://www.briefingnews.gr/sites/default/files/styles/slider__638x287_/public/articlesnew/eifhndjxcaaerwd.jpg?itok=DB1cR7m_"
    ],
    "publishedAt": [
      "2020-09-17T10:14:28.000Z",
      "2020-09-17T10:14:28.000Z"
    ],
    "item_type": [
      "article"
    ],
    "link": [
      "https://www.briefingnews.gr/ethnika/cumhuriyet-i-agkyra-idiotikopoiei-tin-kratiki-etaireia-petrelaioy"
    ],
    "description": [
      "<p>Στην ιδιωτικοποίηση της κρατικής εταιρείας πετρελαίου, TPAO, προσανατολίζεται η τουρκικη κυβέρνηση, σύμφωνα με τουρκικά μέσα μαζικής ενημέρωσης.</p>\n<p>Η τουρκική εφημερίδα Cumhuriyet, έχει στο πρωτοσέλιδό της μια είδηση πως η τουρκική κυβέρνηση ετοιμάζει να ιδιωτικοποιήσει την εταιρία πετρελαίου αλλά και την εταιρία διανομής φυσικού αερίου. </p>\n<p><img src=\"https://www.in.gr/wp-content/uploads/2020/09/trao-586x600.jpg\" alt=\"\" width=\"586\" height=\"600\" class=\"alignnone size-medium wp-image-200604209\" /></p>\n<p>Η εταιρία πετρελαίου –από το Κατάρ -είναι αυτή που πραγματοποιεί έρευνες και με τα σεισμογραφικά αλλά και με τα γεωτρύπανα και σύμφωνα με την εφημερίδα ετοιμάζεται να μπει με τα κεφάλαιά της στην κρατική εταιρία.</p>\n<div class=\"twitter-tweet twitter-tweet-rendered\">\n<iframe id=\"twitter-widget-0\" title=\"Twitter Tweet\" src=\"https://platform.twitter.com/embed/index.html?creatorScreenName=in_gr&amp;dnt=true&amp;embedId=twitter-widget-0&amp;frame=false&amp;hideCard=false&amp;hideThread=false&amp;id=1306432698827890688&amp;lang=el&amp;origin=https%3A%2F%2Fwww.in.gr%2F2020%2F09%2F17%2Feconomy%2Fdiethnis-oikonomia%2Fcumhuriyet-pros-idiotikopoiisi-trao%2F&amp;siteScreenName=in_gr&amp;theme=light&amp;widgetsVersion=219d021%3A1598982042171&amp;width=500px\" frameborder=\"0\" scrolling=\"no\" width=\"320\" height=\"240\" data-tweet-id=\"1306432698827890688\"></iframe></div>"
    ],
    "title": [
      "Cumhuriyet: Η Άγκυρα ιδιωτικοποιεί την κρατική εταιρεία πετρελαίου"
    ],
    "feed_title": [
      "Cumhuriyet: Η Άγκυρα ιδιωτικοποιεί την κρατική εταιρεία πετρελαίου"
    ],
    "content": [
      "Στην ιδιωτικοποίηση της κρατικής εταιρείας πετρελαίου, TPAO, προσανατολίζεται η τουρκικη κυβέρνηση, σύμφωνα με τουρκικά μέσα μαζικής ενημέρωσης.\n\nΗ τουρκική εφημερίδα Cumhuriyet, έχει στο πρωτοσέλιδό της μια είδηση πως η τουρκική κυβέρνηση ετοιμάζει να ιδιωτικοποιήσει την εταιρία πετρελαίου αλλά και την εταιρία διανομής φυσικού αερίου.\n\nΗ εταιρία πετρελαίου –από το Κατάρ -είναι αυτή που πραγματοποιεί έρευνες και με τα σεισμογραφικά αλλά και με τα γεωτρύπανα και σύμφωνα με την εφημερίδα ετοιμάζεται να μπει με τα κεφάλαιά της στην κρατική εταιρία."
    ],
    "tags": [
      "Γενική Γραμματεία Πολιτικής Προστασίας"
    ],
    "crawledAt": [
      "2020-09-17T09:34:30.000Z",
      "2020-09-17T09:34:30.000Z"
    ],
    "domain": [
      "briefingnews"
    ],
    "feed_link": [
      "https://www.briefingnews.gr/feed/rss"
    ],
    "guid": [
      "325202"
    ],
    "netloc": [
      "www.briefingnews.gr"
    ],
    "feed_type": [
      "rss"
    ],
    "redirect_url": [
      "https://www.briefingnews.gr/ethnika/cumhuriyet-i-agkyra-idiotikopoiei-tin-kratiki-etaireia-petrelaioy"
    ]
  },
  "sort": [
    1600337640000
  ]
}

