{
    "id": "71ec6668e80235cbabf12816b34f4e6b",
    "link": "",
    "description": "",
    "date": "",
    "tags": [],
    "publishedAt": "",
    "crawledAt": "",
    "domain": "",
    "netloc": "",
    "annotations": {
        "ADUs": [
            {
                "id": "T1",
                "type": "MajorClaim",
                "starts": "1995",
                "ends": "2115",
                "segment": "Ωστόσο, κατά την άποψή μου, εξακολουθεί να έχει μεγάλη σημασία να παραμείνει η αρμονική συνύπαρξη και των δύο πλευρών για την ομαλή ιστιοπλοΐα της εταιρείας."
            },
            {
                "id": "T2",
                "type": "Claim",
                "starts": "1870",
                "ends": "1963",
                "segment": "Με λίγα λόγια, οι εργαζόμενοι άνω των 50 έχουν αποδειχθεί υποταγμένοι στην επόμενη γενιά σε όλες τις πτυχές.",
                "stance": [
                    {
                        "id": "A1",
                        "type": "Against"
                    }
                ]
            },
            {
                "id": "T3",
                "type": "Premise",
                "starts": "475",
                "ends": "594",
                "segment": "Οι παλιοί μεγάλωσαν στη φτώχεια, πιθανότατα προκαλούμενο από πόλεμο, κοιτάξτε τον κόσμο από αρνητική και απαισιόδοξη άποψη."
            },
            {
                "id": "T4",
                "type": "Premise",
                "starts": "596",
                "ends": "725",
                "segment": "Η δυστυχία είναι βαθιά ριζωμένη στο μυαλό τους που αρνούνται να αλλάξουν, ή πιο συγκεκριμένα, να αποδεχτούν την ύπαρξη ενός τέτοιου εκσυγχρονισμού."
            },
            {
                "id": "T5",
                "type": "Premise",
                "starts": "740",
                "ends": "912",
                "segment": "Για παράδειγμα, οι περισσότεροι θα προτιμούσαν να συνενώσουν τμήματα μιας μηχανής από ό, τι το έκαναν ένα ρομπότ για τη δυσπιστία τους για την αποτελεσματικότητα και την ασφάλειά του σε σύγκριση με την ικανότητα του ανθρώπου."
            },
            {
                "id": "T6",
                "type": "Claim",
                "starts": "397",
                "ends": "473",
                "segment": "Πρώτα απ &#39;όλα, οι ηλικιωμένοι εργαζόμενοι δεν αποτελούν μπάλωμα στους νεότερους για το αμετάβλητο τους παράδειγμα.",
                "stance": [
                    {
                        "id": "A2",
                        "type": "For"
                    }
                ]
            },
            {
                "id": "T7",
                "type": "Premise",
                "starts": "1483",
                "ends": "1680",
                "segment": "Ποιος θα επέλεγε ο εργοδότης, ένας γέρος με παλιομοδίτικη εκπαίδευση και ένας νεαρός άνδρας που δεν είναι μόνο καλός στο σχολείο, αλλά επίσης γνωρίζει πώς να προγραμματίζει ή πώς να μιλά ξένες γλώσσες."
            },
            {
                "id": "T8",
                "type": "Premise",
                "starts": "1682",
                "ends": "1849",
                "segment": "Το να μην υπονομεύσουν τους ηλικιωμένους εργαζόμενους, αλλά η έλλειψη εξουσίας τους σε τέτοια βασικά απαιτούμενα πεδία σε αυτήν την εποχή και την εποχή οδηγεί στην ανικανότητά τους σε κάθε σύγχρονο χώρο εργασίας."
            },
            {
                "id": "T9",
                "type": "Claim",
                "starts": "1394",
                "ends": "1481",
                "segment": "Τέλος, αξίζει να αναφερθεί η γνώση ως βασικός παράγοντας που βοηθά τους νέους εργαζόμενους να ξεπεράσουν τους ηλικιωμένους.",
                "stance": [
                    {
                        "id": "A3",
                        "type": "For"
                    }
                ]
            },
            {
                "id": "T10",
                "type": "Claim",
                "starts": "924",
                "ends": "995",
                "segment": "Δεύτερον, η μη ανταπόκρισή τους μπορεί να αποδοθεί στη στάση τους απέναντι στη ζωή.",
                "stance": [
                    {
                        "id": "A4",
                        "type": "For"
                    }
                ]
            },
            {
                "id": "T11",
                "type": "Premise",
                "starts": "1013",
                "ends": "1139",
                "segment": "Με άλλα λόγια, ότι γνωρίζουν την επιδείνωση της υγείας τους και η έλλειψη ενθουσιασμού έρχεται με το γούστο τους για μονοτονία και ασφαλή ιδεολογία."
            },
            {
                "id": "T12",
                "type": "Premise",
                "starts": "1141",
                "ends": "1215",
                "segment": "έρχεται με το γούστο τους για μονοτονία και ασφαλή ιδεολογία."
            },
            {
                "id": "T13",
                "type": "Premise",
                "starts": "1217",
                "ends": "1372",
                "segment": "Ουσιαστικά, η επιτυχία των περισσότερων εταιρειών προέρχεται από νέους, των οποίων οι επιχειρηματικές ιδέες που έρχονται σε επαφή με τον κόσμο θεωρείται ως αέρας αναζωογόνησης."
            }
        ],
        "Relations": [
            {
                "id": "R1",
                "type": "supports",
                "arg1": "T7",
                "arg2": "T9"
            },
            {
                "id": "R2",
                "type": "supports",
                "arg1": "T8",
                "arg2": "T9"
            },
            {
                "id": "R3",
                "type": "supports",
                "arg1": "T3",
                "arg2": "T6"
            },
            {
                "id": "R4",
                "type": "supports",
                "arg1": "T4",
                "arg2": "T6"
            },
            {
                "id": "R5",
                "type": "supports",
                "arg1": "T5",
                "arg2": "T6"
            },
            {
                "id": "R6",
                "type": "supports",
                "arg1": "T11",
                "arg2": "T10"
            },
            {
                "id": "R7",
                "type": "supports",
                "arg1": "T13",
                "arg2": "T10"
            },
            {
                "id": "R8",
                "type": "supports",
                "arg1": "T12",
                "arg2": "T10"
            }
        ]
    },
    "content": "Ηλικιωμένοι και νέοι εργαζόμενοι Σε όλη την ανθρώπινη ιστορία, ο απόγονος απέδειξε πάντα την ισχυρότερη προσαρμοστικότητα και την πρόοδό του από τον προκάτοχό του. Αυτό εξακολουθεί να ισχύει στη βιομηχανική κοινωνία σήμερα, όπου οι νεότεροι εργαζόμενοι κατά προτίμηση απασχολούνται και προωθούνται και όχι περισσότεροι από 50 εργαζόμενοι. Υπάρχουν τρεις λόγοι που μπορούν να εξηγήσουν την απάντησή τους στο σύγχρονο χώρο εργασίας. Πρώτα απ &#39;όλα, οι ηλικιωμένοι εργαζόμενοι δεν αποτελούν μπάλωμα στους νεότερους για το αμετάβλητο τους παράδειγμα. Οι παλιοί μεγάλωσαν στη φτώχεια, πιθανότατα προκαλούμενο από πόλεμο, κοιτάξτε τον κόσμο από αρνητική και απαισιόδοξη άποψη. Η δυστυχία είναι βαθιά ριζωμένη στο μυαλό τους που αρνούνται να αλλάξουν, ή πιο συγκεκριμένα, να αποδεχτούν την ύπαρξη ενός τέτοιου εκσυγχρονισμού. Για παράδειγμα, οι περισσότεροι θα προτιμούσαν να συνενώσουν τμήματα μιας μηχανής από ό, τι το έκαναν ένα ρομπότ για τη δυσπιστία τους για την αποτελεσματικότητα και την ασφάλειά του σε σύγκριση με την ικανότητα του ανθρώπου. Δεύτερον, η μη ανταπόκρισή τους μπορεί να αποδοθεί στη στάση τους απέναντι στη ζωή. Με άλλα λόγια, ότι γνωρίζουν την επιδείνωση της υγείας τους και η έλλειψη ενθουσιασμού έρχεται με το γούστο τους για μονοτονία και ασφαλή ιδεολογία. Αυτό, με κάθε τρόπο, υπερτερεί της περιπετειώδους και γενναιότητας των νέων. Ουσιαστικά, η επιτυχία των περισσότερων εταιρειών προέρχεται από νέους, των οποίων οι επιχειρηματικές ιδέες που έρχονται σε επαφή με τον κόσμο θεωρείται ως αέρας αναζωογόνησης. Τέλος, αξίζει να αναφερθεί η γνώση ως βασικός παράγοντας που βοηθά τους νέους εργαζόμενους να ξεπεράσουν τους ηλικιωμένους. Ποιος θα επέλεγε ο εργοδότης, ένας γέρος με παλιομοδίτικη εκπαίδευση και ένας νεαρός άνδρας που δεν είναι μόνο καλός στο σχολείο, αλλά επίσης γνωρίζει πώς να προγραμματίζει ή πώς να μιλά ξένες γλώσσες. Το να μην υπονομεύσουν τους ηλικιωμένους εργαζόμενους, αλλά η έλλειψη εξουσίας τους σε τέτοια βασικά απαιτούμενα πεδία σε αυτήν την εποχή και την εποχή οδηγεί στην ανικανότητά τους σε κάθε σύγχρονο χώρο εργασίας. Με λίγα λόγια, οι εργαζόμενοι άνω των 50 έχουν αποδειχθεί υποταγμένοι στην επόμενη γενιά σε όλες τις πτυχές. Ωστόσο, κατά την άποψή μου, εξακολουθεί να έχει μεγάλη σημασία να παραμείνει η αρμονική συνύπαρξη και των δύο πλευρών για την ομαλή ιστιοπλοΐα της εταιρείας."
}