{
    "id": "0c29929bb6d05e489f60aebf76ecd1ef",
    "link": "",
    "description": "",
    "date": "",
    "tags": [],
    "publishedAt": "",
    "crawledAt": "",
    "domain": "",
    "netloc": "",
    "annotations": {
        "ADUs": [
            {
                "id": "T1",
                "type": "MajorClaim",
                "starts": "265",
                "ends": "406",
                "segment": "έκφρασης σκέψεων και ιδεών θα πρέπει πάντα να είναι απατηλή και μάλλον άδικο να επιβάλουμε ένα δεσμό στη θέληση των καλλιτεχνών να δημιουργήσουν."
            },
            {
                "id": "T2",
                "type": "MajorClaim",
                "starts": "2051",
                "ends": "2110",
                "segment": "Αντιθέτως, θα πρέπει να ενθαρρυνθούν να εκφράσουν τις καινοτόμες ιδέες τους - αυτός ο κόσμος τους χρειάζεται να κάνει τον εαυτό του πολύχρωμο."
            },
            {
                "id": "T3",
                "type": "Claim",
                "starts": "2113",
                "ends": "2159",
                "segment": "τους - αυτός ο κόσμος τους χρειάζεται να κάνει τον εαυτό του πολύχρωμο.",
                "stance": [
                    {
                        "id": "A1",
                        "type": "For"
                    }
                ]
            },
            {
                "id": "T4",
                "type": "Claim",
                "starts": "408",
                "ends": "546",
                "segment": "Μία από τις σημαντικότερες ανησυχίες κατά της απελευθέρωσης της δημιουργίας καλλιτεχνών προέρχεται από τον φόβο της κοινωνικής παραπλανητικής που θα αποσταθεροποιούσε την κοινωνία.",
                "stance": [
                    {
                        "id": "A2",
                        "type": "Against"
                    }
                ]
            },
            {
                "id": "T5",
                "type": "Premise",
                "starts": "567",
                "ends": "668",
                "segment": "Ωστόσο, πιστεύω ότι το κοινό έχει τη δική του κρίση και δεν είναι πιθανό να παραπλανηθεί ή να επηρεαστεί από κάποιο έργο τέχνης."
            },
            {
                "id": "T6",
                "type": "Premise",
                "starts": "697",
                "ends": "917",
                "segment": "Ανεξάρτητα από το αν το έργο τέχνης βασίζεται στην αλήθεια ή όχι, είναι η αρμοδιότητα του κοινού να καθορίζει πώς να ερμηνεύει τη σημασία του."
            },
            {
                "id": "T7",
                "type": "Premise",
                "starts": "919",
                "ends": "1062",
                "segment": "Εάν η τέχνη εμφανίζει ανισότητα, το κοινό ακροατήριο σίγουρα έχει το πνεύμα να αναγνωρίσει την αλήθεια και να εκτιμήσει μόνο την αξία της τέχνης."
            },
            {
                "id": "T8",
                "type": "Premise",
                "starts": "1286",
                "ends": "1348",
                "segment": "αλήθεια; Με μια λέξη, η έννοια του φόβου της κοινωνικής παραπλανητικής είναι αδικαιολόγητη."
            },
            {
                "id": "T9",
                "type": "Claim",
                "starts": "1566",
                "ends": "1618",
                "segment": "οι περιορισμοί στην έκθεση σε εφήβους πρέπει να ισχύουν, καθώς οι έφηβοι δεν είναι αρκετά ώριμοι για να αποφύγουν να παραπλανηθούν από αυτά τα περιεχόμενα.",
                "stance": [
                    {
                        "id": "A3",
                        "type": "For"
                    }
                ]
            },
            {
                "id": "T10",
                "type": "Premise",
                "starts": "1444",
                "ends": "1540",
                "segment": "ότι ορισμένα από τα έργα τέχνης μπορεί να περιέχουν αρνητικές επιπτώσεις όπως παραφροσύνη, βία, ερωτισμό κ."
            },
            {
                "id": "T11",
                "type": "Premise",
                "starts": "1622",
                "ends": "1699",
                "segment": "ισχύουν, καθώς οι έφηβοι δεν είναι αρκετά ώριμοι για να αποφύγουν να παραπλανηθούν από αυτά τα περιεχόμενα."
            },
            {
                "id": "T12",
                "type": "Premise",
                "starts": "1710",
                "ends": "1934",
                "segment": "Ωστόσο, στην περίπτωση των ενηλίκων που είναι το κοινό, δεν υπάρχει τίποτα που να κρύβεται - αυτά τα αρνητικά πράγματα υπάρχουν αντικειμενικά σε αυτόν τον πλανήτη και είναι αδύνατο για τους ενήλικες να πλένονται στον εγκέφαλο μόνο λόγω ορισμένων έργων δημιουργικής τέχνης."
            }
        ],
        "Relations": [
            {
                "id": "R1",
                "type": "attacks",
                "arg1": "T5",
                "arg2": "T4"
            },
            {
                "id": "R2",
                "type": "attacks",
                "arg1": "T6",
                "arg2": "T4"
            },
            {
                "id": "R3",
                "type": "attacks",
                "arg1": "T7",
                "arg2": "T4"
            },
            {
                "id": "R4",
                "type": "attacks",
                "arg1": "T8",
                "arg2": "T4"
            },
            {
                "id": "R5",
                "type": "supports",
                "arg1": "T11",
                "arg2": "T9"
            },
            {
                "id": "R6",
                "type": "supports",
                "arg1": "T10",
                "arg2": "T9"
            },
            {
                "id": "R7",
                "type": "supports",
                "arg1": "T12",
                "arg2": "T9"
            }
        ]
    },
    "content": "Creative Artists Καινοτόμοι καλλιτέχνες φέρνουν απόλαυση και έμπνευση στη μερικές φορές κουραστική ζωή μας. Ωστόσο, ορισμένοι θεωρούν ότι στους καλλιτέχνες έχουν ανατεθεί υπερβολική ελευθερία και εξουσία και πρέπει να περιοριστούν από την κυβέρνηση. Είναι προσωπική μου πεποίθηση ότι η ελευθερία έκφρασης σκέψεων και ιδεών θα πρέπει πάντα να είναι απατηλή και μάλλον άδικο να επιβάλουμε ένα δεσμό στη θέληση των καλλιτεχνών να δημιουργήσουν. Μία από τις σημαντικότερες ανησυχίες κατά της απελευθέρωσης της δημιουργίας καλλιτεχνών προέρχεται από τον φόβο της κοινωνικής παραπλανητικής που θα αποσταθεροποιούσε την κοινωνία. Ωστόσο, πιστεύω ότι το κοινό έχει τη δική του κρίση και δεν είναι πιθανό να παραπλανηθεί ή να επηρεαστεί από κάποιο έργο τέχνης. Είναι περιττό να πούμε ότι η τέχνη περιλαμβάνει αναπόφευκτα φαντασία, υπερβολή και μερικές φορές είναι καθαρά κατασκευασμένη. Ανεξάρτητα από το αν το έργο τέχνης βασίζεται στην αλήθεια ή όχι, είναι η αρμοδιότητα του κοινού να καθορίζει πώς να ερμηνεύει τη σημασία του. Εάν η τέχνη εμφανίζει ανισότητα, το κοινό ακροατήριο σίγουρα έχει το πνεύμα να αναγνωρίσει την αλήθεια και να εκτιμήσει μόνο την αξία της τέχνης. Αν η τέχνη αντανακλά την πραγματικότητα, τότε ποια θα ήταν η πρόθεση να την απαγορεύσουμε εάν δεν ήταν για την κάλυψη της βρώμικης αλήθειας; Θα ήταν αυταρχικό εάν η κυβέρνηση συγκρατεί τους καλλιτέχνες που λένε την αλήθεια; Με μια λέξη, η έννοια του φόβου της κοινωνικής παραπλανητικής είναι αδικαιολόγητη. Ας ρίξουμε μια ματιά στον αντίκτυπο που έχει η τέχνη στα άτομα. Είναι αναμφισβήτητο ότι ορισμένα από τα έργα τέχνης μπορεί να περιέχουν αρνητικές επιπτώσεις όπως παραφροσύνη, βία, ερωτισμό κ.λπ. Συμφωνώ απολύτως ότι οι περιορισμοί στην έκθεση σε εφήβους πρέπει να ισχύουν, καθώς οι έφηβοι δεν είναι αρκετά ώριμοι για να αποφύγουν να παραπλανηθούν από αυτά τα περιεχόμενα. Ωστόσο, στην περίπτωση των ενηλίκων που είναι το κοινό, δεν υπάρχει τίποτα που να κρύβεται - αυτά τα αρνητικά πράγματα υπάρχουν αντικειμενικά σε αυτόν τον πλανήτη και είναι αδύνατο για τους ενήλικες να πλένονται στον εγκέφαλο μόνο λόγω ορισμένων έργων δημιουργικής τέχνης. Εν κατακλείδι, δεν υποστηρίζω την ιδέα ότι πρέπει να τεθούν περιορισμοί στην εργασία των καλλιτεχνών. Αντιθέτως, θα πρέπει να ενθαρρυνθούν να εκφράσουν τις καινοτόμες ιδέες τους - αυτός ο κόσμος τους χρειάζεται να κάνει τον εαυτό του πολύχρωμο."
}