{
    "id": "95b07b6def8b46e62e4e9fe1287bd5a7",
    "link": "",
    "description": "",
    "date": "",
    "tags": [],
    "publishedAt": "",
    "crawledAt": "",
    "domain": "",
    "netloc": "",
    "annotations": {
        "ADUs": [
            {
                "id": "T1",
                "type": "MajorClaim",
                "starts": "398",
                "ends": "463",
                "segment": "εμένα, συμφωνώ με την άποψη ότι οι ανθρώπινες ανάγκες για χωράφια, στέγαση και βιομηχανία είναι πιο σημαντικές."
            },
            {
                "id": "T2",
                "type": "Claim",
                "starts": "2121",
                "ends": "2163",
                "segment": "φροντίδα των απειλούμενων ζώων.",
                "stance": [
                    {
                        "id": "A1",
                        "type": "Against"
                    }
                ]
            },
            {
                "id": "T3",
                "type": "MajorClaim",
                "starts": "2179",
                "ends": "2244",
                "segment": "παρόν, μπορούμε να εφεύρουμε νέα τεχνική για να βοηθήσουμε τα ζώα που απειλούνται με εξαφάνιση να παράγουν απογόνους για να είμαστε σίγουροι ότι δεν θα διακρίνονταν."
            },
            {
                "id": "T4",
                "type": "Premise",
                "starts": "520",
                "ends": "602",
                "segment": "Πρώτον, η γη που χρησιμοποιείται για χωράφια, στέγαση και βιομηχανία μπορεί να ωφελήσει περισσότερο ολόκληρη την κοινωνία."
            },
            {
                "id": "T5",
                "type": "Premise",
                "starts": "626",
                "ends": "815",
                "segment": "Δεν υπάρχει αμφιβολία ότι η οικονομία ολόκληρης της κοινωνίας θα αναπτυχθεί με τη βοήθεια της γεωργίας, της βιομηχανίας ακινήτων και της βιομηχανίας, ιδίως της βιομηχανίας που είναι ο πυλώνας της εθνικής οικονομίας, επειδή παράγουν πολλά κέρδη."
            },
            {
                "id": "T6",
                "type": "Premise",
                "starts": "825",
                "ends": "855",
                "segment": "πυλώνας της εθνικής οικονομίας, επειδή παράγουν πολλά κέρδη."
            },
            {
                "id": "T7",
                "type": "Premise",
                "starts": "871",
                "ends": "943",
                "segment": "Επιπλέον, η κοινωνία θα είναι σταθερή και αρμονική λόγω της μεγαλύτερης γεωργικής γης και της βιομηχανίας."
            },
            {
                "id": "T8",
                "type": "Premise",
                "starts": "976",
                "ends": "1096",
                "segment": "αναγνωρισμένο ότι περισσότερες γεωργικές εκτάσεις και βιομηχανίες μπορούν να προσφέρουν περισσότερες ευκαιρίες απασχόλησης που μπορούν να μειώσουν το ποσοστό ανεργίας και το ποσοστό εγκληματικότητας."
            },
            {
                "id": "T9",
                "type": "Claim",
                "starts": "1103",
                "ends": "1166",
                "segment": "Έτσι, οι ανάγκες για καλλιεργήσιμες εκτάσεις, στέγαση και βιομηχανία είναι πιο σημαντικές.",
                "stance": [
                    {
                        "id": "A3",
                        "type": "For"
                    }
                ]
            },
            {
                "id": "T10",
                "type": "Claim",
                "starts": "1176",
                "ends": "1264",
                "segment": "Δεύτερον, η γεωργική γη, η στέγαση και η βιομηχανία μπορούν να ικανοποιήσουν την επιθυμία του ανθρώπου να ζήσει μια καλύτερη ζωή.",
                "stance": [
                    {
                        "id": "A4",
                        "type": "For"
                    }
                ]
            },
            {
                "id": "T11",
                "type": "Premise",
                "starts": "1296",
                "ends": "1413",
                "segment": "Είναι σαφές ότι η γεωργία, η στέγαση και η βιομηχανία μας παρέχουν το φαγητό που τρώμε, τον τόπο που ζούμε, τα ρούχα που φοράμε, τα οποία είναι απαραίτητα για να ζήσουμε."
            },
            {
                "id": "T12",
                "type": "Premise",
                "starts": "1415",
                "ends": "1484",
                "segment": "φαγητό που τρώμε, τον τόπο που ζούμε, τα ρούχα που φοράμε, τα οποία είναι απαραίτητα για να ζήσουμε."
            },
            {
                "id": "T13",
                "type": "Premise",
                "starts": "1499",
                "ends": "1614",
                "segment": "Ειδικά σε ορισμένες φτωχές περιοχές, η επιβίωση είναι το πιο σημαντικό πράγμα."
            },
            {
                "id": "T14",
                "type": "Claim",
                "starts": "1741",
                "ends": "1789",
                "segment": "θέλω να αναφέρω ότι, παρόλο που η καλλιεργήσιμη γη, η στέγαση και η βιομηχανία θα καταλάβουν τη γη που χρησιμοποιείται για ζώα που απειλούνται με εξαφάνιση, μπορεί να κάνει καλό για την προστασία των απειλούμενων ζώων.",
                "stance": [
                    {
                        "id": "A5",
                        "type": "For"
                    }
                ]
            },
            {
                "id": "T15",
                "type": "Premise",
                "starts": "1660",
                "ends": "1739",
                "segment": "τις συνθήκες διαβίωσης που μας επιτρέπουν να έχουμε καλή ποιότητα ζωής."
            },
            {
                "id": "T16",
                "type": "Premise",
                "starts": "1823",
                "ends": "1882",
                "segment": "θα καταλάβουν τη γη που χρησιμοποιείται για ζώα που απειλούνται με εξαφάνιση, μπορεί να κάνει καλό για την προστασία των απειλούμενων ζώων."
            },
            {
                "id": "T17",
                "type": "Premise",
                "starts": "1914",
                "ends": "1982",
                "segment": "Σύμφωνα με την παραπάνω συζήτηση, η γεωργία και η βιομηχανία συμβάλλουν στην οικονομία."
            },
            {
                "id": "T18",
                "type": "Premise",
                "starts": "1997",
                "ends": "2107",
                "segment": "Με την ανάπτυξη της οικονομίας, μπορούμε να έχουμε πιο προηγμένες μεθόδους για τη φροντίδα των απειλούμενων ζώων."
            }
        ],
        "Relations": [
            {
                "id": "R1",
                "type": "supports",
                "arg1": "T6",
                "arg2": "T5"
            },
            {
                "id": "R2",
                "type": "supports",
                "arg1": "T8",
                "arg2": "T7"
            },
            {
                "id": "R4",
                "type": "supports",
                "arg1": "T7",
                "arg2": "T9"
            },
            {
                "id": "R6",
                "type": "supports",
                "arg1": "T11",
                "arg2": "T10"
            },
            {
                "id": "R7",
                "type": "supports",
                "arg1": "T12",
                "arg2": "T10"
            },
            {
                "id": "R8",
                "type": "supports",
                "arg1": "T13",
                "arg2": "T10"
            },
            {
                "id": "R9",
                "type": "attacks",
                "arg1": "T15",
                "arg2": "T14"
            },
            {
                "id": "R10",
                "type": "supports",
                "arg1": "T17",
                "arg2": "T14"
            },
            {
                "id": "R11",
                "type": "supports",
                "arg1": "T18",
                "arg2": "T17"
            },
            {
                "id": "R3",
                "type": "supports",
                "arg1": "T4",
                "arg2": "T9"
            },
            {
                "id": "R5",
                "type": "supports",
                "arg1": "T5",
                "arg2": "T9"
            },
            {
                "id": "R12",
                "type": "supports",
                "arg1": "T16",
                "arg2": "T14"
            }
        ]
    },
    "content": "Γεωργικές εκτάσεις, στέγαση και βιομηχανία ή εξοικονόμηση γης για ζώα; Σήμερα, υπάρχει μια επικρατούσα άποψη ότι οι ανθρώπινες ανάγκες για χωράφια, στέγαση και βιομηχανία είναι πιο σημαντικές από την εξοικονόμηση γης για ζώα που απειλούνται με εξαφάνιση. Άτομα που διαφωνούν με το σημείο αμφισβητούν ότι η μείωση της γης για ζώα που απειλούνται με εξαφάνιση θα προκαλέσει ζημιά στην οικολογική ισορροπία. Όσον αφορά εμένα, συμφωνώ με την άποψη ότι οι ανθρώπινες ανάγκες για χωράφια, στέγαση και βιομηχανία είναι πιο σημαντικές. Οι λόγοι βασίζονται στις ακόλουθες πτυχές. Πρώτον, η γη που χρησιμοποιείται για χωράφια, στέγαση και βιομηχανία μπορεί να ωφελήσει περισσότερο ολόκληρη την κοινωνία. Δεν υπάρχει αμφιβολία ότι η οικονομία ολόκληρης της κοινωνίας θα αναπτυχθεί με τη βοήθεια της γεωργίας, της βιομηχανίας ακινήτων και της βιομηχανίας, ιδίως της βιομηχανίας που είναι ο πυλώνας της εθνικής οικονομίας, επειδή παράγουν πολλά κέρδη. Επιπλέον, η κοινωνία θα είναι σταθερή και αρμονική λόγω της μεγαλύτερης γεωργικής γης και της βιομηχανίας. Είναι ευρέως αναγνωρισμένο ότι περισσότερες γεωργικές εκτάσεις και βιομηχανίες μπορούν να προσφέρουν περισσότερες ευκαιρίες απασχόλησης που μπορούν να μειώσουν το ποσοστό ανεργίας και το ποσοστό εγκληματικότητας. Έτσι, οι ανάγκες για καλλιεργήσιμες εκτάσεις, στέγαση και βιομηχανία είναι πιο σημαντικές. Δεύτερον, η γεωργική γη, η στέγαση και η βιομηχανία μπορούν να ικανοποιήσουν την επιθυμία του ανθρώπου να ζήσει μια καλύτερη ζωή. Είναι σαφές ότι η γεωργία, η στέγαση και η βιομηχανία μας παρέχουν το φαγητό που τρώμε, τον τόπο που ζούμε, τα ρούχα που φοράμε, τα οποία είναι απαραίτητα για να ζήσουμε. Ειδικά σε ορισμένες φτωχές περιοχές, η επιβίωση είναι το πιο σημαντικό πράγμα. Επιπλέον, η ανεπτυγμένη γεωργία και η βιομηχανία μπορούν να βελτιώσουν τις συνθήκες διαβίωσης που μας επιτρέπουν να έχουμε καλή ποιότητα ζωής. Τέλος, θέλω να αναφέρω ότι, παρόλο που η καλλιεργήσιμη γη, η στέγαση και η βιομηχανία θα καταλάβουν τη γη που χρησιμοποιείται για ζώα που απειλούνται με εξαφάνιση, μπορεί να κάνει καλό για την προστασία των απειλούμενων ζώων. Σύμφωνα με την παραπάνω συζήτηση, η γεωργία και η βιομηχανία συμβάλλουν στην οικονομία. Με την ανάπτυξη της οικονομίας, μπορούμε να έχουμε πιο προηγμένες μεθόδους για τη φροντίδα των απειλούμενων ζώων. Προς το παρόν, μπορούμε να εφεύρουμε νέα τεχνική για να βοηθήσουμε τα ζώα που απειλούνται με εξαφάνιση να παράγουν απογόνους για να είμαστε σίγουροι ότι δεν θα διακρίνονταν. Συνολικά, η προστασία των απειλούμενων ζώων είναι απαραίτητη, ωστόσο, οι ανθρώπινες ανάγκες για γεωργικές εκτάσεις, στέγαση και βιομηχανία είναι πιο σημαντικές."
}