{
    "id": "40d276c689072fc2bbb401ceeb9d9600",
    "link": "",
    "description": "",
    "date": "",
    "tags": [],
    "publishedAt": "",
    "crawledAt": "",
    "domain": "",
    "netloc": "",
    "annotations": {
        "ADUs": [
            {
                "id": "T1",
                "type": "MajorClaim",
                "starts": "468",
                "ends": "559",
                "segment": "Κατά την άποψή μου, συμφωνώ ότι είναι ο καλύτερος τρόπος για τα εφηβικά παιδιά να πάρουν μερική απασχόληση για να προετοιμάσουν την ενήλικη ζωή τους για διάφορους λόγους."
            },
            {
                "id": "T2",
                "type": "Claim",
                "starts": "721",
                "ends": "773",
                "segment": "σε θέση να κερδίζουν χρήματα από μόνα τους, αντί να παίρνουν χρήματα από τους γονείς τους.",
                "stance": [
                    {
                        "id": "A1",
                        "type": "For"
                    }
                ]
            },
            {
                "id": "T3",
                "type": "Premise",
                "starts": "798",
                "ends": "878",
                "segment": "Για παράδειγμα, όταν ήμουν 16 ετών, βρήκα δουλειά κατά τη διάρκεια των θερινών διακοπών και κέρδισα κάποια χρήματα από μόνα μου."
            },
            {
                "id": "T4",
                "type": "Premise",
                "starts": "880",
                "ends": "943",
                "segment": "δουλειά κατά τη διάρκεια των θερινών διακοπών και κέρδισα κάποια χρήματα από μόνα μου."
            },
            {
                "id": "T5",
                "type": "Premise",
                "starts": "960",
                "ends": "1012",
                "segment": "αρχή του εξαμήνου, μου είπαν να αγοράσω ένα βιβλίο."
            },
            {
                "id": "T6",
                "type": "Premise",
                "starts": "1025",
                "ends": "1144",
                "segment": "Επομένως, κατάλαβα τελικά ότι έπρεπε να μάθω να κάνω ένα σχέδιο πριν ξοδέψω τα χρήματά μου και αυτό με επηρέασε στη ζωή μου τώρα."
            },
            {
                "id": "T7",
                "type": "Premise",
                "starts": "595",
                "ends": "713",
                "segment": "Πρώτα απ &#39;όλα, όταν τα παιδιά παίρνουν δουλειά, είναι σε θέση να κερδίζουν χρήματα από μόνα τους, αντί να παίρνουν χρήματα από τους γονείς τους."
            },
            {
                "id": "T8",
                "type": "Claim",
                "starts": "1156",
                "ends": "1248",
                "segment": "Δεύτερον, αναλαμβάνοντας δουλειά μερικής απασχόλησης, σίγουρα πρέπει να είναι υπεύθυνοι για οτιδήποτε έχουν κάνει.",
                "stance": [
                    {
                        "id": "A2",
                        "type": "For"
                    }
                ]
            },
            {
                "id": "T9",
                "type": "Premise",
                "starts": "1264",
                "ends": "1387",
                "segment": "Για παράδειγμα, εάν ένας μαθητής πάρει δουλειά σε μια εταιρεία αλλά συχνά καθυστερεί για δουλειά, η εταιρεία μπορεί να μειώσει την πληρωμή του ή ακόμη και να τον απολύσει."
            },
            {
                "id": "T10",
                "type": "Premise",
                "starts": "1389",
                "ends": "1473",
                "segment": "Για να συγκρίνουν με τη σχολική ζωή, μπορεί να υποστούν μόνο μια μικρή τιμωρία στο σχολείο."
            },
            {
                "id": "T11",
                "type": "Premise",
                "starts": "1475",
                "ends": "1581",
                "segment": "Υπό αυτές τις συνθήκες, θα μάθει ότι πρέπει να υπακούει στον κανόνα και να αναλαμβάνει την ευθύνη για τη δουλειά τους."
            },
            {
                "id": "T12",
                "type": "Claim",
                "starts": "1598",
                "ends": "1699",
                "segment": "Συμπερασματικά, για να βοηθήσουν τα παιδιά τους να προσαρμόσουν τη ζωή των ενηλίκων, οι γονείς θα πρέπει να τους αφήσουν να την βιώσουν όσο μπορούν.",
                "stance": [
                    {
                        "id": "A3",
                        "type": "For"
                    }
                ]
            },
            {
                "id": "T13",
                "type": "MajorClaim",
                "starts": "1733",
                "ends": "1834",
                "segment": "Λόγω των παραπάνω λόγων, η ενθάρρυνση των παιδιών που εργάζονται με μερική απασχόληση είναι μια καλή επιλογή για να προετοιμαστούν για την ενήλικη ζωή."
            }
        ],
        "Relations": [
            {
                "id": "R1",
                "type": "supports",
                "arg1": "T3",
                "arg2": "T6"
            },
            {
                "id": "R2",
                "type": "supports",
                "arg1": "T4",
                "arg2": "T6"
            },
            {
                "id": "R3",
                "type": "supports",
                "arg1": "T5",
                "arg2": "T6"
            },
            {
                "id": "R4",
                "type": "supports",
                "arg1": "T6",
                "arg2": "T2"
            },
            {
                "id": "R5",
                "type": "supports",
                "arg1": "T7",
                "arg2": "T2"
            },
            {
                "id": "R6",
                "type": "supports",
                "arg1": "T9",
                "arg2": "T8"
            },
            {
                "id": "R7",
                "type": "supports",
                "arg1": "T10",
                "arg2": "T8"
            },
            {
                "id": "R8",
                "type": "supports",
                "arg1": "T11",
                "arg2": "T8"
            }
        ]
    },
    "content": "Οι γονείς μπορούν να βοηθήσουν τα εφηβικά τους παιδιά να προετοιμαστούν για την ενήλικη ζωή Σήμερα, η κοινωνία έχει γίνει εξαιρετικά ανταγωνιστική από ποτέ, οι γονείς έχουν την ευθύνη να διδάξουν στα παιδιά τους να επιβιώσουν και να είναι ανεξάρτητοι από αυτά, όπως τα ζώα διδάσκουν τις ικανότητές τους να βρίσκουν τροφές. Οι γονείς μπορούν να χρησιμοποιήσουν πολλές μεθόδους για να τους καθοδηγήσουν για να το επιτύχουν αυτό, για παράδειγμα, ζητώντας τους να κάνουν κάποια οικιακή εργασία ή να καθαρίσουν τα δωμάτια μόνα τους. Κατά την άποψή μου, συμφωνώ ότι είναι ο καλύτερος τρόπος για τα εφηβικά παιδιά να πάρουν μερική απασχόληση για να προετοιμάσουν την ενήλικη ζωή τους για διάφορους λόγους. Πρώτα απ &#39;όλα, όταν τα παιδιά παίρνουν δουλειά, είναι σε θέση να κερδίζουν χρήματα από μόνα τους, αντί να παίρνουν χρήματα από τους γονείς τους. Έτσι, είναι μια ευκαιρία να μάθετε πώς να χειρίζεστε χρήματα. Για παράδειγμα, όταν ήμουν 16 ετών, βρήκα δουλειά κατά τη διάρκεια των θερινών διακοπών και κέρδισα κάποια χρήματα από μόνα μου. Στην αρχή του εξαμήνου, μου είπαν να αγοράσω ένα βιβλίο. Δυστυχώς, πέρασα το μεγαλύτερο μέρος του μισθού μου με τον φίλο μου. Επομένως, κατάλαβα τελικά ότι έπρεπε να μάθω να κάνω ένα σχέδιο πριν ξοδέψω τα χρήματά μου και αυτό με επηρέασε στη ζωή μου τώρα. Δεύτερον, αναλαμβάνοντας δουλειά μερικής απασχόλησης, σίγουρα πρέπει να είναι υπεύθυνοι για οτιδήποτε έχουν κάνει. Για παράδειγμα, εάν ένας μαθητής πάρει δουλειά σε μια εταιρεία αλλά συχνά καθυστερεί για δουλειά, η εταιρεία μπορεί να μειώσει την πληρωμή του ή ακόμη και να τον απολύσει. Για να συγκρίνουν με τη σχολική ζωή, μπορεί να υποστούν μόνο μια μικρή τιμωρία στο σχολείο. Υπό αυτές τις συνθήκες, θα μάθει ότι πρέπει να υπακούει στον κανόνα και να αναλαμβάνει την ευθύνη για τη δουλειά τους. Συμπερασματικά, για να βοηθήσουν τα παιδιά τους να προσαρμόσουν τη ζωή των ενηλίκων, οι γονείς θα πρέπει να τους αφήσουν να την βιώσουν όσο μπορούν. Λόγω των παραπάνω λόγων, η ενθάρρυνση των παιδιών που εργάζονται με μερική απασχόληση είναι μια καλή επιλογή για να προετοιμαστούν για την ενήλικη ζωή."
}