{
    "id": "2f4dbfa4eaeacbdb1b8aad0d83960a65",
    "link": "",
    "description": "",
    "date": "",
    "tags": [],
    "publishedAt": "",
    "crawledAt": "",
    "domain": "",
    "netloc": "",
    "annotations": {
        "ADUs": [
            {
                "id": "T1",
                "type": "MajorClaim",
                "starts": "424",
                "ends": "548",
                "segment": "γλώσσας σε όλο τον κόσμο είναι μια θετική αλλαγή που βοηθά τον κόσμο να γίνει ένα καλύτερο μέρος για να ζήσει."
            },
            {
                "id": "T2",
                "type": "MajorClaim",
                "starts": "1817",
                "ends": "1903",
                "segment": "Εν κατακλείδι, πιστεύω ότι η αλλαγή είναι αναπόφευκτη και ότι η χρήση μιας γλώσσας σε όλο τον κόσμο είναι θετική."
            },
            {
                "id": "T3",
                "type": "Claim",
                "starts": "1971",
                "ends": "2087",
                "segment": "Η επικοινωνία σε μία γλώσσα θα βελτιώσει την παραγωγικότητα του κόσμου και θα φέρει όλους στην ίδια σελίδα.",
                "stance": [
                    {
                        "id": "A1",
                        "type": "For"
                    }
                ]
            },
            {
                "id": "T4",
                "type": "Claim",
                "starts": "550",
                "ends": "628",
                "segment": "Λόγω της παγκοσμιοποίησης, πολλοί άνθρωποι ταξιδεύουν για επαγγελματικά ταξίδια.",
                "stance": [
                    {
                        "id": "A2",
                        "type": "For"
                    }
                ]
            },
            {
                "id": "T5",
                "type": "Premise",
                "starts": "630",
                "ends": "700",
                "segment": "Έτσι, η επικοινωνία σε μία γλώσσα θα μειώσει τα προβλήματα των ταξιδιωτών σε καθημερινές δραστηριότητες, όπως η παραγγελία φαγητού σε ένα εστιατόριο ή η περιήγηση σε μέρη."
            },
            {
                "id": "T6",
                "type": "Premise",
                "starts": "706",
                "ends": "857",
                "segment": "θα μειώσει τα προβλήματα των ταξιδιωτών σε καθημερινές δραστηριότητες, όπως η παραγγελία φαγητού σε ένα εστιατόριο ή η περιήγηση σε μέρη."
            },
            {
                "id": "T7",
                "type": "Premise",
                "starts": "872",
                "ends": "956",
                "segment": "μεταναστεύουν για καλύτερη εκπαίδευση δεν θα έπρεπε να περάσουν από άγχος, καθώς μπορούν εύκολα να κάνουν νέους φίλους και μπορούν να συμμετέχουν σε οποιεσδήποτε συζητήσεις που διαφορετικά δεν είναι δυνατές σε έναν κόσμο με πολλές γλώσσες."
            },
            {
                "id": "T8",
                "type": "Premise",
                "starts": "960",
                "ends": "1151",
                "segment": "Αυτό με τη σειρά του καθιστά εύκολη την προσαρμογή σε νέο περιβάλλον."
            },
            {
                "id": "T9",
                "type": "Premise",
                "starts": "1153",
                "ends": "1214",
                "segment": "μειώνει επίσης τις παρεξηγήσεις μεταξύ των ανθρώπων."
            },
            {
                "id": "T10",
                "type": "Premise",
                "starts": "1232",
                "ends": "1347",
                "segment": "θα ήταν ευκολότερη."
            },
            {
                "id": "T11",
                "type": "Claim",
                "starts": "1368",
                "ends": "1422",
                "segment": "Αυτές οι γλώσσες είναι η βάση για την προέλευση και την αρχική επικοινωνία μεταξύ διαφορετικών πολιτισμών.",
                "stance": [
                    {
                        "id": "A3",
                        "type": "For"
                    }
                ]
            },
            {
                "id": "T12",
                "type": "Premise",
                "starts": "1424",
                "ends": "1526",
                "segment": "γλώσσες είναι η βάση για την προέλευση και την αρχική επικοινωνία μεταξύ διαφορετικών πολιτισμών."
            },
            {
                "id": "T13",
                "type": "Premise",
                "starts": "1528",
                "ends": "1556",
                "segment": "Αντιπροσωπεύουν τον τοπικό πολιτισμό."
            },
            {
                "id": "T14",
                "type": "Premise",
                "starts": "1558",
                "ends": "1632",
                "segment": "Καθώς η χρήση αυτών των γλωσσών μειώνεται, ο πολιτισμός αλλάζει επίσης ανάλογα."
            },
            {
                "id": "T15",
                "type": "Premise",
                "starts": "1643",
                "ends": "1792",
                "segment": "όλη η λογοτεχνία και τα σενάρια της παλιάς εποχής θα είναι αδύνατο να αποκρυπτογραφηθεί εάν χαθούν αυτές οι γλώσσες."
            }
        ],
        "Relations": [
            {
                "id": "R1",
                "type": "supports",
                "arg1": "T5",
                "arg2": "T6"
            },
            {
                "id": "R2",
                "type": "supports",
                "arg1": "T8",
                "arg2": "T7"
            },
            {
                "id": "R3",
                "type": "supports",
                "arg1": "T6",
                "arg2": "T4"
            },
            {
                "id": "R4",
                "type": "supports",
                "arg1": "T7",
                "arg2": "T4"
            },
            {
                "id": "R5",
                "type": "supports",
                "arg1": "T9",
                "arg2": "T4"
            },
            {
                "id": "R6",
                "type": "supports",
                "arg1": "T10",
                "arg2": "T4"
            },
            {
                "id": "R7",
                "type": "supports",
                "arg1": "T12",
                "arg2": "T11"
            },
            {
                "id": "R8",
                "type": "supports",
                "arg1": "T13",
                "arg2": "T12"
            },
            {
                "id": "R9",
                "type": "supports",
                "arg1": "T14",
                "arg2": "T11"
            },
            {
                "id": "R10",
                "type": "supports",
                "arg1": "T15",
                "arg2": "T11"
            }
        ]
    },
    "content": "Διάφορες τοπικές γλώσσες εξαφανίζονται Σήμερα, τα Αγγλικά χρησιμοποιούνται συνήθως σε ολόκληρο τον κόσμο. Η χρήση του αυξάνεται μέρα με τη μέρα. Κατά συνέπεια, διάφορες τοπικές γλώσσες εξαφανίζονται. Ορισμένοι υποστηρίζουν ότι αυτή είναι μια θετική αλλαγή και θα βοηθούσε τους ανθρώπους να επικοινωνούν εύκολα. Ενώ υπάρχουν άλλοι που διαφωνούν με αυτό και ανησυχούν περισσότερο για το θάνατο των τοπικών γλωσσών. Κατά τη γνώμη μου, πιστεύω ότι η χρήση μιας γλώσσας σε όλο τον κόσμο είναι μια θετική αλλαγή που βοηθά τον κόσμο να γίνει ένα καλύτερο μέρος για να ζήσει. Ένας κόσμος με λιγότερες γλώσσες μας βοηθά να αλληλεπιδρούμε καλύτερα μεταξύ μας. Λόγω της παγκοσμιοποίησης, πολλοί άνθρωποι ταξιδεύουν για επαγγελματικά ταξίδια. Έτσι, η επικοινωνία σε μία γλώσσα θα μειώσει τα προβλήματα των ταξιδιωτών σε καθημερινές δραστηριότητες, όπως η παραγγελία φαγητού σε ένα εστιατόριο ή η περιήγηση σε μέρη. Επιπλέον, οι μαθητές που μεταναστεύουν για καλύτερη εκπαίδευση δεν θα έπρεπε να περάσουν από άγχος, καθώς μπορούν εύκολα να κάνουν νέους φίλους και μπορούν να συμμετέχουν σε οποιεσδήποτε συζητήσεις που διαφορετικά δεν είναι δυνατές σε έναν κόσμο με πολλές γλώσσες. Αυτό με τη σειρά του καθιστά εύκολη την προσαρμογή σε νέο περιβάλλον. Η ενιαία γλώσσα μειώνει επίσης τις παρεξηγήσεις μεταξύ των ανθρώπων. Επιπλέον, η ανταλλαγή γνώσεων σε διάφορους τομείς έρευνας όπως ηλεκτρονική, ιατρική, αστρονομία κ.λπ. θα ήταν ευκολότερη. Από την άλλη πλευρά, λίγοι άνθρωποι ανησυχούν για τις τοπικές γλώσσες που πεθαίνουν. Αυτές οι γλώσσες είναι η βάση για την προέλευση και την αρχική επικοινωνία μεταξύ διαφορετικών πολιτισμών. Αντιπροσωπεύουν τον τοπικό πολιτισμό. Καθώς η χρήση αυτών των γλωσσών μειώνεται, ο πολιτισμός αλλάζει επίσης ανάλογα. Επιπλέον, αυτές οι γλώσσες συνδέονται στενά με την ιστορία. όλη η λογοτεχνία και τα σενάρια της παλιάς εποχής θα είναι αδύνατο να αποκρυπτογραφηθεί εάν χαθούν αυτές οι γλώσσες. Εν κατακλείδι, πιστεύω ότι η αλλαγή είναι αναπόφευκτη και ότι η χρήση μιας γλώσσας σε όλο τον κόσμο είναι θετική. Πρέπει να αποδεχτούμε αυτές τις αλλαγές για να είναι ένας κόσμος καλύτερος χώρος. Η επικοινωνία σε μία γλώσσα θα βελτιώσει την παραγωγικότητα του κόσμου και θα φέρει όλους στην ίδια σελίδα."
}