{
    "id": "a99cc9459eb787c9f8b8248cec394890",
    "link": "",
    "description": "",
    "date": "",
    "tags": [],
    "publishedAt": "",
    "crawledAt": "",
    "domain": "",
    "netloc": "",
    "annotations": {
        "ADUs": [
            {
                "id": "T1",
                "type": "Claim",
                "starts": "222",
                "ends": "278",
                "segment": "Τα ιστορικά κτίρια δείχνουν την ιστορία των προγόνων μας.",
                "stance": [
                    {
                        "id": "A1",
                        "type": "For"
                    }
                ]
            },
            {
                "id": "T2",
                "type": "Claim",
                "starts": "293",
                "ends": "351",
                "segment": "Επιπλέον, μπορούν να αναπτύξουν τουριστικές βιομηχανίες προσελκύοντας τουρίστες.",
                "stance": [
                    {
                        "id": "A2",
                        "type": "For"
                    }
                ]
            },
            {
                "id": "T3",
                "type": "MajorClaim",
                "starts": "1414",
                "ends": "1463",
                "segment": "Αυτοί είναι οι λόγοι για τους οποίους πρέπει να διατηρήσουμε ιστορικά κτίρια στην πόλη."
            },
            {
                "id": "T4",
                "type": "Claim",
                "starts": "1465",
                "ends": "1527",
                "segment": "οποίους πρέπει να διατηρήσουμε ιστορικά κτίρια στην πόλη.",
                "stance": [
                    {
                        "id": "A3",
                        "type": "For"
                    }
                ]
            },
            {
                "id": "T5",
                "type": "Claim",
                "starts": "1539",
                "ends": "1639",
                "segment": "Επιπλέον, είναι τα σύμβολα των εθνών μας, τα οποία μπορούν να δείξουν την ιστορική κουλτούρα των προηγούμενων προγόνων μας.",
                "stance": [
                    {
                        "id": "A4",
                        "type": "For"
                    }
                ]
            },
            {
                "id": "T7",
                "type": "Claim",
                "starts": "354",
                "ends": "511",
                "segment": "Τα ιστορικά κτίρια απαντούν σε πολλές ερωτήσεις, που είναι μυστηριώδεις για τους προηγούμενους προγόνους μας.",
                "stance": [
                    {
                        "id": "A5",
                        "type": "For"
                    }
                ]
            },
            {
                "id": "T8",
                "type": "Premise",
                "starts": "513",
                "ends": "592",
                "segment": "Δείχνουν την ιστορία των εθνών και των προηγούμενων γενεών που έζησαν στην πόλη."
            },
            {
                "id": "T9",
                "type": "Premise",
                "starts": "594",
                "ends": "663",
                "segment": "Δείχνουν τον τρόπο ζωής των ανθρώπων που έζησαν πριν από χιλιάδες χρόνια."
            },
            {
                "id": "T10",
                "type": "Premise",
                "starts": "665",
                "ends": "729",
                "segment": "Μας δείχνουν πώς επιβιώνουν, ή πώς υπερασπίζονται τον εαυτό τους κλπ."
            },
            {
                "id": "T11",
                "type": "Premise",
                "starts": "731",
                "ends": "843",
                "segment": "Ερευνώντας για τις δομές τους, μπορούμε να καταλάβουμε πόσα γνώριζαν για την αρχιτεκτονική του κτιρίου."
            },
            {
                "id": "T12",
                "type": "Premise",
                "starts": "864",
                "ends": "955",
                "segment": "τα ιστορικά κτίρια είναι σημαντικοί θησαυροί, οι οποίοι παρέχουν μια περιοχή για την εκμάθηση πολύτιμων μαθημάτων."
            },
            {
                "id": "T13",
                "type": "Premise",
                "starts": "1161",
                "ends": "1259",
                "segment": "Ως εκ τούτου, είναι πολύτιμες ευκαιρίες για κάθε πόλη που έχει ιστορικά κτίρια για να τα δείξει σε νέους επισκέπτες."
            },
            {
                "id": "T14",
                "type": "Premise",
                "starts": "1058",
                "ends": "1148",
                "segment": "Είναι ενδιαφέρον για τους περισσότερους ανθρώπους να γνωρίζουν για τον τρόπο ζωής των ανθρώπων πριν από χιλιάδες χρόνια."
            },
            {
                "id": "T15",
                "type": "Claim",
                "starts": "958",
                "ends": "1056",
                "segment": "Ένα άλλο πλεονέκτημα των ιστορικών κτιρίων είναι η ικανότητά τους να προσελκύουν περισσότερους τουρίστες στην πόλη.",
                "stance": [
                    {
                        "id": "A6",
                        "type": "For"
                    }
                ]
            },
            {
                "id": "T16",
                "type": "Premise",
                "starts": "1261",
                "ends": "1384",
                "segment": "Το ιστορικό κτίριο μπορεί να αναπτύξει άλλες βιομηχανίες όπως εστιατόρια ή άλλες βιομηχανίες τροφίμων και χειροτεχνήματα και ούτω καθεξής."
            },
            {
                "id": "T6",
                "type": "MajorClaim",
                "starts": "92",
                "ends": "220",
                "segment": "Είναι σημαντικό για κάθε πόλη να αντικαταστήσει τα παλιά κτίρια με καινούργια, αλλά αυτές οι επαναστάσεις δεν πρέπει να περιλαμβάνουν ιστορικά κτίρια."
            }
        ],
        "Relations": [
            {
                "id": "R1",
                "type": "supports",
                "arg1": "T8",
                "arg2": "T7"
            },
            {
                "id": "R2",
                "type": "supports",
                "arg1": "T9",
                "arg2": "T7"
            },
            {
                "id": "R3",
                "type": "supports",
                "arg1": "T10",
                "arg2": "T7"
            },
            {
                "id": "R4",
                "type": "supports",
                "arg1": "T11",
                "arg2": "T7"
            },
            {
                "id": "R5",
                "type": "supports",
                "arg1": "T12",
                "arg2": "T7"
            },
            {
                "id": "R6",
                "type": "supports",
                "arg1": "T14",
                "arg2": "T13"
            },
            {
                "id": "R7",
                "type": "supports",
                "arg1": "T16",
                "arg2": "T15"
            },
            {
                "id": "R8",
                "type": "supports",
                "arg1": "T13",
                "arg2": "T15"
            }
        ]
    },
    "content": "Η αντικατάσταση παλαιών κτιρίων είναι σημαντική για οποιαδήποτε πόλη, αλλά δεν πρέπει να επηρεάζει τα ιστορικά σπίτια. Είναι σημαντικό για κάθε πόλη να αντικαταστήσει τα παλιά κτίρια με καινούργια, αλλά αυτές οι επαναστάσεις δεν πρέπει να περιλαμβάνουν ιστορικά κτίρια. Τα ιστορικά κτίρια δείχνουν την ιστορία των προγόνων μας. Επιπλέον, μπορούν να αναπτύξουν τουριστικές βιομηχανίες προσελκύοντας τουρίστες. Τα ιστορικά κτίρια απαντούν σε πολλές ερωτήσεις, που είναι μυστηριώδεις για τους προηγούμενους προγόνους μας. Επομένως κανείς δεν μπορεί να καθορίσει την τιμή των ιστορικών κτιρίων. Δείχνουν την ιστορία των εθνών και των προηγούμενων γενεών που έζησαν στην πόλη. Δείχνουν τον τρόπο ζωής των ανθρώπων που έζησαν πριν από χιλιάδες χρόνια. Μας δείχνουν πώς επιβιώνουν, ή πώς υπερασπίζονται τον εαυτό τους κλπ. Ερευνώντας για τις δομές τους, μπορούμε να καταλάβουμε πόσα γνώριζαν για την αρχιτεκτονική του κτιρίου. Από την άλλη πλευρά, τα ιστορικά κτίρια είναι σημαντικοί θησαυροί, οι οποίοι παρέχουν μια περιοχή για την εκμάθηση πολύτιμων μαθημάτων. Ένα άλλο πλεονέκτημα των ιστορικών κτιρίων είναι η ικανότητά τους να προσελκύουν περισσότερους τουρίστες στην πόλη. Είναι ενδιαφέρον για τους περισσότερους ανθρώπους να γνωρίζουν για τον τρόπο ζωής των ανθρώπων πριν από χιλιάδες χρόνια. Ως εκ τούτου, είναι πολύτιμες ευκαιρίες για κάθε πόλη που έχει ιστορικά κτίρια για να τα δείξει σε νέους επισκέπτες. Το ιστορικό κτίριο μπορεί να αναπτύξει άλλες βιομηχανίες όπως εστιατόρια ή άλλες βιομηχανίες τροφίμων και χειροτεχνήματα και ούτω καθεξής. Αυτοί είναι οι λόγοι για τους οποίους πρέπει να διατηρήσουμε ιστορικά κτίρια στην πόλη. Μπορούν να μας ωφελήσουν οικονομικά αναπτύσσοντας άλλες βιομηχανίες. Επιπλέον, είναι τα σύμβολα των εθνών μας, τα οποία μπορούν να δείξουν την ιστορική κουλτούρα των προηγούμενων προγόνων μας."
}