{
    "id": "9eb16d609ea17cabafa41c039f8db542",
    "link": "",
    "description": "",
    "date": "",
    "tags": [],
    "publishedAt": "",
    "crawledAt": "",
    "domain": "",
    "netloc": "",
    "annotations": {
        "ADUs": [
            {
                "id": "T1",
                "type": "MajorClaim",
                "starts": "1542",
                "ends": "1583",
                "segment": "Συμπερασματικά, πιστεύω προσωπικά ότι τα ανθρώπινα όντα πρέπει να ταξιδεύουν στο διάστημα."
            },
            {
                "id": "T2",
                "type": "MajorClaim",
                "starts": "437",
                "ends": "501",
                "segment": "Πρώτον, πολλά στοιχεία για το ηλιακό σύστημα μπορούν να ανακαλυφθούν."
            },
            {
                "id": "T3",
                "type": "Claim",
                "starts": "512",
                "ends": "559",
                "segment": "Για παράδειγμα, μια εικόνα του πλανήτη Γη απέδειξε ότι η γη είναι στρογγυλή, όχι επίπεδη.",
                "stance": [
                    {
                        "id": "A1",
                        "type": "For"
                    }
                ]
            },
            {
                "id": "T4",
                "type": "Premise",
                "starts": "575",
                "ends": "641",
                "segment": "του πλανήτη Γη απέδειξε ότι η γη είναι στρογγυλή, όχι επίπεδη."
            },
            {
                "id": "T5",
                "type": "Premise",
                "starts": "667",
                "ends": "724",
                "segment": "η γη που περιστρέφεται γύρω από τον ήλιο και όχι το αντίστροφο."
            },
            {
                "id": "T6",
                "type": "Premise",
                "starts": "726",
                "ends": "798",
                "segment": "Εάν δεν ήταν για την εξερεύνηση του διαστήματος, δεν θα γνωρίζαμε ποτέ αυτά τα γεγονότα."
            },
            {
                "id": "T7",
                "type": "Claim",
                "starts": "810",
                "ends": "860",
                "segment": "Δεύτερον, οι άνθρωποι μπορούν να γνωρίζουν περισσότερα για τον ίδιο τον πλανήτη Γη.",
                "stance": [
                    {
                        "id": "A2",
                        "type": "For"
                    }
                ]
            },
            {
                "id": "T8",
                "type": "Premise",
                "starts": "862",
                "ends": "991",
                "segment": "Παρατηρώντας τον πλανήτη Γη από το διάστημα, οι άνθρωποι μπορούν να ανακαλύψουν άφθονα πράγματα για παράδειγμα για την ατμόσφαιρα του πλανήτη Γη."
            },
            {
                "id": "T9",
                "type": "Premise",
                "starts": "993",
                "ends": "1090",
                "segment": "Με αυτήν τη γνώση, οι άνθρωποι μπορούν να εργαστούν σε κάτι για να αποτρέψουν τους κινδύνους της γης, όπως η υπερθέρμανση του πλανήτη."
            },
            {
                "id": "T10",
                "type": "Claim",
                "starts": "1101",
                "ends": "1157",
                "segment": "για να αποτρέψουν τους κινδύνους της γης, όπως η υπερθέρμανση του πλανήτη.",
                "stance": [
                    {
                        "id": "A3",
                        "type": "For"
                    }
                ]
            },
            {
                "id": "T11",
                "type": "Premise",
                "starts": "1159",
                "ends": "1308",
                "segment": "Τέλος, πολλές εξελιγμένες τεχνολογίες μπορούν να επινοηθούν."
            },
            {
                "id": "T12",
                "type": "Premise",
                "starts": "1310",
                "ends": "1399",
                "segment": "Οι δεξαμενές οξυγόνου, για παράδειγμα, αποδεικνύονται χρήσιμες όχι μόνο στο διάστημα αλλά και στο νερό."
            },
            {
                "id": "T13",
                "type": "Premise",
                "starts": "1411",
                "ends": "1499",
                "segment": "Επιπλέον, τα διαστημόπλοια, οι δορυφόροι επικοινωνίας και οι διαστημικοί στυλό συμβάλλουν επίσης πολύ στην κοινωνία."
            }
        ],
        "Relations": [
            {
                "id": "R1",
                "type": "supports",
                "arg1": "T4",
                "arg2": "T3"
            },
            {
                "id": "R2",
                "type": "supports",
                "arg1": "T5",
                "arg2": "T3"
            },
            {
                "id": "R3",
                "type": "supports",
                "arg1": "T6",
                "arg2": "T3"
            },
            {
                "id": "R4",
                "type": "supports",
                "arg1": "T8",
                "arg2": "T7"
            },
            {
                "id": "R5",
                "type": "supports",
                "arg1": "T9",
                "arg2": "T7"
            },
            {
                "id": "R6",
                "type": "supports",
                "arg1": "T11",
                "arg2": "T10"
            },
            {
                "id": "R7",
                "type": "supports",
                "arg1": "T12",
                "arg2": "T10"
            },
            {
                "id": "R8",
                "type": "supports",
                "arg1": "T13",
                "arg2": "T10"
            }
        ]
    },
    "content": "Γιατί τα ανθρώπινα όντα πρέπει να ταξιδεύουν στο διάστημα; Για πολλούς αιώνες, το διάστημα ήταν ένα από τα πιο ευνοϊκά πεδία μελέτης. Οι διαστημικές αποστολές έχουν ξεκινήσει και πολλές ήταν επιτυχημένες. Ωστόσο, πολλοί άνθρωποι εξακολουθούν να θεωρούν την εξερεύνηση του διαστήματος ως πράξη σπατάλης χρημάτων, για παράδειγμα, οι αστροναύτες έφεραν άχρηστα πετρώματα στον πλανήτη Γη παρά το μεγάλο χρηματικό ποσό που δαπανήθηκε στον εξοπλισμό τους. Από την άλλη πλευρά, υπάρχουν ορισμένοι λόγοι για τα ανθρώπινα όντα να ταξιδεύουν στο διάστημα. Πρώτον, πολλά στοιχεία για το ηλιακό σύστημα μπορούν να ανακαλυφθούν. Για παράδειγμα, μια εικόνα του πλανήτη Γη απέδειξε ότι η γη είναι στρογγυλή, όχι επίπεδη. Ένα άλλο παράδειγμα είναι ότι είναι η γη που περιστρέφεται γύρω από τον ήλιο και όχι το αντίστροφο. Εάν δεν ήταν για την εξερεύνηση του διαστήματος, δεν θα γνωρίζαμε ποτέ αυτά τα γεγονότα. Δεύτερον, οι άνθρωποι μπορούν να γνωρίζουν περισσότερα για τον ίδιο τον πλανήτη Γη. Παρατηρώντας τον πλανήτη Γη από το διάστημα, οι άνθρωποι μπορούν να ανακαλύψουν άφθονα πράγματα για παράδειγμα για την ατμόσφαιρα του πλανήτη Γη. Με αυτήν τη γνώση, οι άνθρωποι μπορούν να εργαστούν σε κάτι για να αποτρέψουν τους κινδύνους της γης, όπως η υπερθέρμανση του πλανήτη. Τέλος, πολλές εξελιγμένες τεχνολογίες μπορούν να επινοηθούν. Καθώς οι αστροναύτες πρέπει να ταξιδεύουν στο διάστημα που δεν έχει οξυγόνο για να εισπνεύσουν, οι επιστήμονες είναι υποχρεωμένοι να κάνουν έρευνα σχετικά με τις δεξαμενές οξυγόνου. Οι δεξαμενές οξυγόνου, για παράδειγμα, αποδεικνύονται χρήσιμες όχι μόνο στο διάστημα αλλά και στο νερό. Επιπλέον, τα διαστημόπλοια, οι δορυφόροι επικοινωνίας και οι διαστημικοί στυλό συμβάλλουν επίσης πολύ στην κοινωνία. Συμπερασματικά, πιστεύω προσωπικά ότι τα ανθρώπινα όντα πρέπει να ταξιδεύουν στο διάστημα. Παρά το κόστος μιας περιουσίας, η εξερεύνηση του διαστήματος έχει δώσει τα προαναφερθέντα οφέλη."
}