{
    "id": "c9a4190c0a013821d0eb96f856873c3f",
    "link": "",
    "description": "",
    "date": "",
    "tags": [],
    "publishedAt": "",
    "crawledAt": "",
    "domain": "",
    "netloc": "",
    "annotations": {
        "ADUs": [
            {
                "id": "T1",
                "type": "Claim",
                "starts": "294",
                "ends": "383",
                "segment": "Σύμφωνα με τη γνώμη μου, επειδή είναι πανεπιστημιακό επίπεδο εκπαίδευσης, οι μαθητές έχουν αρκετή ωριμότητα για να επιλέξουν την επιλογή τους.",
                "stance": [
                    {
                        "id": "A1",
                        "type": "For"
                    }
                ]
            },
            {
                "id": "T2",
                "type": "MajorClaim",
                "starts": "418",
                "ends": "470",
                "segment": "Επομένως, συμφωνώ απόλυτα ότι η μετάβαση στα μαθήματα πρέπει να είναι προαιρετική για τους μαθητές."
            },
            {
                "id": "T3",
                "type": "Premise",
                "starts": "551",
                "ends": "659",
                "segment": "Για παράδειγμα, ορισμένοι λέκτορες στο πανεπιστήμιο μας διαβάζουν το ίδιο κείμενο στα βιβλία αναφοράς για τη συγκεκριμένη ενότητα μαθημάτων."
            },
            {
                "id": "T4",
                "type": "Premise",
                "starts": "670",
                "ends": "741",
                "segment": "Επιπλέον, δεν εξήγησαν το περιεχόμενο για να το κατανοήσουν οι μαθητές."
            },
            {
                "id": "T5",
                "type": "Claim",
                "starts": "816",
                "ends": "877",
                "segment": "έχουν μεγαλώσει, έχουν αρκετή ικανότητα να διαβάζουν και να κατανοούν το βιβλίο.",
                "stance": [
                    {
                        "id": "A2",
                        "type": "For"
                    }
                ]
            },
            {
                "id": "T6",
                "type": "Premise",
                "starts": "777",
                "ends": "814",
                "segment": "Επειδή οι φοιτητές πανεπιστημίου έχουν μεγαλώσει, έχουν αρκετή ικανότητα να διαβάζουν και να κατανοούν το βιβλίο."
            },
            {
                "id": "T7",
                "type": "Claim",
                "starts": "889",
                "ends": "977",
                "segment": "Επιπλέον, με τη σύγχρονη τεχνολογία, οι μαθητές μπορούν να συλλέξουν περισσότερες πληροφορίες από διαφορετικές πηγές.",
                "stance": [
                    {
                        "id": "A3",
                        "type": "For"
                    }
                ]
            },
            {
                "id": "T8",
                "type": "Premise",
                "starts": "992",
                "ends": "1130",
                "segment": "Για παράδειγμα, από το Διαδίκτυο, οι μαθητές μπορούν να διαβάσουν πολλά άρθρα και ηλεκτρονικά βιβλία και να παρακολουθήσουν μαθήματα βίντεο που παρέχουν τις πληροφορίες πιο προφανώς."
            },
            {
                "id": "T9",
                "type": "Claim",
                "starts": "1141",
                "ends": "1209",
                "segment": "Ωστόσο, ορισμένοι ομιλητές παραδίδουν διαλέξεις με πολύ ενημερωτικό και ενδιαφέρον τρόπο.",
                "stance": [
                    {
                        "id": "A4",
                        "type": "Against"
                    }
                ]
            },
            {
                "id": "T10",
                "type": "Premise",
                "starts": "1211",
                "ends": "1332",
                "segment": "Όταν οι μαθητές παρακολουθούν αυτές τις διαλέξεις, μπορούν προφανώς να αισθάνονται ότι ήταν πολύ χρήσιμο και ότι δεν χάθηκαν το χρόνο τους."
            },
            {
                "id": "T11",
                "type": "Claim",
                "starts": "487",
                "ends": "535",
                "segment": "Κατ &#39;αρχάς, το να πηγαίνετε σε μαθήματα είναι μερικές φορές χάσιμο χρόνου.",
                "stance": [
                    {
                        "id": "A5",
                        "type": "For"
                    }
                ]
            },
            {
                "id": "T12",
                "type": "Premise",
                "starts": "743",
                "ends": "767",
                "segment": "για να το κατανοήσουν οι μαθητές."
            },
            {
                "id": "T13",
                "type": "Claim",
                "starts": "1665",
                "ends": "1820",
                "segment": "Ταυτόχρονα, αντί να παρευρεθούν σε βαρετές λέκτορες, οι μαθητές μπορούν να συμμετάσχουν σε άλλες δραστηριότητες όπως διαγωνισμός συζήτησης, κολύμβηση, μπάσκετ και ούτω καθεξής.",
                "stance": [
                    {
                        "id": "A7",
                        "type": "For"
                    }
                ]
            },
            {
                "id": "T14",
                "type": "Premise",
                "starts": "1413",
                "ends": "1523",
                "segment": "Εκτός αυτού, οι περισσότεροι φοιτητές πανεπιστημίου εργάζονται φοιτητές προκειμένου να διαχειριστούν τα έξοδα κατά τη διάρκεια της εκπαίδευσης."
            },
            {
                "id": "T15",
                "type": "Premise",
                "starts": "1525",
                "ends": "1565",
                "segment": "εργάζονται φοιτητές προκειμένου να διαχειριστούν τα έξοδα κατά τη διάρκεια της εκπαίδευσης."
            },
            {
                "id": "T16",
                "type": "Claim",
                "starts": "1574",
                "ends": "1645",
                "segment": "Οι μαθητές πρέπει να εργαστούν ως μερική απασχόληση.",
                "stance": [
                    {
                        "id": "A8",
                        "type": "For"
                    }
                ]
            },
            {
                "id": "T17",
                "type": "Premise",
                "starts": "1832",
                "ends": "1912",
                "segment": "συμμετάσχουν σε άλλες δραστηριότητες όπως διαγωνισμός συζήτησης, κολύμβηση, μπάσκετ και ούτω καθεξής."
            },
            {
                "id": "T18",
                "type": "Premise",
                "starts": "1348",
                "ends": "1402",
                "segment": "Επιπλέον, ως επί το πλείστον το πανεπιστήμιο έχει πάρει ολόκληρη την ημέρα για τις διαλέξεις."
            },
            {
                "id": "T19",
                "type": "MajorClaim",
                "starts": "2242",
                "ends": "2335",
                "segment": "Επομένως, για να κάνετε χρήση του χρόνου, εάν οι μαθητές επιλέξουν τα μαθήματα ως προαιρετικά, θα παρείχε περισσότερα οφέλη από τα μειονεκτήματα."
            },
            {
                "id": "T20",
                "type": "Claim",
                "starts": "1939",
                "ends": "1996",
                "segment": "άλλους φοιτητές πανεπιστημίου και να δημιουργήσουν τις σχέσεις μαζί τους.",
                "stance": [
                    {
                        "id": "A9",
                        "type": "Against"
                    }
                ]
            },
            {
                "id": "T21",
                "type": "Premise",
                "starts": "1998",
                "ends": "2070",
                "segment": "Με λίγα λόγια, αν και λίγοι λαμπροί ομιλητές παρέχουν πιο ενημερωτικές διαλέξεις, μερικοί βαρεθούν οι μαθητές στην τάξη και σπαταλούν το χρόνο των μαθητών."
            },
            {
                "id": "T22",
                "type": "Claim",
                "starts": "2072",
                "ends": "2149",
                "segment": "ενημερωτικές διαλέξεις, μερικοί βαρεθούν οι μαθητές στην τάξη και σπαταλούν το χρόνο των μαθητών.",
                "stance": [
                    {
                        "id": "A10",
                        "type": "For"
                    }
                ]
            },
            {
                "id": "T23",
                "type": "Claim",
                "starts": "2151",
                "ends": "2208",
                "segment": "Όταν οι φοιτητές πηγαίνουν στο πανεπιστήμιο, έχουν ωριμάσει διανοητικά και σωματικά.",
                "stance": [
                    {
                        "id": "A11",
                        "type": "For"
                    }
                ]
            }
        ],
        "Relations": [
            {
                "id": "R1",
                "type": "supports",
                "arg1": "T6",
                "arg2": "T5"
            },
            {
                "id": "R2",
                "type": "supports",
                "arg1": "T8",
                "arg2": "T7"
            },
            {
                "id": "R3",
                "type": "supports",
                "arg1": "T3",
                "arg2": "T11"
            },
            {
                "id": "R4",
                "type": "supports",
                "arg1": "T4",
                "arg2": "T11"
            },
            {
                "id": "R8",
                "type": "supports",
                "arg1": "T10",
                "arg2": "T9"
            },
            {
                "id": "R9",
                "type": "supports",
                "arg1": "T15",
                "arg2": "T16"
            },
            {
                "id": "R10",
                "type": "supports",
                "arg1": "T14",
                "arg2": "T16"
            },
            {
                "id": "R11",
                "type": "supports",
                "arg1": "T18",
                "arg2": "T16"
            },
            {
                "id": "R12",
                "type": "supports",
                "arg1": "T17",
                "arg2": "T13"
            },
            {
                "id": "R13",
                "type": "attacks",
                "arg1": "T21",
                "arg2": "T20"
            },
            {
                "id": "R5",
                "type": "supports",
                "arg1": "T12",
                "arg2": "T11"
            }
        ]
    },
    "content": "Η μετάβαση σε τάξεις θα πρέπει να είναι προαιρετική για τους φοιτητές Οι φοιτητές του Πανεπιστημίου έχουν διαφορετική γνώμη σχετικά με την παρουσία τους στην τάξη. Μερικοί μαθητές πιστεύουν ότι πρέπει να υποχρεούνται να παρακολουθούν μαθήματα, ενώ άλλοι πιστεύουν ότι είναι προαιρετικό για τους μαθητές. Σύμφωνα με τη γνώμη μου, επειδή είναι πανεπιστημιακό επίπεδο εκπαίδευσης, οι μαθητές έχουν αρκετή ωριμότητα για να επιλέξουν την επιλογή τους. Επομένως, συμφωνώ απόλυτα ότι η μετάβαση στα μαθήματα πρέπει να είναι προαιρετική για τους μαθητές. Κατ &#39;αρχάς, το να πηγαίνετε σε μαθήματα είναι μερικές φορές χάσιμο χρόνου. Για παράδειγμα, ορισμένοι λέκτορες στο πανεπιστήμιο μας διαβάζουν το ίδιο κείμενο στα βιβλία αναφοράς για τη συγκεκριμένη ενότητα μαθημάτων. Επιπλέον, δεν εξήγησαν το περιεχόμενο για να το κατανοήσουν οι μαθητές. Ήταν χάσιμο χρόνου. Επειδή οι φοιτητές πανεπιστημίου έχουν μεγαλώσει, έχουν αρκετή ικανότητα να διαβάζουν και να κατανοούν το βιβλίο. Επιπλέον, με τη σύγχρονη τεχνολογία, οι μαθητές μπορούν να συλλέξουν περισσότερες πληροφορίες από διαφορετικές πηγές. Για παράδειγμα, από το Διαδίκτυο, οι μαθητές μπορούν να διαβάσουν πολλά άρθρα και ηλεκτρονικά βιβλία και να παρακολουθήσουν μαθήματα βίντεο που παρέχουν τις πληροφορίες πιο προφανώς. Ωστόσο, ορισμένοι ομιλητές παραδίδουν διαλέξεις με πολύ ενημερωτικό και ενδιαφέρον τρόπο. Όταν οι μαθητές παρακολουθούν αυτές τις διαλέξεις, μπορούν προφανώς να αισθάνονται ότι ήταν πολύ χρήσιμο και ότι δεν χάθηκαν το χρόνο τους. Επιπλέον, ως επί το πλείστον το πανεπιστήμιο έχει πάρει ολόκληρη την ημέρα για τις διαλέξεις. Εκτός αυτού, οι περισσότεροι φοιτητές πανεπιστημίου εργάζονται φοιτητές προκειμένου να διαχειριστούν τα έξοδα κατά τη διάρκεια της εκπαίδευσης. Οι μαθητές πρέπει να εργαστούν ως μερική απασχόληση. Ως εκ τούτου, πρέπει να προγραμματίσουν τον χρόνο των διαλέξεων, να μελετήσουν τον χρόνο και τον χρόνο εργασίας. Ταυτόχρονα, αντί να παρευρεθούν σε βαρετές λέκτορες, οι μαθητές μπορούν να συμμετάσχουν σε άλλες δραστηριότητες όπως διαγωνισμός συζήτησης, κολύμβηση, μπάσκετ και ούτω καθεξής. Από αυτό μπορούν να συναντήσουν άλλους φοιτητές πανεπιστημίου και να δημιουργήσουν τις σχέσεις μαζί τους. Με λίγα λόγια, αν και λίγοι λαμπροί ομιλητές παρέχουν πιο ενημερωτικές διαλέξεις, μερικοί βαρεθούν οι μαθητές στην τάξη και σπαταλούν το χρόνο των μαθητών. Όταν οι φοιτητές πηγαίνουν στο πανεπιστήμιο, έχουν ωριμάσει διανοητικά και σωματικά. Έχουν αρκετές γνώσεις για να επιλέξουν τι πρέπει να κάνουν. Επομένως, για να κάνετε χρήση του χρόνου, εάν οι μαθητές επιλέξουν τα μαθήματα ως προαιρετικά, θα παρείχε περισσότερα οφέλη από τα μειονεκτήματα."
}