{
    "id": "0d49df0229c6d6511207acf871691b28",
    "link": "",
    "description": "",
    "date": "",
    "tags": [],
    "publishedAt": "",
    "crawledAt": "",
    "domain": "",
    "netloc": "",
    "annotations": {
        "ADUs": [
            {
                "id": "T1",
                "type": "MajorClaim",
                "starts": "299",
                "ends": "365",
                "segment": "Κατά την προσωπική μου άποψη, η σωστή ηλικία για ένα άτομο να συνταξιοδοτηθεί πρέπει να είναι περίπου 60 ετών."
            },
            {
                "id": "T2",
                "type": "MajorClaim",
                "starts": "379",
                "ends": "478",
                "segment": "Συμφωνώ απόλυτα ότι η ηλικία πρέπει να οριστεί ως κριτήριο για να συνταξιοδοτηθούν οι άνθρωποι στην προαναφερθείσα ηλικία για διάφορους λόγους που θα συζητήσω παρακάτω."
            },
            {
                "id": "T3",
                "type": "Premise",
                "starts": "550",
                "ends": "659",
                "segment": "&#39;όλα, εάν οι ανώτεροι εργαζόμενοι κυριαρχούν στον τομέα της εργασίας, θα υπάρξουν λιγότερες ευκαιρίες απασχόλησης για τους νέους αποφοίτους."
            },
            {
                "id": "T4",
                "type": "Claim",
                "starts": "674",
                "ends": "773",
                "segment": "αποτέλεσμα, οι περισσότεροι από αυτούς θα αναγκαστούν να αναλάβουν καριέρα που είναι πόλοι εκτός από αυτό που είχαν σπουδάσει.",
                "stance": [
                    {
                        "id": "A4",
                        "type": "For"
                    }
                ]
            },
            {
                "id": "T5",
                "type": "Premise",
                "starts": "803",
                "ends": "1060",
                "segment": "ένας απόφοιτος ιατρικής μπορεί να το θεωρήσει πολύ απογοητευμένο όταν έπρεπε να περάσει περίπου πέντε πολύτιμα χρόνια για να σπουδάσει ιατρική και στο τέλος της ημέρας, θα πρέπει να αναλάβει ένα άλλο επάγγελμα και όχι γιατρό λόγω των ανεπαρκών διαθέσιμων ευκαιριών εργασίας ."
            },
            {
                "id": "T6",
                "type": "Premise",
                "starts": "1078",
                "ends": "1247",
                "segment": "Εκτός από αυτό, δεν είναι όλοι οι ηλικιωμένοι εργαζόμενοι σωματικά καλά."
            },
            {
                "id": "T7",
                "type": "Claim",
                "starts": "1803",
                "ends": "1892",
                "segment": "Βεβαίως, η εμπειρία των ηλικιωμένων εργαζομένων που είχαν συνταξιοδοτηθεί δεν πρέπει ποτέ να υποτιμάται.",
                "stance": [
                    {
                        "id": "A2",
                        "type": "For"
                    }
                ]
            },
            {
                "id": "T8",
                "type": "Premise",
                "starts": "1266",
                "ends": "1309",
                "segment": "Πέρα από αυτήν την ηλικία, ένα μεγάλο ποσοστό από αυτά έχουν αυξημένη πιθανότητα να προσβληθούν από πολλά προβλήματα υγείας, όπως ασθένειες που σχετίζονται με το στρες και καρδιαγγειακές παθήσεις."
            },
            {
                "id": "T9",
                "type": "Premise",
                "starts": "1311",
                "ends": "1485",
                "segment": "ένα μεγάλο ποσοστό από αυτά έχουν αυξημένη πιθανότητα να προσβληθούν από πολλά προβλήματα υγείας, όπως ασθένειες που σχετίζονται με το στρες και καρδιαγγειακές παθήσεις."
            },
            {
                "id": "T10",
                "type": "Premise",
                "starts": "1507",
                "ends": "1594",
                "segment": "Κατά συνέπεια, δεν θα είναι σε θέση να δώσουν το καλύτερό τους σε ό, τι κάνουν."
            },
            {
                "id": "T11",
                "type": "Premise",
                "starts": "1610",
                "ends": "1677",
                "segment": "Εκτός αυτού, το ακαδημαϊκό ίδρυμα θα πρέπει να πληρώσει για τους ιατρικούς λογαριασμούς του, με αποτέλεσμα περισσότερες απώλειες για το ίδρυμα."
            },
            {
                "id": "T12",
                "type": "Premise",
                "starts": "1688",
                "ends": "1795",
                "segment": "πρέπει να πληρώσει για τους ιατρικούς λογαριασμούς του, με αποτέλεσμα περισσότερες απώλειες για το ίδρυμα."
            },
            {
                "id": "T13",
                "type": "MajorClaim",
                "starts": "2370",
                "ends": "2434",
                "segment": "προφανές ότι το όριο ηλικίας πρέπει να οριστεί για τη συνταξιοδότηση."
            },
            {
                "id": "T14",
                "type": "Claim",
                "starts": "1906",
                "ends": "1988",
                "segment": "Οι πολύτιμες εμπειρίες και γνώσεις τους στους αντίστοιχους τομείς τους όπως η μηχανική, η ιατρική και ο νόμος μπορούν σίγουρα να είναι ευεργετικές για τη νεότερη γενιά.",
                "stance": [
                    {
                        "id": "A3",
                        "type": "Against"
                    }
                ]
            },
            {
                "id": "T15",
                "type": "Premise",
                "starts": "1990",
                "ends": "2152",
                "segment": "αντίστοιχους τομείς τους όπως η μηχανική, η ιατρική και ο νόμος μπορούν σίγουρα να είναι ευεργετικές για τη νεότερη γενιά."
            },
            {
                "id": "T16",
                "type": "Premise",
                "starts": "2161",
                "ends": "2353",
                "segment": "ιδιαίτερα ο συνταξιούχος να έρχεται στις εταιρείες ή τα νοσοκομεία για να κάνουν τακτικές συνεδρίες με το παρόν προσωπικό για να γεφυρώσει το χάσμα μεταξύ τους και να μεταδώσει τις γνώσεις τους."
            }
        ],
        "Relations": [
            {
                "id": "R1",
                "type": "supports",
                "arg1": "T3",
                "arg2": "T4"
            },
            {
                "id": "R4",
                "type": "supports",
                "arg1": "T10",
                "arg2": "T11"
            },
            {
                "id": "R7",
                "type": "supports",
                "arg1": "T8",
                "arg2": "T7"
            },
            {
                "id": "R9",
                "type": "supports",
                "arg1": "T15",
                "arg2": "T16"
            },
            {
                "id": "R10",
                "type": "supports",
                "arg1": "T16",
                "arg2": "T14"
            },
            {
                "id": "R2",
                "type": "supports",
                "arg1": "T5",
                "arg2": "T4"
            },
            {
                "id": "R3",
                "type": "supports",
                "arg1": "T11",
                "arg2": "T7"
            },
            {
                "id": "R6",
                "type": "supports",
                "arg1": "T9",
                "arg2": "T7"
            },
            {
                "id": "R5",
                "type": "supports",
                "arg1": "T12",
                "arg2": "T7"
            },
            {
                "id": "R8",
                "type": "supports",
                "arg1": "T6",
                "arg2": "T4"
            }
        ]
    },
    "content": "Πρέπει οι άνθρωποι να αναγκαστούν να σταματήσουν να εργάζονται; Η κατάλληλη ηλικία στην οποία ένα άτομο πρέπει να σταματήσει να εργάζεται είναι πλέον ένα πολύ συζητημένο ζήτημα στην κοινωνία. Κάποιοι πιστεύουν ότι πρέπει να δοθεί στους ανθρώπους η δυνατότητα να επιλέξουν πότε θέλουν να το ονομάσουν μια μέρα, ενώ άλλοι αντιτίθενται σε αυτήν την έννοια. Κατά την προσωπική μου άποψη, η σωστή ηλικία για ένα άτομο να συνταξιοδοτηθεί πρέπει να είναι περίπου 60 ετών. Συμφωνώ απόλυτα ότι η ηλικία πρέπει να οριστεί ως κριτήριο για να συνταξιοδοτηθούν οι άνθρωποι στην προαναφερθείσα ηλικία για διάφορους λόγους που θα συζητήσω παρακάτω. Πρώτα απ &#39;όλα, εάν οι ανώτεροι εργαζόμενοι κυριαρχούν στον τομέα της εργασίας, θα υπάρξουν λιγότερες ευκαιρίες απασχόλησης για τους νέους αποφοίτους. Ως αποτέλεσμα, οι περισσότεροι από αυτούς θα αναγκαστούν να αναλάβουν καριέρα που είναι πόλοι εκτός από αυτό που είχαν σπουδάσει. Για να το διευκρινίσει περαιτέρω, ένας απόφοιτος ιατρικής μπορεί να το θεωρήσει πολύ απογοητευμένο όταν έπρεπε να περάσει περίπου πέντε πολύτιμα χρόνια για να σπουδάσει ιατρική και στο τέλος της ημέρας, θα πρέπει να αναλάβει ένα άλλο επάγγελμα και όχι γιατρό λόγω των ανεπαρκών διαθέσιμων ευκαιριών εργασίας . Επιπλέον, λόγω της έλλειψης γνήσιου πάθους για τη δουλειά που δεν ήταν της επιλογής τους, υπάρχει μεγαλύτερη πιθανότητα να μειωθεί το επίπεδο απόδοσής τους στο χώρο εργασίας τους. Εκτός από αυτό, δεν είναι όλοι οι ηλικιωμένοι εργαζόμενοι σωματικά καλά. Πέρα από αυτήν την ηλικία, ένα μεγάλο ποσοστό από αυτά έχουν αυξημένη πιθανότητα να προσβληθούν από πολλά προβλήματα υγείας, όπως ασθένειες που σχετίζονται με το στρες και καρδιαγγειακές παθήσεις. Για να αναφέρω ένα παράδειγμα, η αγχωτική ζωή που περνά ένας ηλικιωμένος δάσκαλος σίγουρα θα τον επηρεάσει. Κατά συνέπεια, δεν θα είναι σε θέση να δώσουν το καλύτερό τους σε ό, τι κάνουν. Εκτός αυτού, το ακαδημαϊκό ίδρυμα θα πρέπει να πληρώσει για τους ιατρικούς λογαριασμούς του, με αποτέλεσμα περισσότερες απώλειες για το ίδρυμα. Έτσι, θα ήταν πράγματι καλύτερο εάν σε μεγαλύτερη ηλικία, δίδονται ευκαιρίες στους νεότερους. Βεβαίως, η εμπειρία των ηλικιωμένων εργαζομένων που είχαν συνταξιοδοτηθεί δεν πρέπει ποτέ να υποτιμάται. Οι πολύτιμες εμπειρίες και γνώσεις τους στους αντίστοιχους τομείς τους όπως η μηχανική, η ιατρική και ο νόμος μπορούν σίγουρα να είναι ευεργετικές για τη νεότερη γενιά. Ως εκ τούτου, συνιστάται ιδιαίτερα ο συνταξιούχος να έρχεται στις εταιρείες ή τα νοσοκομεία για να κάνουν τακτικές συνεδρίες με το παρόν προσωπικό για να γεφυρώσει το χάσμα μεταξύ τους και να μεταδώσει τις γνώσεις τους. Συμπερασματικά, είναι πράγματι προφανές ότι το όριο ηλικίας πρέπει να οριστεί για τη συνταξιοδότηση. Θα έρθει μια συγκεκριμένη στιγμή που η παλαιότερη γενιά θα πρέπει να παραδώσει την ευθύνη στους νέους που έρχονται σίγουρα περιμένουν να τους δοθεί η επιλογή να αποδειχθούν. Σε τελική ανάλυση, η συνταξιοδότηση όχι μόνο σηματοδοτεί το τέλος ενός ατόμου, αλλά του δίνει επίσης την ευκαιρία να αντισταθμίσει αυτό που έχει χάσει καθ &#39;όλη τη διάρκεια της επαγγελματικής του ζωής."
}