{
    "id": "d167cdf1dfd96b5905a79f4c4f43be74",
    "link": "",
    "description": "",
    "date": "",
    "tags": [],
    "publishedAt": "",
    "crawledAt": "",
    "domain": "",
    "netloc": "",
    "annotations": {
        "ADUs": [
            {
                "id": "T1",
                "type": "MajorClaim",
                "starts": "371",
                "ends": "441",
                "segment": "είναι εξαιρετικά εκτεταμένες, δεν αρκεί η αύξηση της τιμής της βενζίνης μόνο για την επίλυση προβλημάτων, αν και είναι μια πολλά υποσχόμενη μέθοδος που συζητείται στη σύγχρονη κοινωνία."
            },
            {
                "id": "T2",
                "type": "MajorClaim",
                "starts": "1959",
                "ends": "2043",
                "segment": "και δεν θα μπορούσε να τεθεί σε ισχύ αμέσως, αλλά μακροπρόθεσμα, θα ήταν μια σοφή επιλογή."
            },
            {
                "id": "T3",
                "type": "Premise",
                "starts": "670",
                "ends": "762",
                "segment": "Ωστόσο, πρέπει να αξιολογηθεί εάν μπορεί να λειτουργήσει για την ανακούφιση της κυκλοφορίας και της ρύπανσης."
            },
            {
                "id": "T4",
                "type": "Premise",
                "starts": "528",
                "ends": "659",
                "segment": "Συγκεκριμένα, το ίδρυμα ελέγχου τιμών έχει χρησιμοποιηθεί σε πολλούς κοινωνικούς τομείς, για παράδειγμα, στα γεωργικά προϊόντα και στην περιοχή των ακινήτων."
            },
            {
                "id": "T5",
                "type": "Claim",
                "starts": "900",
                "ends": "952",
                "segment": "Κατά συνέπεια, δεν φαίνεται εύκολο να αυξήσετε αμέσως την τιμή της βενζίνης.",
                "stance": [
                    {
                        "id": "A2",
                        "type": "For"
                    }
                ]
            },
            {
                "id": "T6",
                "type": "Premise",
                "starts": "777",
                "ends": "884",
                "segment": "Από τη μία πλευρά, οι κυβερνήσεις έχουν μακροοικονομική προοπτική για τον έλεγχο των τιμών σε διάφορους τομείς σύμφωνα με τις κοινωνικές απαιτήσεις."
            },
            {
                "id": "T7",
                "type": "Premise",
                "starts": "973",
                "ends": "1110",
                "segment": "Από την άλλη πλευρά, οι μολύνσεις δεν προκαλούνται μόνο από την καύση πετρελαίου, χημικοί ρύποι, επιπλέον φωτιστικά, αποτελούν επίσης σημαντική ποσότητα ρύπανσης."
            },
            {
                "id": "T8",
                "type": "Premise",
                "starts": "1125",
                "ends": "1252",
                "segment": "Επιπλέον, οι βελτιώσεις της αποδοτικότητας της εργασίας αποδίδονται επίσης στην επιτάχυνση του ρυθμού εργασίας, με αποτέλεσμα την κυκλοφοριακή συμφόρηση κατά τις ώρες αιχμής."
            },
            {
                "id": "T9",
                "type": "Claim",
                "starts": "1277",
                "ends": "1371",
                "segment": "Όπως απεικονίστηκε προηγουμένως, πολλές άλλες λύσεις μπορούν να εισαχθούν για να βοηθήσουν στη μείωση των προβλημάτων ρύπανσης και κυκλοφορίας.",
                "stance": [
                    {
                        "id": "A1",
                        "type": "For"
                    }
                ]
            },
            {
                "id": "T10",
                "type": "Premise",
                "starts": "1384",
                "ends": "1550",
                "segment": "Κατά κύριο λόγο, οι αρχές δεν πρέπει να καταβάλλουν προσπάθειες για τη βελτίωση των μέσων μαζικής μεταφοράς, όπως η κατασκευή περισσότερων γραμμών λεωφορείων, προκειμένου να μειωθεί η χρήση ιδιωτικών αυτοκινήτων."
            },
            {
                "id": "T11",
                "type": "Premise",
                "starts": "1565",
                "ends": "1695",
                "segment": "Επιπλέον, πρέπει να τεθούν προσωρινά στόχοι, όσον αφορά τους περιορισμούς των ρύπων σε μια συγκεκριμένη χρονική περίοδο, για παράδειγμα, μια σεζόν."
            },
            {
                "id": "T12",
                "type": "Premise",
                "starts": "1702",
                "ends": "1766",
                "segment": "τους περιορισμούς των ρύπων σε μια συγκεκριμένη χρονική περίοδο, για παράδειγμα, μια σεζόν."
            },
            {
                "id": "T13",
                "type": "Premise",
                "starts": "1779",
                "ends": "1942",
                "segment": "Συν με εποπτικά ιδρύματα που έχουν δημιουργηθεί για την εύρεση και αντιμετώπιση προβλημάτων."
            }
        ],
        "Relations": [
            {
                "id": "R1",
                "type": "attacks",
                "arg1": "T4",
                "arg2": "T5"
            },
            {
                "id": "R2",
                "type": "attacks",
                "arg1": "T3",
                "arg2": "T4"
            },
            {
                "id": "R3",
                "type": "supports",
                "arg1": "T6",
                "arg2": "T5"
            },
            {
                "id": "R4",
                "type": "supports",
                "arg1": "T7",
                "arg2": "T5"
            },
            {
                "id": "R5",
                "type": "supports",
                "arg1": "T8",
                "arg2": "T5"
            },
            {
                "id": "R6",
                "type": "supports",
                "arg1": "T10",
                "arg2": "T9"
            },
            {
                "id": "R7",
                "type": "supports",
                "arg1": "T11",
                "arg2": "T9"
            },
            {
                "id": "R8",
                "type": "supports",
                "arg1": "T12",
                "arg2": "T9"
            },
            {
                "id": "R9",
                "type": "supports",
                "arg1": "T13",
                "arg2": "T9"
            }
        ]
    },
    "content": "Η αύξηση της κυκλοφορίας και της ρύπανσης μπορεί να ελεγχθεί αυξάνοντας τις τιμές της βενζίνης Καθώς διαβάζουμε εφημερίδες ή παρακολουθούμε τηλεόραση, πάντα προσελκύαμε από περιβαλλοντικά προβλήματα όπως θέματα κυκλοφορίας, θέματα ατμοσφαιρικής ρύπανσης και νερού. Πρέπει να αναληφθούν πρωτοβουλίες για την αντιμετώπιση των συγκεκριμένων προβλημάτων. Δεδομένου ότι οι επιπτώσεις για αυτά τα ζητήματα ρύπανσης και κυκλοφορίας είναι εξαιρετικά εκτεταμένες, δεν αρκεί η αύξηση της τιμής της βενζίνης μόνο για την επίλυση προβλημάτων, αν και είναι μια πολλά υποσχόμενη μέθοδος που συζητείται στη σύγχρονη κοινωνία. Συγκεκριμένα, το ίδρυμα ελέγχου τιμών έχει χρησιμοποιηθεί σε πολλούς κοινωνικούς τομείς, για παράδειγμα, στα γεωργικά προϊόντα και στην περιοχή των ακινήτων. Ωστόσο, πρέπει να αξιολογηθεί εάν μπορεί να λειτουργήσει για την ανακούφιση της κυκλοφορίας και της ρύπανσης. Από τη μία πλευρά, οι κυβερνήσεις έχουν μακροοικονομική προοπτική για τον έλεγχο των τιμών σε διάφορους τομείς σύμφωνα με τις κοινωνικές απαιτήσεις. Κατά συνέπεια, δεν φαίνεται εύκολο να αυξήσετε αμέσως την τιμή της βενζίνης. Από την άλλη πλευρά, οι μολύνσεις δεν προκαλούνται μόνο από την καύση πετρελαίου, χημικοί ρύποι, επιπλέον φωτιστικά, αποτελούν επίσης σημαντική ποσότητα ρύπανσης. Επιπλέον, οι βελτιώσεις της αποδοτικότητας της εργασίας αποδίδονται επίσης στην επιτάχυνση του ρυθμού εργασίας, με αποτέλεσμα την κυκλοφοριακή συμφόρηση κατά τις ώρες αιχμής. Όπως απεικονίστηκε προηγουμένως, πολλές άλλες λύσεις μπορούν να εισαχθούν για να βοηθήσουν στη μείωση των προβλημάτων ρύπανσης και κυκλοφορίας. Κατά κύριο λόγο, οι αρχές δεν πρέπει να καταβάλλουν προσπάθειες για τη βελτίωση των μέσων μαζικής μεταφοράς, όπως η κατασκευή περισσότερων γραμμών λεωφορείων, προκειμένου να μειωθεί η χρήση ιδιωτικών αυτοκινήτων. Επιπλέον, πρέπει να τεθούν προσωρινά στόχοι, όσον αφορά τους περιορισμούς των ρύπων σε μια συγκεκριμένη χρονική περίοδο, για παράδειγμα, μια σεζόν. Συν με εποπτικά ιδρύματα που έχουν δημιουργηθεί για την εύρεση και αντιμετώπιση προβλημάτων. Εν τω μεταξύ, η καλλιέργεια μιας αίσθησης προστασίας του περιβάλλοντος θα λειτουργούσε επίσης, αν και δεν θα μπορούσε να τεθεί σε ισχύ αμέσως, αλλά μακροπρόθεσμα, θα ήταν μια σοφή επιλογή. Εν κατακλείδι, η αντιμετώπιση ζητημάτων ρύπανσης και κυκλοφορίας μόνο με την αύξηση της τιμής του πετρελαίου δεν είναι επαρκής, ενώ θα ήταν προτιμότερη η βελτίωση των μεταφορικών εγκαταστάσεων και η εποπτεία κτιρίων, καθώς και η ευαισθητοποίηση σχετικά με την προστασία του περιβάλλοντος."
}