{
    "id": "f85d8890721140db682435b1be170d33",
    "link": "",
    "description": "",
    "date": "",
    "tags": [],
    "publishedAt": "",
    "crawledAt": "",
    "domain": "",
    "netloc": "",
    "annotations": {
        "ADUs": [
            {
                "id": "T1",
                "type": "MajorClaim",
                "starts": "431",
                "ends": "470",
                "segment": "Η διεθνής βοήθεια είναι κρίσιμη, διότι οι άνθρωποι από άλλες χώρες ενδέχεται να αντιμετωπίζουν πολύ πιο σοβαρά προβλήματα."
            },
            {
                "id": "T2",
                "type": "MajorClaim",
                "starts": "1593",
                "ends": "1722",
                "segment": "Συμπερασματικά, τα άτομα από ατυχείς χώρες χρειάζονται περισσότερη διεθνή βοήθεια, ενώ είναι επίσης απαραίτητη η βοήθεια των πολιτών στη χώρα καταγωγής."
            },
            {
                "id": "T3",
                "type": "Claim",
                "starts": "472",
                "ends": "501",
                "segment": "διεθνής βοήθεια είναι κρίσιμη, διότι οι άνθρωποι από άλλες χώρες ενδέχεται να αντιμετωπίζουν πολύ πιο σοβαρά προβλήματα.",
                "stance": [
                    {
                        "id": "A1",
                        "type": "For"
                    }
                ]
            },
            {
                "id": "T5",
                "type": "Premise",
                "starts": "580",
                "ends": "668",
                "segment": "Πολλοί άνθρωποι, για παράδειγμα σε ορισμένες αφρικανικές χώρες, ζουν κάτω από τα βασικά πρότυπα."
            },
            {
                "id": "T6",
                "type": "Premise",
                "starts": "670",
                "ends": "759",
                "segment": "Δεν έχουν φαγητό, νερό ή ρούχα που τα διατηρούν ζεστά, για να μην αναφέρουμε τις εκπαιδευτικές ανάγκες."
            },
            {
                "id": "T7",
                "type": "Premise",
                "starts": "761",
                "ends": "974",
                "segment": "Αυτό που είναι χειρότερο, οι άνθρωποι που ζουν σε χώρες που αντιμετωπίζουν πολέμους ή φυσικές καταστροφές αντιμετωπίζουν ακόμη πιο σοβαρά ζητήματα, όπως η ασφάλεια, η έλλειψη στέγης ή ο πόνος από την απώλεια καλύτερων φίλων ή μελών της οικογένειας."
            },
            {
                "id": "T8",
                "type": "Premise",
                "starts": "993",
                "ends": "1052",
                "segment": "Είναι σαφές ότι αυτοί οι άνθρωποι χρειάζονται απεγνωσμένα διεθνή υποστήριξη."
            },
            {
                "id": "T4",
                "type": "Premise",
                "starts": "1255",
                "ends": "1343",
                "segment": "από τη χώρα καταγωγής, επομένως υπάρχει μεγάλη ζήτηση ότι τα χρήματα πρέπει να δαπανηθούν στον τόπο συλλογής τους."
            },
            {
                "id": "T9",
                "type": "Premise",
                "starts": "1190",
                "ends": "1249",
                "segment": "Σε τελική ανάλυση, οι φιλανθρωπικοί οργανισμοί χρηματοδοτούνται κυρίως από τη χώρα καταγωγής, επομένως υπάρχει μεγάλη ζήτηση ότι τα χρήματα πρέπει να δαπανηθούν στον τόπο συλλογής τους."
            },
            {
                "id": "T10",
                "type": "Premise",
                "starts": "1369",
                "ends": "1465",
                "segment": "ότι, ακόμη και στις πιο ανεπτυγμένες χώρες, εξακολουθούν να υπάρχουν φτωχοί που δεν έχουν τις βασικές τους ανάγκες."
            },
            {
                "id": "T11",
                "type": "Premise",
                "starts": "1467",
                "ends": "1576",
                "segment": "Με την επίλυση των προβλημάτων στην πατρίδα, είναι ευεργετικό για την κοινωνική σταθερότητα και τη σταθερή οικονομική ανάπτυξη."
            },
            {
                "id": "T12",
                "type": "Claim",
                "starts": "1123",
                "ends": "1177",
                "segment": "βρίσκονται εκτός των εθνικών μας συνόρων, είναι λογικό να δώσουμε ένα χέρι στους συμπολίτες μας.",
                "stance": [
                    {
                        "id": "A4",
                        "type": "For"
                    }
                ]
            },
            {
                "id": "T13",
                "type": "Premise",
                "starts": "510",
                "ends": "578",
                "segment": "οι άνθρωποι από άλλες χώρες ενδέχεται να αντιμετωπίζουν πολύ πιο σοβαρά προβλήματα."
            }
        ],
        "Relations": [
            {
                "id": "R1",
                "type": "supports",
                "arg1": "T5",
                "arg2": "T3"
            },
            {
                "id": "R4",
                "type": "supports",
                "arg1": "T6",
                "arg2": "T3"
            },
            {
                "id": "R5",
                "type": "supports",
                "arg1": "T7",
                "arg2": "T3"
            },
            {
                "id": "R8",
                "type": "supports",
                "arg1": "T9",
                "arg2": "T4"
            },
            {
                "id": "R9",
                "type": "supports",
                "arg1": "T4",
                "arg2": "T12"
            },
            {
                "id": "R10",
                "type": "supports",
                "arg1": "T10",
                "arg2": "T12"
            },
            {
                "id": "R11",
                "type": "supports",
                "arg1": "T11",
                "arg2": "T12"
            },
            {
                "id": "R2",
                "type": "supports",
                "arg1": "T13",
                "arg2": "T3"
            },
            {
                "id": "R3",
                "type": "supports",
                "arg1": "T8",
                "arg2": "T3"
            }
        ]
    },
    "content": "Διεθνής βοήθεια Ο κόσμος έχει γίνει πιο ευημερούμενος από ποτέ, ένας μεγάλος αριθμός ανθρώπων ζει ακόμα στη φτώχεια ή υποφέρει από πολέμους ή καταστροφές. Οι φιλανθρωπικοί οργανισμοί διαδραματίζουν σημαντικό ρόλο για την παροχή υποστήριξης σε αυτούς τους ανθρώπους. Ωστόσο, είναι αμφιλεγόμενο εάν η βοήθεια πρέπει να παρέχεται στους ανθρώπους που τη χρειάζονται περισσότερο ή στους πολίτες της χώρας όπου βρίσκονται οι φιλανθρωπικές οργανώσεις. Η άποψή μου είναι ότι πρέπει να δοθεί προτεραιότητα στη διεθνή βοήθεια. Η διεθνής βοήθεια είναι κρίσιμη, διότι οι άνθρωποι από άλλες χώρες ενδέχεται να αντιμετωπίζουν πολύ πιο σοβαρά προβλήματα. Πολλοί άνθρωποι, για παράδειγμα σε ορισμένες αφρικανικές χώρες, ζουν κάτω από τα βασικά πρότυπα. Δεν έχουν φαγητό, νερό ή ρούχα που τα διατηρούν ζεστά, για να μην αναφέρουμε τις εκπαιδευτικές ανάγκες. Αυτό που είναι χειρότερο, οι άνθρωποι που ζουν σε χώρες που αντιμετωπίζουν πολέμους ή φυσικές καταστροφές αντιμετωπίζουν ακόμη πιο σοβαρά ζητήματα, όπως η ασφάλεια, η έλλειψη στέγης ή ο πόνος από την απώλεια καλύτερων φίλων ή μελών της οικογένειας. Είναι σαφές ότι αυτοί οι άνθρωποι χρειάζονται απεγνωσμένα διεθνή υποστήριξη. Παρά τη σημασία της βοήθειας σε όσους βρίσκονται εκτός των εθνικών μας συνόρων, είναι λογικό να δώσουμε ένα χέρι στους συμπολίτες μας. Σε τελική ανάλυση, οι φιλανθρωπικοί οργανισμοί χρηματοδοτούνται κυρίως από τη χώρα καταγωγής, επομένως υπάρχει μεγάλη ζήτηση ότι τα χρήματα πρέπει να δαπανηθούν στον τόπο συλλογής τους. Ένας άλλος λόγος είναι ότι, ακόμη και στις πιο ανεπτυγμένες χώρες, εξακολουθούν να υπάρχουν φτωχοί που δεν έχουν τις βασικές τους ανάγκες. Με την επίλυση των προβλημάτων στην πατρίδα, είναι ευεργετικό για την κοινωνική σταθερότητα και τη σταθερή οικονομική ανάπτυξη. Συμπερασματικά, τα άτομα από ατυχείς χώρες χρειάζονται περισσότερη διεθνή βοήθεια, ενώ είναι επίσης απαραίτητη η βοήθεια των πολιτών στη χώρα καταγωγής."
}