{
    "id": "f7ec36e0443e8778ea893ce831ecace9",
    "link": "",
    "description": "",
    "date": "",
    "tags": [],
    "publishedAt": "",
    "crawledAt": "",
    "domain": "",
    "netloc": "",
    "annotations": {
        "ADUs": [
            {
                "id": "T1",
                "type": "MajorClaim",
                "starts": "274",
                "ends": "387",
                "segment": "οι κυβερνήσεις πρέπει να αφιερώσουν μεγαλύτερο μέρος του προϋπολογισμού για την υγεία τους στην εκπαίδευση για την υγεία και μέσα για προφυλάξεις."
            },
            {
                "id": "T2",
                "type": "MajorClaim",
                "starts": "1619",
                "ends": "1812",
                "segment": "παράδειγμα, η εκστρατεία μάρκετινγκ του Υπουργείου Υγείας στην Τουρκία με στόχο το πρόβλημα του καπνίσματος μεταξύ των νέων αύξησε την ευημερία όσων εγκατέλειψαν το κάπνισμα και προσάρμοσαν έναν καλύτερο τρόπο ζωής μετά την εκστρατεία."
            },
            {
                "id": "T3",
                "type": "Claim",
                "starts": "736",
                "ends": "796",
                "segment": "υγειονομικής περίθαλψης, κάτι που θα οδηγήσει σε καλύτερες θεραπείες για τους σημερινούς ασθενείς.",
                "stance": [
                    {
                        "id": "A1",
                        "type": "For"
                    }
                ]
            },
            {
                "id": "T4",
                "type": "Premise",
                "starts": "541",
                "ends": "723",
                "segment": "Πιστεύω ότι η μείωση του αριθμού των ασθενών στο σύστημα υγείας μπορεί να οδηγήσει στην αποτελεσματική διαχείριση των νοσοκομείων και των κέντρων υγειονομικής περίθαλψης, κάτι που θα οδηγήσει σε καλύτερες θεραπείες για τους σημερινούς ασθενείς."
            },
            {
                "id": "T5",
                "type": "Premise",
                "starts": "805",
                "ends": "944",
                "segment": "Ως εκ τούτου, η κοινωνία πρέπει να εκπαιδεύεται και να έχει επίγνωση των θεμάτων υγείας, ώστε να μπορούν να ληφθούν οι πιθανές προφυλάξεις σχετικά με τον τρόπο ασθένειας αντί να προσπαθούν να παρέχουν θεραπεία για τον αυξανόμενο αριθμό ασθενών."
            },
            {
                "id": "T6",
                "type": "Premise",
                "starts": "389",
                "ends": "524",
                "segment": "Ο πρώτος λόγος για τον οποίο η εκπαίδευση και τα προληπτικά μέτρα πρέπει να λάβουν μεγαλύτερο προϋπολογισμό είναι οι πιθανές βελτιώσεις στο σύστημα υγείας."
            },
            {
                "id": "T7",
                "type": "Premise",
                "starts": "1112",
                "ends": "1220",
                "segment": "πρέπει να διαθέσουν περισσότερο προϋπολογισμό για την πρόληψη των ασθενειών και την παροχή εκπαίδευσης στον τομέα της υγείας είναι η ευημερία της κοινωνίας."
            },
            {
                "id": "T8",
                "type": "Premise",
                "starts": "1233",
                "ends": "1388",
                "segment": "Κατά τη γνώμη μου, δεν υπάρχει τίποτα πιο σημαντικό από την υγεία στη ζωή ενός ανθρώπου και η ευτυχία και η ευημερία έρχονται με την υγεία."
            },
            {
                "id": "T9",
                "type": "Premise",
                "starts": "1403",
                "ends": "1602",
                "segment": "Επομένως, ένας ρόλος της κυβέρνησης πρέπει να παρέχει μέσα που οδηγούν τους πολίτες της να μάθουν πώς να αποτρέπουν από πιθανές ασθένειες που μπορούν να προκαλέσουν δυστυχία στη ζωή των ανθρώπων."
            },
            {
                "id": "T10",
                "type": "Claim",
                "starts": "968",
                "ends": "1095",
                "segment": "Ο δεύτερος λόγος για τον οποίο οι κυβερνήσεις πρέπει να διαθέσουν περισσότερο προϋπολογισμό για την πρόληψη των ασθενειών και την παροχή εκπαίδευσης στον τομέα της υγείας είναι η ευημερία της κοινωνίας.",
                "stance": [
                    {
                        "id": "A3",
                        "type": "For"
                    }
                ]
            }
        ],
        "Relations": [
            {
                "id": "R1",
                "type": "supports",
                "arg1": "T4",
                "arg2": "T3"
            },
            {
                "id": "R2",
                "type": "supports",
                "arg1": "T5",
                "arg2": "T3"
            },
            {
                "id": "R3",
                "type": "supports",
                "arg1": "T6",
                "arg2": "T3"
            },
            {
                "id": "R4",
                "type": "supports",
                "arg1": "T7",
                "arg2": "T8"
            },
            {
                "id": "R5",
                "type": "supports",
                "arg1": "T9",
                "arg2": "T8"
            },
            {
                "id": "R6",
                "type": "supports",
                "arg1": "T8",
                "arg2": "T10"
            }
        ]
    },
    "content": "Ένα μεγαλύτερο μέρος του προϋπολογισμού πρέπει να διατίθεται σε θέματα εκπαίδευσης και πρόληψης Στον σημερινό κόσμο, η έννοια του κράτους πρόνοιας απαιτεί από τις κυβερνήσεις να παρέχουν βιώσιμη υγειονομική και υγειονομική εκπαίδευση στους πολίτες τους. Συμφωνώ απολύτως με την ιδέα ότι οι κυβερνήσεις πρέπει να αφιερώσουν μεγαλύτερο μέρος του προϋπολογισμού για την υγεία τους στην εκπαίδευση για την υγεία και μέσα για προφυλάξεις. Ο πρώτος λόγος για τον οποίο η εκπαίδευση και τα προληπτικά μέτρα πρέπει να λάβουν μεγαλύτερο προϋπολογισμό είναι οι πιθανές βελτιώσεις στο σύστημα υγείας. Πιστεύω ότι η μείωση του αριθμού των ασθενών στο σύστημα υγείας μπορεί να οδηγήσει στην αποτελεσματική διαχείριση των νοσοκομείων και των κέντρων υγειονομικής περίθαλψης, κάτι που θα οδηγήσει σε καλύτερες θεραπείες για τους σημερινούς ασθενείς. Ως εκ τούτου, η κοινωνία πρέπει να εκπαιδεύεται και να έχει επίγνωση των θεμάτων υγείας, ώστε να μπορούν να ληφθούν οι πιθανές προφυλάξεις σχετικά με τον τρόπο ασθένειας αντί να προσπαθούν να παρέχουν θεραπεία για τον αυξανόμενο αριθμό ασθενών. Ο δεύτερος λόγος για τον οποίο οι κυβερνήσεις πρέπει να διαθέσουν περισσότερο προϋπολογισμό για την πρόληψη των ασθενειών και την παροχή εκπαίδευσης στον τομέα της υγείας είναι η ευημερία της κοινωνίας. Κατά τη γνώμη μου, δεν υπάρχει τίποτα πιο σημαντικό από την υγεία στη ζωή ενός ανθρώπου και η ευτυχία και η ευημερία έρχονται με την υγεία. Επομένως, ένας ρόλος της κυβέρνησης πρέπει να παρέχει μέσα που οδηγούν τους πολίτες της να μάθουν πώς να αποτρέπουν από πιθανές ασθένειες που μπορούν να προκαλέσουν δυστυχία στη ζωή των ανθρώπων. Για παράδειγμα, η εκστρατεία μάρκετινγκ του Υπουργείου Υγείας στην Τουρκία με στόχο το πρόβλημα του καπνίσματος μεταξύ των νέων αύξησε την ευημερία όσων εγκατέλειψαν το κάπνισμα και προσάρμοσαν έναν καλύτερο τρόπο ζωής μετά την εκστρατεία. Εν κατακλείδι, ένα μεγαλύτερο μέρος του προϋπολογισμού θα πρέπει να διατεθεί σε θέματα εκπαίδευσης και πρόληψης σε σύγκριση με τη θεραπεία, προκειμένου να επιτευχθεί αποτελεσματικότερο σύστημα υγείας και μεγαλύτερο επίπεδο ευεξίας."
}