{
    "id": "94845239b1b9a3556ccc97539339080a",
    "link": "",
    "description": "",
    "date": "",
    "tags": [],
    "publishedAt": "",
    "crawledAt": "",
    "domain": "",
    "netloc": "",
    "annotations": {
        "ADUs": [
            {
                "id": "T1",
                "type": "MajorClaim",
                "starts": "244",
                "ends": "297",
                "segment": "ότι είναι η σκληρή δουλειά κάποιου που τον βοηθά να επιτύχει τον στόχο του."
            },
            {
                "id": "T2",
                "type": "Claim",
                "starts": "125",
                "ends": "192",
                "segment": "Ωστόσο, δεν βλέπω κανένα λογικό να πιστεύω στην τύχη να επιτύχω τους στόχους του.",
                "stance": [
                    {
                        "id": "A1",
                        "type": "For"
                    }
                ]
            },
            {
                "id": "T3",
                "type": "Premise",
                "starts": "2273",
                "ends": "2295",
                "segment": "Παρόλο που είναι καλό να είσαι τυχερός, ανάλογα με την τύχη, τα πάντα δεν είναι καλά."
            },
            {
                "id": "T4",
                "type": "Claim",
                "starts": "2297",
                "ends": "2341",
                "segment": "τυχερός, ανάλογα με την τύχη, τα πάντα δεν είναι καλά.",
                "stance": [
                    {
                        "id": "A3",
                        "type": "For"
                    }
                ]
            },
            {
                "id": "T5",
                "type": "MajorClaim",
                "starts": "2349",
                "ends": "2443",
                "segment": "Ως εκ τούτου, πιστεύω ακράδαντα στη σκληρή δουλειά που δεν θα σας απογοητεύσει εύκολα όπως και η τύχη."
            },
            {
                "id": "T6",
                "type": "Claim",
                "starts": "306",
                "ends": "390",
                "segment": "Πρώτον, εάν βασίζεστε μόνο στην τύχη για όλα τα επιτεύγματά σας, διατρέχετε μεγάλο κίνδυνο.",
                "stance": [
                    {
                        "id": "A2",
                        "type": "For"
                    }
                ]
            },
            {
                "id": "T7",
                "type": "Premise",
                "starts": "392",
                "ends": "478",
                "segment": "Η τύχη είναι κάτι άυλο και κανείς δεν μπορεί να εγγυηθεί ότι θα έρθει ποτέ στο δρόμο σας."
            },
            {
                "id": "T8",
                "type": "Premise",
                "starts": "480",
                "ends": "534",
                "segment": "Εάν δεν λειτουργεί, θα ήταν μεγάλη απογοήτευση."
            },
            {
                "id": "T9",
                "type": "Claim",
                "starts": "687",
                "ends": "750",
                "segment": "μου εμπειρία, όλα τα επιτεύγματά μου υποστηρίχθηκαν από τη σκληρή δουλειά μου, όχι από την τύχη μου.",
                "stance": [
                    {
                        "id": "A4",
                        "type": "For"
                    }
                ]
            },
            {
                "id": "T10",
                "type": "Premise",
                "starts": "756",
                "ends": "817",
                "segment": "Και δεν αντιμετώπισα ποτέ απογοητεύσεις από την απώλεια των στόχων μου."
            },
            {
                "id": "T11",
                "type": "Premise",
                "starts": "544",
                "ends": "658",
                "segment": "&#39;αυτού, αν προσπαθείτε σκληρά για να επιτύχετε αυτό που θέλετε, τότε η σκληρή δουλειά σας θα σας έφερνε τουλάχιστον πιο κοντά στον τελικό στόχο σας."
            },
            {
                "id": "T13",
                "type": "Claim",
                "starts": "936",
                "ends": "1033",
                "segment": "Με άλλα λόγια, όσοι πιστεύουν στη σκληρή δουλειά είναι ξεκάθαροι για τους στόχους τους και γνωρίζουν τον τελικό προορισμό τους.",
                "stance": [
                    {
                        "id": "A6",
                        "type": "For"
                    }
                ]
            },
            {
                "id": "T14",
                "type": "Premise",
                "starts": "1035",
                "ends": "1169",
                "segment": "Οργανώνουν προσεκτικά τη διαδικασία επίτευξης των στόχων τους και συνεχίζουν να αξιολογούν την πρόοδό τους μέχρι να φτάσουν στον τελικό στόχο."
            },
            {
                "id": "T15",
                "type": "Premise",
                "starts": "1171",
                "ends": "1244",
                "segment": "Αν πιστεύεις στην τύχη, θα είσαι ανίδεος για το πού πηγαίνεις."
            },
            {
                "id": "T16",
                "type": "Premise",
                "starts": "1259",
                "ends": "1399",
                "segment": "παράδειγμα, ένας φίλος μου, που είχε σοβαρούς οικονομικούς περιορισμούς, είχε τη συνήθεια να αγοράζει εισιτήρια λαχειοφόρων αγορών πιστεύοντας ότι μια μέρα θα κερδίσει λαχειοφόρο αγορά."
            },
            {
                "id": "T17",
                "type": "Premise",
                "starts": "1401",
                "ends": "1486",
                "segment": "Ζούσε σε μια ψευδαίσθηση ότι μπορεί να λύσει τα οικονομικά του ζητήματα με αυτή τη λαχειοφόρο αγορά."
            },
            {
                "id": "T18",
                "type": "Premise",
                "starts": "1497",
                "ends": "1576",
                "segment": "Ωστόσο, μέχρι σήμερα η τύχη του δεν έχει εμφανιστεί και τα προβλήματα επιδεινώθηκαν περαιτέρω."
            },
            {
                "id": "T12",
                "type": "Claim",
                "starts": "1588",
                "ends": "1700",
                "segment": "δουλεύεις σκληρά, η τύχη μπορεί επίσης να σου λάμψει και να σου κάνει μερικά ακόμη βήματα μπροστά από τον πραγματικό στόχο σου.",
                "stance": [
                    {
                        "id": "A5",
                        "type": "For"
                    }
                ]
            },
            {
                "id": "T19",
                "type": "Premise",
                "starts": "1715",
                "ends": "1758",
                "segment": "το αφεντικό μου δούλεψε ακούραστα για την προώθησή του."
            },
            {
                "id": "T20",
                "type": "Premise",
                "starts": "1760",
                "ends": "1829",
                "segment": "Κοίταξε κάθε πτυχή που χρειαζόταν για να προκριθεί στην προσφορά."
            },
            {
                "id": "T21",
                "type": "Premise",
                "starts": "1831",
                "ends": "1938",
                "segment": "ότι η κατοχή μεταπτυχιακού τίτλου θα ήταν μια μεγάλη πιστοποίηση για να ξεπεράσει τους ανταγωνιστές του."
            },
            {
                "id": "T22",
                "type": "Premise",
                "starts": "1949",
                "ends": "2065",
                "segment": "πολλές δεσμεύσεις στο σπίτι και στη δουλειά, κατά κάποιον τρόπο κατάφερε να ολοκληρώσει αυτό το πτυχίο προτού να είναι επιλέξιμος να υποβάλει αίτηση."
            },
            {
                "id": "T23",
                "type": "Premise",
                "starts": "2067",
                "ends": "2195",
                "segment": "Στο τέλος δεν ήταν μόνο σε θέση να πάρει την προσφορά εν μέσω ενός σκληρού διαγωνισμού, αλλά και προτάθηκε για υποτροφία στο εξωτερικό, καθώς είχε περισσότερα διαπιστευτήρια από άλλους αξιωματικούς υπό την ιδιότητά του."
            },
            {
                "id": "T24",
                "type": "Premise",
                "starts": "2202",
                "ends": "2261",
                "segment": "καθώς είχε περισσότερα διαπιστευτήρια από άλλους αξιωματικούς υπό την ιδιότητά του."
            }
        ],
        "Relations": [
            {
                "id": "R1",
                "type": "attacks",
                "arg1": "T3",
                "arg2": "T4"
            },
            {
                "id": "R2",
                "type": "supports",
                "arg1": "T10",
                "arg2": "T9"
            },
            {
                "id": "R3",
                "type": "supports",
                "arg1": "T11",
                "arg2": "T9"
            },
            {
                "id": "R4",
                "type": "supports",
                "arg1": "T8",
                "arg2": "T6"
            },
            {
                "id": "R5",
                "type": "supports",
                "arg1": "T7",
                "arg2": "T6"
            },
            {
                "id": "R6",
                "type": "supports",
                "arg1": "T14",
                "arg2": "T13"
            },
            {
                "id": "R7",
                "type": "supports",
                "arg1": "T15",
                "arg2": "T13"
            },
            {
                "id": "R8",
                "type": "supports",
                "arg1": "T16",
                "arg2": "T13"
            },
            {
                "id": "R9",
                "type": "supports",
                "arg1": "T17",
                "arg2": "T13"
            },
            {
                "id": "R10",
                "type": "supports",
                "arg1": "T18",
                "arg2": "T13"
            },
            {
                "id": "R11",
                "type": "supports",
                "arg1": "T24",
                "arg2": "T23"
            },
            {
                "id": "R12",
                "type": "supports",
                "arg1": "T19",
                "arg2": "T12"
            },
            {
                "id": "R13",
                "type": "supports",
                "arg1": "T20",
                "arg2": "T12"
            },
            {
                "id": "R14",
                "type": "supports",
                "arg1": "T21",
                "arg2": "T12"
            },
            {
                "id": "R15",
                "type": "supports",
                "arg1": "T22",
                "arg2": "T12"
            },
            {
                "id": "R16",
                "type": "supports",
                "arg1": "T23",
                "arg2": "T12"
            }
        ]
    },
    "content": "Τύχη vs σκληρή δουλειά Υπάρχουν πολλές περιπτώσεις που η τύχη έφερε στους ανθρώπους πράγματα που ποτέ δεν μπορούσαν να φανταστούν. Ωστόσο, δεν βλέπω κανένα λογικό να πιστεύω στην τύχη να επιτύχω τους στόχους του. Ως εκ τούτου, συμφωνώ απόλυτα με το επιχείρημα ότι είναι η σκληρή δουλειά κάποιου που τον βοηθά να επιτύχει τον στόχο του. Πρώτον, εάν βασίζεστε μόνο στην τύχη για όλα τα επιτεύγματά σας, διατρέχετε μεγάλο κίνδυνο. Η τύχη είναι κάτι άυλο και κανείς δεν μπορεί να εγγυηθεί ότι θα έρθει ποτέ στο δρόμο σας. Εάν δεν λειτουργεί, θα ήταν μεγάλη απογοήτευση. Αντ &#39;αυτού, αν προσπαθείτε σκληρά για να επιτύχετε αυτό που θέλετε, τότε η σκληρή δουλειά σας θα σας έφερνε τουλάχιστον πιο κοντά στον τελικό στόχο σας. Στην προσωπική μου εμπειρία, όλα τα επιτεύγματά μου υποστηρίχθηκαν από τη σκληρή δουλειά μου, όχι από την τύχη μου. Και δεν αντιμετώπισα ποτέ απογοητεύσεις από την απώλεια των στόχων μου. Δεύτερον, εάν πιστεύετε ότι η σκληρή δουλειά είναι το κλειδί της επιτυχίας, θα σας έκανε να οραματιστείτε. Με άλλα λόγια, όσοι πιστεύουν στη σκληρή δουλειά είναι ξεκάθαροι για τους στόχους τους και γνωρίζουν τον τελικό προορισμό τους. Οργανώνουν προσεκτικά τη διαδικασία επίτευξης των στόχων τους και συνεχίζουν να αξιολογούν την πρόοδό τους μέχρι να φτάσουν στον τελικό στόχο. Αν πιστεύεις στην τύχη, θα είσαι ανίδεος για το πού πηγαίνεις. Για παράδειγμα, ένας φίλος μου, που είχε σοβαρούς οικονομικούς περιορισμούς, είχε τη συνήθεια να αγοράζει εισιτήρια λαχειοφόρων αγορών πιστεύοντας ότι μια μέρα θα κερδίσει λαχειοφόρο αγορά. Ζούσε σε μια ψευδαίσθηση ότι μπορεί να λύσει τα οικονομικά του ζητήματα με αυτή τη λαχειοφόρο αγορά. Ωστόσο, μέχρι σήμερα η τύχη του δεν έχει εμφανιστεί και τα προβλήματα επιδεινώθηκαν περαιτέρω. Τρίτον, αν δουλεύεις σκληρά, η τύχη μπορεί επίσης να σου λάμψει και να σου κάνει μερικά ακόμη βήματα μπροστά από τον πραγματικό στόχο σου. Για παράδειγμα, το αφεντικό μου δούλεψε ακούραστα για την προώθησή του. Κοίταξε κάθε πτυχή που χρειαζόταν για να προκριθεί στην προσφορά. Συνειδητοποίησε ότι η κατοχή μεταπτυχιακού τίτλου θα ήταν μια μεγάλη πιστοποίηση για να ξεπεράσει τους ανταγωνιστές του. Αν και είχε πολλές δεσμεύσεις στο σπίτι και στη δουλειά, κατά κάποιον τρόπο κατάφερε να ολοκληρώσει αυτό το πτυχίο προτού να είναι επιλέξιμος να υποβάλει αίτηση. Στο τέλος δεν ήταν μόνο σε θέση να πάρει την προσφορά εν μέσω ενός σκληρού διαγωνισμού, αλλά και προτάθηκε για υποτροφία στο εξωτερικό, καθώς είχε περισσότερα διαπιστευτήρια από άλλους αξιωματικούς υπό την ιδιότητά του. Παρόλο που είναι καλό να είσαι τυχερός, ανάλογα με την τύχη, τα πάντα δεν είναι καλά. Ως εκ τούτου, πιστεύω ακράδαντα στη σκληρή δουλειά που δεν θα σας απογοητεύσει εύκολα όπως και η τύχη."
}