{
    "id": "7d457ec0d122b801ed0fe408e79bb67e",
    "link": "",
    "description": "",
    "date": "",
    "tags": [],
    "publishedAt": "",
    "crawledAt": "",
    "domain": "",
    "netloc": "",
    "annotations": {
        "ADUs": [
            {
                "id": "T1",
                "type": "MajorClaim",
                "starts": "359",
                "ends": "430",
                "segment": "συμφωνώ με την άποψη ότι ο δάσκαλος είναι η καλύτερη επιλογή για την εκπαίδευση των παιδιών σε ορισμένες πτυχές."
            },
            {
                "id": "T2",
                "type": "MajorClaim",
                "starts": "1680",
                "ends": "1726",
                "segment": "Έτσι, ήταν αδύνατο να γίνουν καλοί δάσκαλοι."
            },
            {
                "id": "T3",
                "type": "Claim",
                "starts": "1728",
                "ends": "1921",
                "segment": "Συμπερασματικά, οι εκπαιδευτικοί είναι οι καλύτεροι για την εκπαίδευση των παιδιών.",
                "stance": [
                    {
                        "id": "A1",
                        "type": "For"
                    }
                ]
            },
            {
                "id": "T4",
                "type": "Premise",
                "starts": "542",
                "ends": "673",
                "segment": "Για παράδειγμα, για να αποκτήσουν πιστοποιητικά δασκάλων, οι άνθρωποι χρειάζονται χρόνια εκπαίδευσης στα κανονικά τους σχολεία για να μάθουν θεωρητικές γνώσεις."
            },
            {
                "id": "T5",
                "type": "Premise",
                "starts": "684",
                "ends": "813",
                "segment": "Ωστόσο, σε σύγκριση με τους δασκάλους, οι γονείς τείνουν να έχουν λιγότερες γνώσεις για να διδάξουν τα θέματα των παιδιών τους όπως τα μαθηματικά και η φυσική."
            },
            {
                "id": "T6",
                "type": "Claim",
                "starts": "453",
                "ends": "526",
                "segment": "Κατ &#39;αρχάς, οι δάσκαλοι του σχολείου είναι πιο ειδικοί από τους γονείς στον τομέα της εκπαίδευσης.",
                "stance": [
                    {
                        "id": "A2",
                        "type": "For"
                    }
                ]
            },
            {
                "id": "T7",
                "type": "Claim",
                "starts": "828",
                "ends": "929",
                "segment": "τα θέματα των παιδιών τους όπως τα μαθηματικά και η φυσική.",
                "stance": [
                    {
                        "id": "A3",
                        "type": "For"
                    }
                ]
            },
            {
                "id": "T8",
                "type": "Premise",
                "starts": "944",
                "ends": "1174",
                "segment": "Για παράδειγμα, μετά από πολλά χρόνια διδακτικής εμπειρίας, ο δάσκαλος είναι σε θέση να γνωρίζει πώς να βοηθήσει τα παιδιά να αναπτύξουν σημαντικές δεξιότητες ζωής, όπως η εκμάθηση προσωπικών ορίων, η αντιμετώπιση μελλοντικών προβλημάτων και η εκμάθηση σημαντικών δεξιοτήτων επίλυσης συγκρούσεων."
            },
            {
                "id": "T9",
                "type": "Premise",
                "starts": "1189",
                "ends": "1340",
                "segment": "Αντίθετα, οι γονείς αντιμετωπίζουν δύσκολο χάσμα γενιάς με τα παιδιά τους, επειδή είναι λιγότερο πιθανό να γνωρίζουν πώς να χειρίζονται τις οικογενειακές συγκρούσεις με αποτελεσματικό τρόπο."
            },
            {
                "id": "T10",
                "type": "Claim",
                "starts": "1616",
                "ends": "1663",
                "segment": "οι δύο γονείς να εργαστούν, επομένως υπάρχει περιορισμένος χρόνος για να διδάξουν τα παιδιά τους.",
                "stance": [
                    {
                        "id": "A4",
                        "type": "For"
                    }
                ]
            },
            {
                "id": "T11",
                "type": "Premise",
                "starts": "1363",
                "ends": "1447",
                "segment": "επειδή είναι λιγότερο πιθανό να γνωρίζουν πώς να χειρίζονται τις οικογενειακές συγκρούσεις με αποτελεσματικό τρόπο."
            },
            {
                "id": "T12",
                "type": "Premise",
                "starts": "1449",
                "ends": "1541",
                "segment": "Τέλος, σε σύγκριση με τους δασκάλους, οι γονείς δεν έχουν αρκετό χρόνο για να περάσουν με τα παιδιά τους."
            },
            {
                "id": "T13",
                "type": "Premise",
                "starts": "1549",
                "ends": "1608",
                "segment": "Σήμερα αντιμετωπίζουμε μια παγκόσμια οικονομική κρίση και είναι απαραίτητο και οι δύο γονείς να εργαστούν, επομένως υπάρχει περιορισμένος χρόνος για να διδάξουν τα παιδιά τους."
            }
        ],
        "Relations": [
            {
                "id": "R1",
                "type": "supports",
                "arg1": "T4",
                "arg2": "T6"
            },
            {
                "id": "R2",
                "type": "supports",
                "arg1": "T5",
                "arg2": "T6"
            },
            {
                "id": "R3",
                "type": "supports",
                "arg1": "T8",
                "arg2": "T7"
            },
            {
                "id": "R4",
                "type": "supports",
                "arg1": "T9",
                "arg2": "T7"
            },
            {
                "id": "R5",
                "type": "supports",
                "arg1": "T12",
                "arg2": "T13"
            },
            {
                "id": "R6",
                "type": "supports",
                "arg1": "T13",
                "arg2": "T10"
            },
            {
                "id": "R7",
                "type": "supports",
                "arg1": "T11",
                "arg2": "T10"
            }
        ]
    },
    "content": "Ο δάσκαλος είναι η καλύτερη επιλογή για την εκπαίδευση των παιδιών σε ορισμένες πτυχές Πρόσφατα, υπήρξε μια κοινωνική ανησυχία σχετικά με το ποιος είναι ο καλύτερος δάσκαλος για την εκπαίδευση των παιδιών. Πράγματι, τα παιδιά μεγαλώνουν με δύο σημαντικά άτομα, τους γονείς και τους δασκάλους τους, και και τα δύο είναι σημαντικά στην ανάπτυξη των παιδιών. Όσον αφορά εμένα, συμφωνώ με την άποψη ότι ο δάσκαλος είναι η καλύτερη επιλογή για την εκπαίδευση των παιδιών σε ορισμένες πτυχές. Κατ &#39;αρχάς, οι δάσκαλοι του σχολείου είναι πιο ειδικοί από τους γονείς στον τομέα της εκπαίδευσης. Για παράδειγμα, για να αποκτήσουν πιστοποιητικά δασκάλων, οι άνθρωποι χρειάζονται χρόνια εκπαίδευσης στα κανονικά τους σχολεία για να μάθουν θεωρητικές γνώσεις. Ωστόσο, σε σύγκριση με τους δασκάλους, οι γονείς τείνουν να έχουν λιγότερες γνώσεις για να διδάξουν τα θέματα των παιδιών τους όπως τα μαθηματικά και η φυσική. Επιπλέον, το διδακτικό προσωπικό είναι επαγγελματικό και έμπειρο όσον αφορά την προώθηση των δεξιοτήτων επικοινωνίας των παιδιών. Για παράδειγμα, μετά από πολλά χρόνια διδακτικής εμπειρίας, ο δάσκαλος είναι σε θέση να γνωρίζει πώς να βοηθήσει τα παιδιά να αναπτύξουν σημαντικές δεξιότητες ζωής, όπως η εκμάθηση προσωπικών ορίων, η αντιμετώπιση μελλοντικών προβλημάτων και η εκμάθηση σημαντικών δεξιοτήτων επίλυσης συγκρούσεων. Αντίθετα, οι γονείς αντιμετωπίζουν δύσκολο χάσμα γενιάς με τα παιδιά τους, επειδή είναι λιγότερο πιθανό να γνωρίζουν πώς να χειρίζονται τις οικογενειακές συγκρούσεις με αποτελεσματικό τρόπο. Τέλος, σε σύγκριση με τους δασκάλους, οι γονείς δεν έχουν αρκετό χρόνο για να περάσουν με τα παιδιά τους. Σήμερα αντιμετωπίζουμε μια παγκόσμια οικονομική κρίση και είναι απαραίτητο και οι δύο γονείς να εργαστούν, επομένως υπάρχει περιορισμένος χρόνος για να διδάξουν τα παιδιά τους. Έτσι, ήταν αδύνατο να γίνουν καλοί δάσκαλοι. Συμπερασματικά, οι εκπαιδευτικοί είναι οι καλύτεροι για την εκπαίδευση των παιδιών. Όχι μόνο συμβάλλουν πολύ στις επαγγελματικές δεξιότητες των παιδιών, αλλά μπορούν επίσης να διδάξουν στους μαθητές τους σημαντικές τεχνικές κοινωνικής επικοινωνίας για να επιβιώσουν σε αυτόν τον ανταγωνιστικό κόσμο."
}