{
    "id": "9cb22b469c3ff18da9cffc7b78f15abc",
    "link": "",
    "description": "",
    "date": "",
    "tags": [],
    "publishedAt": "",
    "crawledAt": "",
    "domain": "",
    "netloc": "",
    "annotations": {
        "ADUs": [
            {
                "id": "T1",
                "type": "MajorClaim",
                "starts": "309",
                "ends": "419",
                "segment": "Ωστόσο, κατά τη γνώμη μου, θα ήταν καλύτερο να αφήσετε αυτόν τον τύπο εκπαίδευσης για μια συγκεκριμένη ομάδα καλών, πεπειραμένων εκπαιδευόμενων."
            },
            {
                "id": "T2",
                "type": "MajorClaim",
                "starts": "1944",
                "ends": "2082",
                "segment": "Συνοψίζοντας, συμφωνώ ότι όλοι πρέπει να έχουν υποχρεωτικό επίπεδο εκπαίδευσης έως το γυμνάσιο, αλλά τα παραπάνω τμήματα θα πρέπει να είναι μόνο η σφαίρα των καλύτερων μαθητών."
            },
            {
                "id": "T3",
                "type": "Claim",
                "starts": "2084",
                "ends": "2202",
                "segment": "Αυτό θα βελτιώσει την ποιότητα τόσο των πανεπιστημίων όσο και των φοιτητών, τοποθετώντας έτσι τους ανθρώπους σε θέσεις που τους ταιριάζουν περισσότερο.",
                "stance": [
                    {
                        "id": "A1",
                        "type": "For"
                    }
                ]
            },
            {
                "id": "T4",
                "type": "Claim",
                "starts": "428",
                "ends": "481",
                "segment": "Πρώτον, η εστίαση μόνο σε ταλαντούχους μαθητές είναι μια καλύτερη επιλογή, διότι βοηθά τα ακαδημαϊκά ιδρύματα να διατηρήσουν την υψηλή τους εκπαίδευση.",
                "stance": [
                    {
                        "id": "A2",
                        "type": "For"
                    }
                ]
            },
            {
                "id": "T5",
                "type": "Premise",
                "starts": "490",
                "ends": "558",
                "segment": "ταλαντούχους μαθητές είναι μια καλύτερη επιλογή, διότι βοηθά τα ακαδημαϊκά ιδρύματα να διατηρήσουν την υψηλή τους εκπαίδευση."
            },
            {
                "id": "T6",
                "type": "Premise",
                "starts": "560",
                "ends": "715",
                "segment": "Σε αντίθεση με το γυμνάσιο ή το γυμνάσιο, το πανεπιστήμιο και το κολέγιο απαιτούν πολλές ικανότητες και δεξιότητες για να συμβαδίζουν με μια τεράστια ποσότητα πολύπλοκων γνώσεων."
            },
            {
                "id": "T7",
                "type": "Premise",
                "starts": "726",
                "ends": "840",
                "segment": "Στην πραγματικότητα, ορισμένοι μαθητές μπορεί να είναι ικανοί στα γυμνάσια, αλλά η πίεση της τριτοβάθμιας εκπαίδευσης είναι σκληρή ακόμη και για ταλαντούχους."
            },
            {
                "id": "T8",
                "type": "Premise",
                "starts": "842",
                "ends": "960",
                "segment": "Αυτό εξηγεί γιατί είναι κατάλληλο μόνο για περιορισμένα άτομα και το άνοιγμα για όλους θα είναι θανατηφόρο για τα ιδρύματα, καθώς πρέπει κάπως να μειώσουν το υλικό έτσι ώστε να είναι πρακτικό για όλους."
            },
            {
                "id": "T9",
                "type": "Premise",
                "starts": "968",
                "ends": "1045",
                "segment": "θα είναι θανατηφόρο για τα ιδρύματα, καθώς πρέπει κάπως να μειώσουν το υλικό έτσι ώστε να είναι πρακτικό για όλους."
            },
            {
                "id": "T10",
                "type": "Claim",
                "starts": "1057",
                "ends": "1100",
                "segment": "ώστε να είναι πρακτικό για όλους.",
                "stance": [
                    {
                        "id": "A3",
                        "type": "For"
                    }
                ]
            },
            {
                "id": "T11",
                "type": "Premise",
                "starts": "1109",
                "ends": "1167",
                "segment": "το πανεπιστήμιο θα πρέπει να δέχεται μόνο καλούς φοιτητές, επειδή παρέχει καλύτερους ανθρώπινους πόρους για εξελιγμένους σκοπούς."
            },
            {
                "id": "T12",
                "type": "Premise",
                "starts": "1192",
                "ends": "1296",
                "segment": "Μερικοί άνθρωποι υποστηρίζουν ότι αυτό μπορεί να οδηγήσει σε «κοινωνικό διαχωρισμό», όταν κάποιος με υψηλή εκπαίδευση αρνείται να κάνει τις λεγόμενες «χαμηλές θέσεις εργασίας», αλλά στην πραγματικότητα δεν βλάπτει ολόκληρη την κοινότητα."
            },
            {
                "id": "T13",
                "type": "Premise",
                "starts": "1311",
                "ends": "1350",
                "segment": "εκπαίδευση αρνείται να κάνει τις λεγόμενες «χαμηλές θέσεις εργασίας», αλλά στην πραγματικότητα δεν βλάπτει ολόκληρη την κοινότητα."
            },
            {
                "id": "T14",
                "type": "Premise",
                "starts": "1352",
                "ends": "1522",
                "segment": "Αυτές οι τυπικές θέσεις εργασίας θα είναι πάντα διαθέσιμες για όλους, ενώ οι πολύπλοκες θα πρέπει να χειρίζονται μόνο τους καλύτερους ανθρώπους, οι οποίοι ξεκινούν την καριέρα τους από τα καλύτερα ιδρύματα."
            },
            {
                "id": "T15",
                "type": "Premise",
                "starts": "1532",
                "ends": "1614",
                "segment": "Πιστεύω ότι ο περιορισμός του αριθμού των ατόμων που μπορούν να γίνουν δεκτοί από τα πανεπιστήμια είναι μια καλή επιλογή, δεδομένου ότι θα επιβραβεύσει τα κίνητρα των μαθητών και θα τους κρατήσει συνεχώς στο δύσκολο επίπεδο μάθησης, γεγονός που τους κάνει να κάνουν το καλύτερο για να βελτιωθούν."
            },
            {
                "id": "T16",
                "type": "Premise",
                "starts": "1621",
                "ends": "1774",
                "segment": "αριθμού των ατόμων που μπορούν να γίνουν δεκτοί από τα πανεπιστήμια είναι μια καλή επιλογή, δεδομένου ότι θα επιβραβεύσει τα κίνητρα των μαθητών και θα τους κρατήσει συνεχώς στο δύσκολο επίπεδο μάθησης, γεγονός που τους κάνει να κάνουν το καλύτερο για να βελτιωθούν."
            },
            {
                "id": "T17",
                "type": "Premise",
                "starts": "1788",
                "ends": "1912",
                "segment": "Τελικά, αυτό βελτιώνει τη συνολική ποιότητα της εκπαίδευσης και δίνει στους καλύτερους ανθρώπους να εξυπηρετούν τις πιο αναγκαίες ανάγκες της κοινωνίας."
            }
        ],
        "Relations": [
            {
                "id": "R1",
                "type": "supports",
                "arg1": "T9",
                "arg2": "T8"
            },
            {
                "id": "R2",
                "type": "supports",
                "arg1": "T5",
                "arg2": "T4"
            },
            {
                "id": "R3",
                "type": "supports",
                "arg1": "T6",
                "arg2": "T4"
            },
            {
                "id": "R4",
                "type": "supports",
                "arg1": "T7",
                "arg2": "T4"
            },
            {
                "id": "R5",
                "type": "supports",
                "arg1": "T8",
                "arg2": "T4"
            },
            {
                "id": "R6",
                "type": "supports",
                "arg1": "T11",
                "arg2": "T10"
            },
            {
                "id": "R7",
                "type": "attacks",
                "arg1": "T12",
                "arg2": "T10"
            },
            {
                "id": "R8",
                "type": "attacks",
                "arg1": "T13",
                "arg2": "T12"
            },
            {
                "id": "R9",
                "type": "attacks",
                "arg1": "T14",
                "arg2": "T12"
            },
            {
                "id": "R10",
                "type": "supports",
                "arg1": "T15",
                "arg2": "T10"
            },
            {
                "id": "R11",
                "type": "supports",
                "arg1": "T16",
                "arg2": "T15"
            },
            {
                "id": "R12",
                "type": "supports",
                "arg1": "T17",
                "arg2": "T15"
            }
        ]
    },
    "content": "Η πανεπιστημιακή εκπαίδευση πρέπει να είναι διαθέσιμη μόνο για καλούς φοιτητές. Ο σκοπός της εκπαίδευσης είναι πάντα ένα αμφιλεγόμενο θέμα μεταξύ των ανθρώπων και της κοινωνίας, ειδικά σε υψηλό επίπεδο όπως το κολέγιο ή το πανεπιστήμιο. Μερικοί άνθρωποι πιστεύουν ότι όλοι οι μαθητές πρέπει να αξίζουν να εκπαιδεύονται σε αυτό το επίπεδο. Ωστόσο, κατά τη γνώμη μου, θα ήταν καλύτερο να αφήσετε αυτόν τον τύπο εκπαίδευσης για μια συγκεκριμένη ομάδα καλών, πεπειραμένων εκπαιδευόμενων. Πρώτον, η εστίαση μόνο σε ταλαντούχους μαθητές είναι μια καλύτερη επιλογή, διότι βοηθά τα ακαδημαϊκά ιδρύματα να διατηρήσουν την υψηλή τους εκπαίδευση. Σε αντίθεση με το γυμνάσιο ή το γυμνάσιο, το πανεπιστήμιο και το κολέγιο απαιτούν πολλές ικανότητες και δεξιότητες για να συμβαδίζουν με μια τεράστια ποσότητα πολύπλοκων γνώσεων. Στην πραγματικότητα, ορισμένοι μαθητές μπορεί να είναι ικανοί στα γυμνάσια, αλλά η πίεση της τριτοβάθμιας εκπαίδευσης είναι σκληρή ακόμη και για ταλαντούχους. Αυτό εξηγεί γιατί είναι κατάλληλο μόνο για περιορισμένα άτομα και το άνοιγμα για όλους θα είναι θανατηφόρο για τα ιδρύματα, καθώς πρέπει κάπως να μειώσουν το υλικό έτσι ώστε να είναι πρακτικό για όλους. Δεύτερον, το πανεπιστήμιο θα πρέπει να δέχεται μόνο καλούς φοιτητές, επειδή παρέχει καλύτερους ανθρώπινους πόρους για εξελιγμένους σκοπούς. Μερικοί άνθρωποι υποστηρίζουν ότι αυτό μπορεί να οδηγήσει σε «κοινωνικό διαχωρισμό», όταν κάποιος με υψηλή εκπαίδευση αρνείται να κάνει τις λεγόμενες «χαμηλές θέσεις εργασίας», αλλά στην πραγματικότητα δεν βλάπτει ολόκληρη την κοινότητα. Αυτές οι τυπικές θέσεις εργασίας θα είναι πάντα διαθέσιμες για όλους, ενώ οι πολύπλοκες θα πρέπει να χειρίζονται μόνο τους καλύτερους ανθρώπους, οι οποίοι ξεκινούν την καριέρα τους από τα καλύτερα ιδρύματα. Πιστεύω ότι ο περιορισμός του αριθμού των ατόμων που μπορούν να γίνουν δεκτοί από τα πανεπιστήμια είναι μια καλή επιλογή, δεδομένου ότι θα επιβραβεύσει τα κίνητρα των μαθητών και θα τους κρατήσει συνεχώς στο δύσκολο επίπεδο μάθησης, γεγονός που τους κάνει να κάνουν το καλύτερο για να βελτιωθούν. Τελικά, αυτό βελτιώνει τη συνολική ποιότητα της εκπαίδευσης και δίνει στους καλύτερους ανθρώπους να εξυπηρετούν τις πιο αναγκαίες ανάγκες της κοινωνίας. Συνοψίζοντας, συμφωνώ ότι όλοι πρέπει να έχουν υποχρεωτικό επίπεδο εκπαίδευσης έως το γυμνάσιο, αλλά τα παραπάνω τμήματα θα πρέπει να είναι μόνο η σφαίρα των καλύτερων μαθητών. Αυτό θα βελτιώσει την ποιότητα τόσο των πανεπιστημίων όσο και των φοιτητών, τοποθετώντας έτσι τους ανθρώπους σε θέσεις που τους ταιριάζουν περισσότερο."
}