{
    "id": "2ae49f124d98d9ca8a19ac737a0b57a4",
    "link": "",
    "description": "",
    "date": "",
    "tags": [],
    "publishedAt": "",
    "crawledAt": "",
    "domain": "",
    "netloc": "",
    "annotations": {
        "ADUs": [
            {
                "id": "T1",
                "type": "MajorClaim",
                "starts": "203",
                "ends": "233",
                "segment": "Ωστόσο, προτιμώ να μελετώ ατομικά γιατί με βοηθά να συγκεντρωθώ περισσότερο και με βοηθά να χτίσω την προσωπικότητά μου."
            },
            {
                "id": "T2",
                "type": "Claim",
                "starts": "242",
                "ends": "314",
                "segment": "μελετώ ατομικά γιατί με βοηθά να συγκεντρωθώ περισσότερο και με βοηθά να χτίσω την προσωπικότητά μου.",
                "stance": [
                    {
                        "id": "A1",
                        "type": "For"
                    }
                ]
            },
            {
                "id": "T3",
                "type": "MajorClaim",
                "starts": "1261",
                "ends": "1301",
                "segment": "Στην πραγματικότητα, συμφωνώ με την ιδέα της μελέτης ενός μοναχικού, καθώς με βοηθά να επικεντρωθώ περισσότερο και να εδραιώσω την προσωπικότητά μου."
            },
            {
                "id": "T4",
                "type": "Claim",
                "starts": "1308",
                "ends": "1362",
                "segment": "της μελέτης ενός μοναχικού, καθώς με βοηθά να επικεντρωθώ περισσότερο και να εδραιώσω την προσωπικότητά μου.",
                "stance": [
                    {
                        "id": "A2",
                        "type": "For"
                    }
                ]
            },
            {
                "id": "T5",
                "type": "Claim",
                "starts": "316",
                "ends": "368",
                "segment": "Μελετώντας μόνοι μας βοηθά να επικεντρωθούμε περισσότερο στα μαθήματά μας.",
                "stance": [
                    {
                        "id": "A3",
                        "type": "For"
                    }
                ]
            },
            {
                "id": "T6",
                "type": "Premise",
                "starts": "384",
                "ends": "457",
                "segment": "Για παράδειγμα, είμαι ένας τύπος ατόμου που δεν μπορεί να κατανοήσει τα θέματα μου εκτός αν είμαι μόνος."
            },
            {
                "id": "T7",
                "type": "Premise",
                "starts": "459",
                "ends": "529",
                "segment": "Μπορώ να προετοιμάσω τα χρονοδιαγράμματα, τις οδηγίες, τις ασκήσεις και να τα ξεπεράσω όλα."
            },
            {
                "id": "T8",
                "type": "Premise",
                "starts": "541",
                "ends": "641",
                "segment": "Επιπλέον, έχουμε πολλά θέματα που απαιτούν από εμάς να καθόμαστε και να μελετούμε μόνοι μας, όπως τα μαθηματικά, η ανάγνωση και το σχέδιο."
            },
            {
                "id": "T9",
                "type": "Premise",
                "starts": "658",
                "ends": "728",
                "segment": "Κατά τη γνώμη μου, μπορώ να εκμεταλλευτώ κάθε λεπτό χωρίς σπατάλη με τη μελέτη μόνος μου."
            },
            {
                "id": "T10",
                "type": "Claim",
                "starts": "744",
                "ends": "797",
                "segment": "κάθε λεπτό χωρίς σπατάλη με τη μελέτη μόνος μου.",
                "stance": [
                    {
                        "id": "A5",
                        "type": "For"
                    }
                ]
            },
            {
                "id": "T11",
                "type": "Premise",
                "starts": "812",
                "ends": "893",
                "segment": "Για παράδειγμα, η απάντηση μόνο στην εργασία μας μας ενθαρρύνει να είμαστε πιο υπεύθυνοι και ανεξάρτητοι."
            },
            {
                "id": "T12",
                "type": "Premise",
                "starts": "901",
                "ends": "957",
                "segment": "εργασία μας μας ενθαρρύνει να είμαστε πιο υπεύθυνοι και ανεξάρτητοι."
            },
            {
                "id": "T13",
                "type": "Premise",
                "starts": "971",
                "ends": "1111",
                "segment": "Προσωπικά, όταν διορθώνω το πρόγραμμα σπουδών μου με συγκεκριμένο χρόνο και το τελειώνω εγκαίρως, βελτιώνει την ικανότητά μου στο μέλλον να γίνεται πιο ακριβής και προσεκτικός."
            }
        ],
        "Relations": [
            {
                "id": "R1",
                "type": "supports",
                "arg1": "T6",
                "arg2": "T5"
            },
            {
                "id": "R2",
                "type": "supports",
                "arg1": "T7",
                "arg2": "T5"
            },
            {
                "id": "R3",
                "type": "supports",
                "arg1": "T8",
                "arg2": "T5"
            },
            {
                "id": "R4",
                "type": "supports",
                "arg1": "T9",
                "arg2": "T5"
            },
            {
                "id": "R5",
                "type": "supports",
                "arg1": "T11",
                "arg2": "T10"
            },
            {
                "id": "R6",
                "type": "supports",
                "arg1": "T12",
                "arg2": "T10"
            },
            {
                "id": "R7",
                "type": "supports",
                "arg1": "T13",
                "arg2": "T10"
            }
        ]
    },
    "content": "Μερικοί μαθητές προτιμούν να μελετούν μόνοι τους. Ο καθένας έχει τη μέθοδο του στην επιτυχία στη ζωή. Στο σχολείο ή στο πανεπιστήμιο, η επιτυχία εξαρτάται από το πώς μελετάμε. Μερικοί μαθητές ωφελούνται πολύ όταν σπουδάζουν με ομάδες. Ωστόσο, προτιμώ να μελετώ ατομικά γιατί με βοηθά να συγκεντρωθώ περισσότερο και με βοηθά να χτίσω την προσωπικότητά μου. Μελετώντας μόνοι μας βοηθά να επικεντρωθούμε περισσότερο στα μαθήματά μας. Για παράδειγμα, είμαι ένας τύπος ατόμου που δεν μπορεί να κατανοήσει τα θέματα μου εκτός αν είμαι μόνος. Μπορώ να προετοιμάσω τα χρονοδιαγράμματα, τις οδηγίες, τις ασκήσεις και να τα ξεπεράσω όλα. Επιπλέον, έχουμε πολλά θέματα που απαιτούν από εμάς να καθόμαστε και να μελετούμε μόνοι μας, όπως τα μαθηματικά, η ανάγνωση και το σχέδιο. Κατά τη γνώμη μου, μπορώ να εκμεταλλευτώ κάθε λεπτό χωρίς σπατάλη με τη μελέτη μόνος μου. Επιπλέον, χτίζουμε τις προσωπικότητές μας όταν μελετάμε μόνοι μας. Για παράδειγμα, η απάντηση μόνο στην εργασία μας μας ενθαρρύνει να είμαστε πιο υπεύθυνοι και ανεξάρτητοι. Επίσης, μας παρακινεί να είμαστε ακριβείς στο έργο μας στο μέλλον. Προσωπικά, όταν διορθώνω το πρόγραμμα σπουδών μου με συγκεκριμένο χρόνο και το τελειώνω εγκαίρως, βελτιώνει την ικανότητά μου στο μέλλον να γίνεται πιο ακριβής και προσεκτικός. Εν κατακλείδι, υπάρχουν πολλοί τρόποι για να μελετήσουμε και είναι δικαίωμά μας να επιλέξουμε ποιος είναι κατάλληλος για τους χαρακτήρες μας είτε μόνος είτε με ομάδα. Στην πραγματικότητα, συμφωνώ με την ιδέα της μελέτης ενός μοναχικού, καθώς με βοηθά να επικεντρωθώ περισσότερο και να εδραιώσω την προσωπικότητά μου. Η επιτυχία μας χρειάζεται να εργαστούμε σκληρά και να θυσιάσουμε περισσότερο είτε επιλέγουμε να μελετήσουμε μόνοι μας είτε με ομάδα."
}