{
    "id": "6f095219afb1466f258303ba0dd210e6",
    "link": "",
    "description": "",
    "date": "",
    "tags": [],
    "publishedAt": "",
    "crawledAt": "",
    "domain": "",
    "netloc": "",
    "annotations": {
        "ADUs": [
            {
                "id": "T1",
                "type": "MajorClaim",
                "starts": "132",
                "ends": "200",
                "segment": "ότι τόσο η εκμάθηση από εμένα όσο και η εκμάθηση με έναν δάσκαλο θα μπορούσαν να είναι χρήσιμες."
            },
            {
                "id": "T2",
                "type": "Claim",
                "starts": "202",
                "ends": "305",
                "segment": "Η εκμάθηση με έναν δάσκαλο μπορεί να αποτρέψει τη σύγχυση ενός ατόμου και να αυξήσει το ρυθμό και την ταχύτητα της μάθησης.",
                "stance": [
                    {
                        "id": "A1",
                        "type": "For"
                    }
                ]
            },
            {
                "id": "T3",
                "type": "Claim",
                "starts": "339",
                "ends": "388",
                "segment": "Ένα άλλο σημαντικό σημείο είναι ότι για πρακτικά μαθήματα πρέπει να έχετε δάσκαλο.",
                "stance": [
                    {
                        "id": "A2",
                        "type": "For"
                    }
                ]
            },
            {
                "id": "T4",
                "type": "Claim",
                "starts": "409",
                "ends": "452",
                "segment": "Από την άλλη πλευρά, μερικές φορές προτιμώ να μαθαίνω μόνος μου.",
                "stance": [
                    {
                        "id": "A3",
                        "type": "For"
                    }
                ]
            },
            {
                "id": "T5",
                "type": "MajorClaim",
                "starts": "2228",
                "ends": "2299",
                "segment": "οι δύο μπορούν να βοηθήσουν και καθένας από αυτούς έχει τα δικά του πλεονεκτήματα και μειονεκτήματα."
            },
            {
                "id": "T6",
                "type": "Claim",
                "starts": "2156",
                "ends": "2214",
                "segment": "καλό να μαθαίνω με έναν δάσκαλο και μερικές φορές μόνοι μου.",
                "stance": [
                    {
                        "id": "A4",
                        "type": "For"
                    }
                ]
            },
            {
                "id": "T7",
                "type": "Claim",
                "starts": "853",
                "ends": "922",
                "segment": "και επομένως θα μάθω γρηγορότερα και καλύτερα και δεν θα αποθαρρυνθώ και θα μπερδευτώ.",
                "stance": [
                    {
                        "id": "A5",
                        "type": "For"
                    }
                ]
            },
            {
                "id": "T8",
                "type": "Premise",
                "starts": "454",
                "ends": "520",
                "segment": "Ένας καλός και έμπειρος δάσκαλος μπορεί να με βοηθήσει να μάθω γρηγορότερα και ευκολότερα."
            },
            {
                "id": "T9",
                "type": "Premise",
                "starts": "522",
                "ends": "684",
                "segment": "Μερικές φορές όταν μαθαίνω ένα μάθημα που είναι δύσκολο και μπερδεμένο να το καταλάβω και έχει λίγες διαθέσιμες πηγές, αποθαρρύνομαι μετά από πολύ χρόνο."
            },
            {
                "id": "T10",
                "type": "Premise",
                "starts": "686",
                "ends": "765",
                "segment": "Σε αυτήν την περίπτωση, θα αναζητήσω έναν δάσκαλο και θα ζητήσω βοήθεια από αυτόν."
            },
            {
                "id": "T11",
                "type": "Premise",
                "starts": "767",
                "ends": "838",
                "segment": "Και τότε θα μου διδάξει το μάθημα αποτελεσματικά σε σύντομο χρονικό διάστημα και επομένως θα μάθω γρηγορότερα και καλύτερα και δεν θα αποθαρρυνθώ και θα μπερδευτώ."
            },
            {
                "id": "T12",
                "type": "Premise",
                "starts": "1033",
                "ends": "1182",
                "segment": "Για παράδειγμα, εάν θέλετε να μάθετε να οδηγείτε αυτοκίνητο ή κάποιες δουλειές όπως ιατρική και μηχανική και κάποια αθλήματα όπως το σκι και το κολύμπι, θα πρέπει να βρείτε έναν δάσκαλο."
            },
            {
                "id": "T13",
                "type": "Premise",
                "starts": "1184",
                "ends": "1256",
                "segment": "Είναι σχεδόν αδύνατο και αναποτελεσματικό να μάθετε αυτά τα πράγματα μόνοι σας."
            },
            {
                "id": "T14",
                "type": "Premise",
                "starts": "1270",
                "ends": "1366",
                "segment": "Παρεμπιπτόντως, εάν πρόκειται να μάθετε μερικά πράγματα μόνοι σας, μπορείτε να τα μάθετε και να τα καταλάβετε εσφαλμένα! Για παράδειγμα, από τις δικές μου εμπειρίες, αφού άρχισα να μαθαίνω να παίζω κιθάρα χωρίς δάσκαλο, συνηθίζω να κάνω λάθος συνήθειες σχετικά με το ρουχισμό και το τέμπο, αλλά αφού βρήκα και μαθαίνω με έναν δάσκαλο και εντοπίζω και εξαλείφω αυτές τις εσφαλμένες συνήθειες, ήμουν σε θέση για να παίξετε σωστά."
            },
            {
                "id": "T15",
                "type": "Claim",
                "starts": "924",
                "ends": "1018",
                "segment": "Υπάρχουν ορισμένα πρακτικά μαθήματα που μπορείτε να τα μάθετε μόνο με έναν δάσκαλο ή έναν εκπαιδευτή.",
                "stance": [
                    {
                        "id": "A6",
                        "type": "For"
                    }
                ]
            },
            {
                "id": "T16",
                "type": "Premise",
                "starts": "1381",
                "ends": "1658",
                "segment": "παράδειγμα, από τις δικές μου εμπειρίες, αφού άρχισα να μαθαίνω να παίζω κιθάρα χωρίς δάσκαλο, συνηθίζω να κάνω λάθος συνήθειες σχετικά με το ρουχισμό και το τέμπο, αλλά αφού βρήκα και μαθαίνω με έναν δάσκαλο και εντοπίζω και εξαλείφω αυτές τις εσφαλμένες συνήθειες, ήμουν σε θέση για να παίξετε σωστά."
            },
            {
                "id": "T17",
                "type": "Claim",
                "starts": "1660",
                "ends": "1727",
                "segment": "Υπάρχουν κάποια πράγματα που προτιμώ να τα μάθω χωρίς δάσκαλο γιατί δεν θα χρειαστεί να ξοδέψω επιπλέον χρήματα για έναν δάσκαλο και ο χρόνος μου δεν θα χαθεί ούτε λόγω της μετάβασης σε μαθήματα.",
                "stance": [
                    {
                        "id": "A7",
                        "type": "For"
                    }
                ]
            },
            {
                "id": "T18",
                "type": "Premise",
                "starts": "1736",
                "ends": "1849",
                "segment": "δάσκαλο γιατί δεν θα χρειαστεί να ξοδέψω επιπλέον χρήματα για έναν δάσκαλο και ο χρόνος μου δεν θα χαθεί ούτε λόγω της μετάβασης σε μαθήματα."
            },
            {
                "id": "T19",
                "type": "Premise",
                "starts": "1851",
                "ends": "1981",
                "segment": "Στο σημερινό κόσμο υπάρχουν πολλές μεγάλες και χρήσιμες πηγές όπως βιβλία, ηλεκτρονικά βιβλία, το Διαδίκτυο και τηλεόραση και δορυφόρος."
            },
            {
                "id": "T20",
                "type": "Premise",
                "starts": "1983",
                "ends": "2030",
                "segment": "Μπορώ να τα χρησιμοποιήσω ως σεμινάρια για πολλά πράγματα."
            },
            {
                "id": "T21",
                "type": "Premise",
                "starts": "2046",
                "ends": "2135",
                "segment": "μπορώ να μάθω Αγγλικά ή άλλες γλώσσες με πολλά χρήσιμα βιβλία και πολλούς διαδικτυακούς ιστότοπους."
            }
        ],
        "Relations": [
            {
                "id": "R1",
                "type": "supports",
                "arg1": "T11",
                "arg2": "T7"
            },
            {
                "id": "R2",
                "type": "supports",
                "arg1": "T10",
                "arg2": "T7"
            },
            {
                "id": "R3",
                "type": "supports",
                "arg1": "T9",
                "arg2": "T7"
            },
            {
                "id": "R4",
                "type": "supports",
                "arg1": "T8",
                "arg2": "T7"
            },
            {
                "id": "R5",
                "type": "supports",
                "arg1": "T13",
                "arg2": "T12"
            },
            {
                "id": "R6",
                "type": "supports",
                "arg1": "T16",
                "arg2": "T14"
            },
            {
                "id": "R7",
                "type": "supports",
                "arg1": "T14",
                "arg2": "T15"
            },
            {
                "id": "R8",
                "type": "supports",
                "arg1": "T12",
                "arg2": "T15"
            },
            {
                "id": "R9",
                "type": "supports",
                "arg1": "T18",
                "arg2": "T17"
            },
            {
                "id": "R10",
                "type": "supports",
                "arg1": "T21",
                "arg2": "T17"
            },
            {
                "id": "R11",
                "type": "supports",
                "arg1": "T20",
                "arg2": "T17"
            },
            {
                "id": "R12",
                "type": "supports",
                "arg1": "T19",
                "arg2": "T17"
            }
        ]
    },
    "content": "Μερικές φορές είναι καλό να μαθαίνω με έναν δάσκαλο και μερικές φορές μόνοι μου Οι διαφορετικοί άνθρωποι προτιμούν διαφορετικά στυλ μάθησης. Νομίζω ότι τόσο η εκμάθηση από εμένα όσο και η εκμάθηση με έναν δάσκαλο θα μπορούσαν να είναι χρήσιμες. Η εκμάθηση με έναν δάσκαλο μπορεί να αποτρέψει τη σύγχυση ενός ατόμου και να αυξήσει το ρυθμό και την ταχύτητα της μάθησης. Ένα άλλο σημαντικό σημείο είναι ότι για πρακτικά μαθήματα πρέπει να έχετε δάσκαλο. Από την άλλη πλευρά, μερικές φορές προτιμώ να μαθαίνω μόνος μου. Ένας καλός και έμπειρος δάσκαλος μπορεί να με βοηθήσει να μάθω γρηγορότερα και ευκολότερα. Μερικές φορές όταν μαθαίνω ένα μάθημα που είναι δύσκολο και μπερδεμένο να το καταλάβω και έχει λίγες διαθέσιμες πηγές, αποθαρρύνομαι μετά από πολύ χρόνο. Σε αυτήν την περίπτωση, θα αναζητήσω έναν δάσκαλο και θα ζητήσω βοήθεια από αυτόν. Και τότε θα μου διδάξει το μάθημα αποτελεσματικά σε σύντομο χρονικό διάστημα και επομένως θα μάθω γρηγορότερα και καλύτερα και δεν θα αποθαρρυνθώ και θα μπερδευτώ. Υπάρχουν ορισμένα πρακτικά μαθήματα που μπορείτε να τα μάθετε μόνο με έναν δάσκαλο ή έναν εκπαιδευτή. Για παράδειγμα, εάν θέλετε να μάθετε να οδηγείτε αυτοκίνητο ή κάποιες δουλειές όπως ιατρική και μηχανική και κάποια αθλήματα όπως το σκι και το κολύμπι, θα πρέπει να βρείτε έναν δάσκαλο. Είναι σχεδόν αδύνατο και αναποτελεσματικό να μάθετε αυτά τα πράγματα μόνοι σας. Παρεμπιπτόντως, εάν πρόκειται να μάθετε μερικά πράγματα μόνοι σας, μπορείτε να τα μάθετε και να τα καταλάβετε εσφαλμένα! Για παράδειγμα, από τις δικές μου εμπειρίες, αφού άρχισα να μαθαίνω να παίζω κιθάρα χωρίς δάσκαλο, συνηθίζω να κάνω λάθος συνήθειες σχετικά με το ρουχισμό και το τέμπο, αλλά αφού βρήκα και μαθαίνω με έναν δάσκαλο και εντοπίζω και εξαλείφω αυτές τις εσφαλμένες συνήθειες, ήμουν σε θέση για να παίξετε σωστά. Υπάρχουν κάποια πράγματα που προτιμώ να τα μάθω χωρίς δάσκαλο γιατί δεν θα χρειαστεί να ξοδέψω επιπλέον χρήματα για έναν δάσκαλο και ο χρόνος μου δεν θα χαθεί ούτε λόγω της μετάβασης σε μαθήματα. Στο σημερινό κόσμο υπάρχουν πολλές μεγάλες και χρήσιμες πηγές όπως βιβλία, ηλεκτρονικά βιβλία, το Διαδίκτυο και τηλεόραση και δορυφόρος. Μπορώ να τα χρησιμοποιήσω ως σεμινάρια για πολλά πράγματα. Για παράδειγμα, μπορώ να μάθω Αγγλικά ή άλλες γλώσσες με πολλά χρήσιμα βιβλία και πολλούς διαδικτυακούς ιστότοπους. Εν ολίγοις, μερικές φορές είναι καλό να μαθαίνω με έναν δάσκαλο και μερικές φορές μόνοι μου. Κατά τη γνώμη μου, και οι δύο μπορούν να βοηθήσουν και καθένας από αυτούς έχει τα δικά του πλεονεκτήματα και μειονεκτήματα."
}