{
    "id": "31fb6191a5c114b68f33420e3d61f3d5",
    "link": "",
    "description": "",
    "date": "",
    "tags": [],
    "publishedAt": "",
    "crawledAt": "",
    "domain": "",
    "netloc": "",
    "annotations": {
        "ADUs": [
            {
                "id": "T1",
                "type": "MajorClaim",
                "starts": "400",
                "ends": "482",
                "segment": "οι φοιτητές μπορούν να αποκτήσουν πανεπιστημιακές γνώσεις χωρίς την προϋπόθεση της επιτυχίας των εξετάσεων."
            },
            {
                "id": "T2",
                "type": "MajorClaim",
                "starts": "2121",
                "ends": "2215",
                "segment": "Συνολικά, το πανεπιστήμιο θα πρέπει να επιτρέψει στον μαθητή να συμμετάσχει στην τάξη χωρίς να περάσει το τεστ, διότι όχι μόνο κάθε μαθητής είναι ειδικός σε κάθε μέρος ενός μαθήματος, αλλά και θα μειώσει τον μαθητή στην πανεπιστημιούπολη που αφήνει ακαλλιέργητους."
            },
            {
                "id": "T3",
                "type": "Claim",
                "starts": "2224",
                "ends": "2359",
                "segment": "το τεστ, διότι όχι μόνο κάθε μαθητής είναι ειδικός σε κάθε μέρος ενός μαθήματος, αλλά και θα μειώσει τον μαθητή στην πανεπιστημιούπολη που αφήνει ακαλλιέργητους.",
                "stance": [
                    {
                        "id": "A1",
                        "type": "For"
                    }
                ]
            },
            {
                "id": "T4",
                "type": "Premise",
                "starts": "637",
                "ends": "661",
                "segment": "μου αρέσει η Φυσική."
            },
            {
                "id": "T5",
                "type": "Premise",
                "starts": "671",
                "ends": "722",
                "segment": "δεν μου αρέσουν τα ηλεκτρονικά, γιατί τα ηλεκτρονικά δεν είναι πάντα ορατά στον πραγματικό κόσμο."
            },
            {
                "id": "T6",
                "type": "Claim",
                "starts": "537",
                "ends": "602",
                "segment": "Πρώτον, οι μαθητές δεν είναι συνεχώς ειδικοί σε κάθε μέρος ενός θέματος.",
                "stance": [
                    {
                        "id": "A2",
                        "type": "For"
                    }
                ]
            },
            {
                "id": "T7",
                "type": "Premise",
                "starts": "724",
                "ends": "786",
                "segment": "Και είχα 0 στη βαθμολογία της φυσικής όταν μελετώ τα ηλεκτρονικά."
            },
            {
                "id": "T8",
                "type": "Premise",
                "starts": "788",
                "ends": "861",
                "segment": "Αλλά πετυχαίνω συνεχώς 100 σκορ όταν μελετώ άλλο μέρος της φυσικής."
            },
            {
                "id": "T9",
                "type": "Premise",
                "starts": "863",
                "ends": "1025",
                "segment": "Και αν δεν μπορώ να παρακολουθήσω τα μαθήματα μέχρι να περάσω τις εξετάσεις ηλεκτρονικών, δεν θα μπορούσα να περάσω ολόκληρο το μέρος της φυσικής και θα αποτύχω ξανά στις εξετάσεις ξανά και ξανά."
            },
            {
                "id": "T10",
                "type": "Premise",
                "starts": "1027",
                "ends": "1115",
                "segment": "Ευτυχώς, στο πανεπιστήμιο μας, μπορείτε να παρακολουθήσετε τα μαθήματα ανεξάρτητα από το σκορ που φτάνετε."
            },
            {
                "id": "T11",
                "type": "Premise",
                "starts": "1117",
                "ends": "1180",
                "segment": "Και μπορώ να σπουδάσω φυσική χωρίς να μελετήσω τα ηλεκτρονικά μου."
            },
            {
                "id": "T12",
                "type": "Premise",
                "starts": "1182",
                "ends": "1241",
                "segment": "Και επιτέλους, πήρα ξανά τα ηλεκτρονικά και πέρασα τις εξετάσεις."
            },
            {
                "id": "T13",
                "type": "Claim",
                "starts": "1874",
                "ends": "2023",
                "segment": "Βεβαίως, ο φοιτητής του πανεπιστημίου μπορεί να μην φτάσει στο υψηλό εάν το πανεπιστήμιο επιτρέψει στο μαθητή να συμμετάσχει στην τάξη, ανεξάρτητα από το αν περάσει το τεστ ή όχι.",
                "stance": [
                    {
                        "id": "A3",
                        "type": "Against"
                    }
                ]
            },
            {
                "id": "T14",
                "type": "Premise",
                "starts": "2029",
                "ends": "2107",
                "segment": "Αλλά το όφελος της ελεύθερης πρόσβασης στα μαθήματα έκλεισε το ζήτημα των χαμηλότερων σημείων."
            },
            {
                "id": "T15",
                "type": "Claim",
                "starts": "1253",
                "ends": "1392",
                "segment": "Δεύτερον, εάν το πανεπιστήμιο ακολουθήσει την πολιτική ότι κανείς δεν μπορεί να παρακολουθήσει τα μαθήματα χωρίς να περάσει τις εξετάσεις, οι μαθητές είναι πολύ πιθανό να εγκαταλείψουν χωρίς καλλιέργεια.",
                "stance": [
                    {
                        "id": "A4",
                        "type": "For"
                    }
                ]
            },
            {
                "id": "T16",
                "type": "Premise",
                "starts": "1394",
                "ends": "1489",
                "segment": "Εάν κάποιος αποτύχει στις περισσότερες εξετάσεις, αυτό σημαίνει ότι αυτός ή αυτή δεν μπορεί να συμμετάσχει στα περισσότερα μαθήματα."
            },
            {
                "id": "T17",
                "type": "Premise",
                "starts": "1491",
                "ends": "1545",
                "segment": "Και οι μαθητές δεν θα έχουν καμία σχέση στην πανεπιστημιούπολη."
            },
            {
                "id": "T18",
                "type": "Premise",
                "starts": "1552",
                "ends": "1600",
                "segment": "Στη συνέχεια, αυτός ή αυτή θα παίξει online παιχνίδια ημέρες και νύχτες."
            },
            {
                "id": "T19",
                "type": "Premise",
                "starts": "1602",
                "ends": "1639",
                "segment": "online παιχνίδια ημέρες και νύχτες."
            },
            {
                "id": "T20",
                "type": "Premise",
                "starts": "1653",
                "ends": "1698",
                "segment": "Στο τέλος, αυτός ο μαθητής θα γίνει χαμένος στον κόσμο."
            },
            {
                "id": "T21",
                "type": "Premise",
                "starts": "1700",
                "ends": "1780",
                "segment": "Και όλα αυτά οφείλονται στο ότι το πανεπιστήμιο δεν τους επιτρέπει να παρακολουθήσουν το μάθημα."
            },
            {
                "id": "T22",
                "type": "Premise",
                "starts": "1782",
                "ends": "1860",
                "segment": "Αυτό δεν είναι η αποτυχία του πανεπιστημίου αλλά και ολόκληρου του εκπαιδευτικού συστήματος."
            }
        ],
        "Relations": [
            {
                "id": "R1",
                "type": "supports",
                "arg1": "T5",
                "arg2": "T4"
            },
            {
                "id": "R2",
                "type": "supports",
                "arg1": "T4",
                "arg2": "T6"
            },
            {
                "id": "R3",
                "type": "supports",
                "arg1": "T7",
                "arg2": "T6"
            },
            {
                "id": "R4",
                "type": "supports",
                "arg1": "T8",
                "arg2": "T6"
            },
            {
                "id": "R5",
                "type": "supports",
                "arg1": "T9",
                "arg2": "T6"
            },
            {
                "id": "R6",
                "type": "supports",
                "arg1": "T10",
                "arg2": "T6"
            },
            {
                "id": "R7",
                "type": "supports",
                "arg1": "T11",
                "arg2": "T6"
            },
            {
                "id": "R8",
                "type": "supports",
                "arg1": "T12",
                "arg2": "T6"
            },
            {
                "id": "R9",
                "type": "attacks",
                "arg1": "T14",
                "arg2": "T13"
            },
            {
                "id": "R10",
                "type": "supports",
                "arg1": "T17",
                "arg2": "T15"
            },
            {
                "id": "R11",
                "type": "supports",
                "arg1": "T16",
                "arg2": "T15"
            },
            {
                "id": "R12",
                "type": "supports",
                "arg1": "T19",
                "arg2": "T15"
            },
            {
                "id": "R13",
                "type": "supports",
                "arg1": "T20",
                "arg2": "T15"
            },
            {
                "id": "R14",
                "type": "supports",
                "arg1": "T18",
                "arg2": "T15"
            },
            {
                "id": "R15",
                "type": "supports",
                "arg1": "T21",
                "arg2": "T15"
            },
            {
                "id": "R16",
                "type": "supports",
                "arg1": "T22",
                "arg2": "T15"
            }
        ]
    },
    "content": "Δεν είναι απαραίτητο οι φοιτητές να παρακολουθούν μαθήματα Αν και την τελευταία δεκαετία, το φορτίο των φοιτητών αυξάνεται συνεχώς. Υπάρχουν εκείνοι που θεωρούν ότι οι φοιτητές πανεπιστημίου δεν μπορούν να παρακολουθήσουν μαθήματα έως ότου οι φοιτητές περάσουν τις εξετάσεις. Υπάρχουν εκείνοι που δήλωσαν ότι ο φοιτητής μπορεί να παρακολουθήσει το πανεπιστήμιο χοντρό χωρίς να περάσει τις εξετάσεις. Ωστόσο, από την άποψή μου, οι φοιτητές μπορούν να αποκτήσουν πανεπιστημιακές γνώσεις χωρίς την προϋπόθεση της επιτυχίας των εξετάσεων. Οι λόγοι που πρέπει να επεξηγηθούν είναι οι ακόλουθοι. Πρώτον, οι μαθητές δεν είναι συνεχώς ειδικοί σε κάθε μέρος ενός θέματος. Για παράδειγμα, μου αρέσει η Φυσική. Αλλά δεν μου αρέσουν τα ηλεκτρονικά, γιατί τα ηλεκτρονικά δεν είναι πάντα ορατά στον πραγματικό κόσμο. Και είχα 0 στη βαθμολογία της φυσικής όταν μελετώ τα ηλεκτρονικά. Αλλά πετυχαίνω συνεχώς 100 σκορ όταν μελετώ άλλο μέρος της φυσικής. Και αν δεν μπορώ να παρακολουθήσω τα μαθήματα μέχρι να περάσω τις εξετάσεις ηλεκτρονικών, δεν θα μπορούσα να περάσω ολόκληρο το μέρος της φυσικής και θα αποτύχω ξανά στις εξετάσεις ξανά και ξανά. Ευτυχώς, στο πανεπιστήμιο μας, μπορείτε να παρακολουθήσετε τα μαθήματα ανεξάρτητα από το σκορ που φτάνετε. Και μπορώ να σπουδάσω φυσική χωρίς να μελετήσω τα ηλεκτρονικά μου. Και επιτέλους, πήρα ξανά τα ηλεκτρονικά και πέρασα τις εξετάσεις. Δεύτερον, εάν το πανεπιστήμιο ακολουθήσει την πολιτική ότι κανείς δεν μπορεί να παρακολουθήσει τα μαθήματα χωρίς να περάσει τις εξετάσεις, οι μαθητές είναι πολύ πιθανό να εγκαταλείψουν χωρίς καλλιέργεια. Εάν κάποιος αποτύχει στις περισσότερες εξετάσεις, αυτό σημαίνει ότι αυτός ή αυτή δεν μπορεί να συμμετάσχει στα περισσότερα μαθήματα. Και οι μαθητές δεν θα έχουν καμία σχέση στην πανεπιστημιούπολη. Στη συνέχεια, αυτός ή αυτή θα παίξει online παιχνίδια ημέρες και νύχτες. Το ακαδημαϊκό επίτευγμα θα μειωθεί. Στο τέλος, αυτός ο μαθητής θα γίνει χαμένος στον κόσμο. Και όλα αυτά οφείλονται στο ότι το πανεπιστήμιο δεν τους επιτρέπει να παρακολουθήσουν το μάθημα. Αυτό δεν είναι η αποτυχία του πανεπιστημίου αλλά και ολόκληρου του εκπαιδευτικού συστήματος. Βεβαίως, ο φοιτητής του πανεπιστημίου μπορεί να μην φτάσει στο υψηλό εάν το πανεπιστήμιο επιτρέψει στο μαθητή να συμμετάσχει στην τάξη, ανεξάρτητα από το αν περάσει το τεστ ή όχι. Αλλά το όφελος της ελεύθερης πρόσβασης στα μαθήματα έκλεισε το ζήτημα των χαμηλότερων σημείων. Συνολικά, το πανεπιστήμιο θα πρέπει να επιτρέψει στον μαθητή να συμμετάσχει στην τάξη χωρίς να περάσει το τεστ, διότι όχι μόνο κάθε μαθητής είναι ειδικός σε κάθε μέρος ενός μαθήματος, αλλά και θα μειώσει τον μαθητή στην πανεπιστημιούπολη που αφήνει ακαλλιέργητους."
}