{
    "id": "f3eeb548f1769470e0ea68e59d08d361",
    "link": "",
    "description": "",
    "date": "",
    "tags": [],
    "publishedAt": "",
    "crawledAt": "",
    "domain": "",
    "netloc": "",
    "content": "Επίδραση της αγγλικής γλώσσας - τα πλεονεκτήματα υπερτερούν των μειονεκτημάτων Στην παρούσα εποχή, είναι γεγονός ότι οι αυξανόμενες μειονοτικές γλώσσες έχουν μειωθεί από τον κόσμο λόγω του πολλαπλασιασμού των αγγλικών. Μερικοί άνθρωποι ισχυρίζονται ότι είναι μια λογική απώλεια στην παγκοσμιοποίηση, ενώ άλλοι υποστηρίζουν ότι τα μειονεκτήματα υπερβαίνουν τα πλεονεκτήματα. Προσωπικά, συμφωνώ με την προηγούμενη γνώμη. Κανείς δεν μπορεί να αρνηθεί τα τεράστια οφέλη της τάσης ότι τα Αγγλικά γίνονται αποδεκτά παγκοσμίως. Κατ &#39;αρχάς, η επικοινωνία μεταξύ χωρών και πολιτισμών γίνεται βολική. Στη χώρα μου, τα Αγγλικά είναι ένα υποχρεωτικό μάθημα από το δημοτικό σχολείο. Έτσι, οι σπουδές στο εξωτερικό είναι εύκολη και γίνεται καυτή στους νέους. Για αυτούς, το γλωσσικό εμπόδιο δεν είναι πλέον πρόβλημα, το οποίο οδηγεί σε αμοιβαία κατανόηση και εμπιστοσύνη μεταξύ της μητρικής τους γης και της χώρας υποδοχής. Αυτό, με τη σειρά του, ενισχύει τη σχέση και προωθεί τις διεθνείς επιχειρήσεις. Επιπλέον, οι ερευνητές, ειδικά εκείνοι που εργάζονται στην υψηλή τεχνολογία, θα έχουν ευρύτερο φάσμα αναφορών εάν είναι καλοί στα αγγλικά. Λαμβάνοντας ως παράδειγμα τη βιομηχανία πληροφορικής, η κορυφαία τεχνική επιστήμη δημοσιεύεται στα Αγγλικά. Δεν είναι ούτε να πάρετε μια μεταφρασμένη έκδοση αυτών των άρθρων, ούτε να έχετε πάντα μεταφραστή. Ως αποτέλεσμα, δεν έχουν άλλη επιλογή από το να επιλέξουν τα Αγγλικά ως δεύτερη γλώσσα. Βεβαίως, οι αντίπαλοι μπορεί να κατηγορήσουν ότι τα αγγλικά εξαφανίζουν λιγότερο γνωστές γλώσσες κάθε χρόνο. Ως εκ τούτου, η πολιτιστική κληρονομιά και η ταυτότητα του έθνους εξαφανίζονται. Ωστόσο, αυτό είναι πραγματικά κοντόφθαλμο, αγνοώντας την ταχεία ανάπτυξη της φυσικής οικονομίας και της κοινωνίας. Συμπερασματικά, παρά ορισμένες αρνητικές επιπτώσεις, είμαι απόλυτα πεπεισμένος ότι η επικρατούσα χρήση των αγγλικών φέρνει οφέλη σε ανθρώπους και χώρες σε όλο τον κόσμο. Προτείνω σε όλους τους νέους να μάθουν αγγλικά λόγω του βασικού ρόλου της στην παγκοσμιοποίηση. Ταυτόχρονα, μπορούν να γίνουν ενέργειες, όπως η ηχογράφηση, για την προστασία των μητρικών γλωσσών και πολιτισμών.",
    "annotations": {
        "ADUs": [
            {
                "id": "T1",
                "type": "MajorClaim",
                "starts": "226",
                "ends": "265",
                "segment": "μια λογική απώλεια στην παγκοσμιοποίηση, ενώ άλλοι υποστηρίζουν ότι τα μειονεκτήματα υπερβαίνουν τα πλεονεκτήματα."
            },
            {
                "id": "T2",
                "type": "MajorClaim",
                "starts": "1583",
                "ends": "1691",
                "segment": "Συμπερασματικά, παρά ορισμένες αρνητικές επιπτώσεις, είμαι απόλυτα πεπεισμένος ότι η επικρατούσα χρήση των αγγλικών φέρνει οφέλη σε ανθρώπους και χώρες σε όλο τον κόσμο."
            },
            {
                "id": "T3",
                "type": "Claim",
                "starts": "362",
                "ends": "451",
                "segment": "Κανείς δεν μπορεί να αρνηθεί τα τεράστια οφέλη της τάσης ότι τα Αγγλικά γίνονται αποδεκτά παγκοσμίως.",
                "stance": [
                    {
                        "id": "A1",
                        "type": "For"
                    }
                ]
            },
            {
                "id": "T4",
                "type": "Premise",
                "starts": "468",
                "ends": "530",
                "segment": "επικοινωνία μεταξύ χωρών και πολιτισμών γίνεται βολική."
            },
            {
                "id": "T5",
                "type": "Premise",
                "starts": "532",
                "ends": "598",
                "segment": "Στη χώρα μου, τα Αγγλικά είναι ένα υποχρεωτικό μάθημα από το δημοτικό σχολείο."
            },
            {
                "id": "T6",
                "type": "Premise",
                "starts": "606",
                "ends": "662",
                "segment": "Έτσι, οι σπουδές στο εξωτερικό είναι εύκολη και γίνεται καυτή στους νέους."
            },
            {
                "id": "T7",
                "type": "Premise",
                "starts": "674",
                "ends": "810",
                "segment": "Για αυτούς, το γλωσσικό εμπόδιο δεν είναι πλέον πρόβλημα, το οποίο οδηγεί σε αμοιβαία κατανόηση και εμπιστοσύνη μεταξύ της μητρικής τους γης και της χώρας υποδοχής."
            },
            {
                "id": "T8",
                "type": "Premise",
                "starts": "827",
                "ends": "884",
                "segment": "Αυτό, με τη σειρά του, ενισχύει τη σχέση και προωθεί τις διεθνείς επιχειρήσεις."
            },
            {
                "id": "T9",
                "type": "Premise",
                "starts": "899",
                "ends": "1016",
                "segment": "Επιπλέον, οι ερευνητές, ειδικά εκείνοι που εργάζονται στην υψηλή τεχνολογία, θα έχουν ευρύτερο φάσμα αναφορών εάν είναι καλοί στα αγγλικά."
            },
            {
                "id": "T10",
                "type": "Premise",
                "starts": "1018",
                "ends": "1098",
                "segment": "Λαμβάνοντας ως παράδειγμα τη βιομηχανία πληροφορικής, η κορυφαία τεχνική επιστήμη δημοσιεύεται στα Αγγλικά."
            },
            {
                "id": "T11",
                "type": "Premise",
                "starts": "1100",
                "ends": "1199",
                "segment": "Δεν είναι ούτε να πάρετε μια μεταφρασμένη έκδοση αυτών των άρθρων, ούτε να έχετε πάντα μεταφραστή."
            },
            {
                "id": "T12",
                "type": "Premise",
                "starts": "1214",
                "ends": "1275",
                "segment": "Ως αποτέλεσμα, δεν έχουν άλλη επιλογή από το να επιλέξουν τα Αγγλικά ως δεύτερη γλώσσα."
            },
            {
                "id": "T13",
                "type": "Claim",
                "starts": "1383",
                "ends": "1430",
                "segment": "μπορεί να κατηγορήσουν ότι τα αγγλικά εξαφανίζουν λιγότερο γνωστές γλώσσες κάθε χρόνο.",
                "stance": [
                    {
                        "id": "A2",
                        "type": "Against"
                    }
                ]
            },
            {
                "id": "T14",
                "type": "Premise",
                "starts": "1314",
                "ends": "1374",
                "segment": "Βεβαίως, οι αντίπαλοι μπορεί να κατηγορήσουν ότι τα αγγλικά εξαφανίζουν λιγότερο γνωστές γλώσσες κάθε χρόνο."
            },
            {
                "id": "T15",
                "type": "Premise",
                "starts": "1441",
                "ends": "1531",
                "segment": "Ως εκ τούτου, η πολιτιστική κληρονομιά και η ταυτότητα του έθνους εξαφανίζονται."
            }
        ],
        "Relations": [
            {
                "id": "R1",
                "type": "supports",
                "arg1": "T5",
                "arg2": "T6"
            },
            {
                "id": "R2",
                "type": "supports",
                "arg1": "T7",
                "arg2": "T8"
            },
            {
                "id": "R3",
                "type": "supports",
                "arg1": "T8",
                "arg2": "T4"
            },
            {
                "id": "R4",
                "type": "supports",
                "arg1": "T6",
                "arg2": "T4"
            },
            {
                "id": "R5",
                "type": "supports",
                "arg1": "T4",
                "arg2": "T3"
            },
            {
                "id": "R6",
                "type": "supports",
                "arg1": "T11",
                "arg2": "T12"
            },
            {
                "id": "R7",
                "type": "supports",
                "arg1": "T10",
                "arg2": "T9"
            },
            {
                "id": "R8",
                "type": "supports",
                "arg1": "T12",
                "arg2": "T9"
            },
            {
                "id": "R9",
                "type": "supports",
                "arg1": "T9",
                "arg2": "T3"
            },
            {
                "id": "R10",
                "type": "supports",
                "arg1": "T14",
                "arg2": "T13"
            },
            {
                "id": "R11",
                "type": "attacks",
                "arg1": "T15",
                "arg2": "T13"
            }
        ]
    }
}