{
    "id": "b9fca0fb4e06abe6193bd82ed0db76a6",
    "link": "",
    "description": "",
    "date": "",
    "tags": [],
    "publishedAt": "",
    "crawledAt": "",
    "domain": "",
    "netloc": "",
    "annotations": {
        "ADUs": [
            {
                "id": "T1",
                "type": "MajorClaim",
                "starts": "211",
                "ends": "308",
                "segment": "Κατά την άποψή μου, η παραμονή με τους γονείς για μεγαλύτερο χρονικό διάστημα έχει περισσότερα οφέλη από τα μειονεκτήματα για τον νεαρό ενήλικα."
            },
            {
                "id": "T2",
                "type": "MajorClaim",
                "starts": "1924",
                "ends": "1970",
                "segment": "δεν τον βοηθήσουν αμέσως, θα έπρεπε να υποφέρει περισσότερο πόνο."
            },
            {
                "id": "T3",
                "type": "Claim",
                "starts": "1818",
                "ends": "1915",
                "segment": "μπορούν να δώσουν τις κατάλληλες συμβουλές και να τον οδηγήσουν στον σωστό δρόμο.",
                "stance": [
                    {
                        "id": "A1",
                        "type": "For"
                    }
                ]
            },
            {
                "id": "T4",
                "type": "Premise",
                "starts": "469",
                "ends": "526",
                "segment": "Πρώτα απ &#39;όλα, ένα από τα πιο σημαντικά μειονεκτήματα είναι ότι ο νεαρός ενήλικας μπορεί να έχει περισσότερη εμπειρία με τους γονείς του."
            },
            {
                "id": "T5",
                "type": "Claim",
                "starts": "879",
                "ends": "916",
                "segment": "και να ταξιδέψουν μαζί.",
                "stance": [
                    {
                        "id": "A3",
                        "type": "For"
                    }
                ]
            },
            {
                "id": "T6",
                "type": "Premise",
                "starts": "528",
                "ends": "611",
                "segment": "σημαντικά μειονεκτήματα είναι ότι ο νεαρός ενήλικας μπορεί να έχει περισσότερη εμπειρία με τους γονείς του."
            },
            {
                "id": "T7",
                "type": "Premise",
                "starts": "613",
                "ends": "682",
                "segment": "ενήλικας πρέπει να προσπαθήσει να δημιουργήσει αναμνήσεις με τον μπαμπά και τη μαμά του σε νεαρή ηλικία."
            },
            {
                "id": "T8",
                "type": "Premise",
                "starts": "684",
                "ends": "805",
                "segment": "Όταν έχει δουλειά, έχει χαμηλές δυνατότητες να εργαστεί στην πατρίδα του."
            },
            {
                "id": "T9",
                "type": "Premise",
                "starts": "807",
                "ends": "863",
                "segment": "μεγαλύτερο χρονικό διάστημα, έχουν περισσότερες πιθανότητες να μοιραστούν τα συναισθήματα, να ασκήσουν και να ταξιδέψουν μαζί."
            },
            {
                "id": "T10",
                "type": "Premise",
                "starts": "1064",
                "ends": "1140",
                "segment": "Η εκμάθηση να είναι ανεξάρτητη σημαίνει ότι ο νεαρός ενήλικας πρέπει να φύγει από το σπίτι."
            },
            {
                "id": "T11",
                "type": "Premise",
                "starts": "1152",
                "ends": "1208",
                "segment": "ότι ο νεαρός ενήλικας πρέπει να φύγει από το σπίτι."
            },
            {
                "id": "T12",
                "type": "Premise",
                "starts": "1210",
                "ends": "1292",
                "segment": "Επομένως, μπορεί να χρειαστεί να νοικιάσει ένα σπίτι και το ενοίκιο θα ήταν ένα βάρος για τους γονείς."
            },
            {
                "id": "T13",
                "type": "Claim",
                "starts": "1305",
                "ends": "1372",
                "segment": "Επιπλέον, ένα άλλο ημερήσιο κόστος είναι επίσης τα σημαντικά έξοδα.",
                "stance": [
                    {
                        "id": "A4",
                        "type": "For"
                    }
                ]
            },
            {
                "id": "T14",
                "type": "Premise",
                "starts": "931",
                "ends": "976",
                "segment": "οι αναμνήσεις γίνονται πολύτιμοι θησαυροί καθώς περνά ο καιρός."
            },
            {
                "id": "T15",
                "type": "Premise",
                "starts": "978",
                "ends": "1051",
                "segment": "Έτσι, νομίζω ότι αξίζει τον κόπο να περνάς με τους γονείς."
            },
            {
                "id": "T16",
                "type": "Premise",
                "starts": "1410",
                "ends": "1463",
                "segment": "να μην οδηγήσει σε αυτό που οι γονείς περιμένουν να είναι τα παιδιά τους."
            },
            {
                "id": "T17",
                "type": "Premise",
                "starts": "1465",
                "ends": "1533",
                "segment": "Με λίγα λόγια, οι γονείς μπορούν να εξοικονομήσουν χρήματα, εάν τα παιδιά τους ζουν μαζί τους περισσότερο."
            },
            {
                "id": "T18",
                "type": "Premise",
                "starts": "1535",
                "ends": "1642",
                "segment": "Ο τρίτος πειστικός λόγος είναι ότι ο νεαρός ενήλικας χρειάζεται τις προτάσεις του πατέρα και της μητέρας."
            },
            {
                "id": "T19",
                "type": "Premise",
                "starts": "1644",
                "ends": "1721",
                "segment": "Όταν βρίσκονται σε δίλημμα, οι γονείς μπορούν να τον παρηγορήσουν και να του δώσουν ένα μεγάλο χέρι."
            },
            {
                "id": "T20",
                "type": "Claim",
                "starts": "1730",
                "ends": "1805",
                "segment": "Είναι οι άνθρωποι που είναι πιο εξοικειωμένοι με αυτόν μπορούν να δώσουν τις κατάλληλες συμβουλές και να τον οδηγήσουν στον σωστό δρόμο.",
                "stance": [
                    {
                        "id": "A2",
                        "type": "For"
                    }
                ]
            }
        ],
        "Relations": [
            {
                "id": "R1",
                "type": "supports",
                "arg1": "T9",
                "arg2": "T5"
            },
            {
                "id": "R2",
                "type": "supports",
                "arg1": "T8",
                "arg2": "T5"
            },
            {
                "id": "R3",
                "type": "supports",
                "arg1": "T7",
                "arg2": "T5"
            },
            {
                "id": "R4",
                "type": "supports",
                "arg1": "T6",
                "arg2": "T5"
            },
            {
                "id": "R5",
                "type": "supports",
                "arg1": "T4",
                "arg2": "T5"
            },
            {
                "id": "R6",
                "type": "supports",
                "arg1": "T15",
                "arg2": "T10"
            },
            {
                "id": "R7",
                "type": "supports",
                "arg1": "T14",
                "arg2": "T13"
            },
            {
                "id": "R8",
                "type": "supports",
                "arg1": "T10",
                "arg2": "T13"
            },
            {
                "id": "R9",
                "type": "supports",
                "arg1": "T11",
                "arg2": "T13"
            },
            {
                "id": "R10",
                "type": "supports",
                "arg1": "T12",
                "arg2": "T13"
            },
            {
                "id": "R11",
                "type": "supports",
                "arg1": "T19",
                "arg2": "T20"
            },
            {
                "id": "R12",
                "type": "supports",
                "arg1": "T18",
                "arg2": "T20"
            },
            {
                "id": "R13",
                "type": "supports",
                "arg1": "T17",
                "arg2": "T20"
            },
            {
                "id": "R14",
                "type": "supports",
                "arg1": "T16",
                "arg2": "T20"
            }
        ]
    },
    "content": "Η εκμάθηση να είναι ανεξάρτητη είναι απαραίτητη για τους νεαρούς ενήλικες Η εκμάθηση να είναι ανεξάρτητη είναι απαραίτητη για τους νέους ενήλικες. Ωστόσο, το πόσο νωρίς τα παιδιά αφήνουν τους γονείς τους είναι ένα δύσκολο ζήτημα. Κατά την άποψή μου, η παραμονή με τους γονείς για μεγαλύτερο χρονικό διάστημα έχει περισσότερα οφέλη από τα μειονεκτήματα για τον νεαρό ενήλικα. Η γνώμη μου βασίζεται στη δημιουργία αναμνήσεων με τους γονείς, στην εξοικονόμηση χρημάτων και στη λήψη συμβουλών από τους γονείς. Πρώτα απ &#39;όλα, ένα από τα πιο σημαντικά μειονεκτήματα είναι ότι ο νεαρός ενήλικας μπορεί να έχει περισσότερη εμπειρία με τους γονείς του. Ο νεαρός ενήλικας πρέπει να προσπαθήσει να δημιουργήσει αναμνήσεις με τον μπαμπά και τη μαμά του σε νεαρή ηλικία. Όταν έχει δουλειά, έχει χαμηλές δυνατότητες να εργαστεί στην πατρίδα του. Εάν ζει με τους γονείς του για μεγαλύτερο χρονικό διάστημα, έχουν περισσότερες πιθανότητες να μοιραστούν τα συναισθήματα, να ασκήσουν και να ταξιδέψουν μαζί. Όλες οι αναμνήσεις γίνονται πολύτιμοι θησαυροί καθώς περνά ο καιρός. Έτσι, νομίζω ότι αξίζει τον κόπο να περνάς με τους γονείς. Επιπλέον, το να ζεις στο σπίτι κοστίζει λιγότερο από το να ζεις έξω. Η εκμάθηση να είναι ανεξάρτητη σημαίνει ότι ο νεαρός ενήλικας πρέπει να φύγει από το σπίτι. Επομένως, μπορεί να χρειαστεί να νοικιάσει ένα σπίτι και το ενοίκιο θα ήταν ένα βάρος για τους γονείς. Επιπλέον, ένα άλλο ημερήσιο κόστος είναι επίσης τα σημαντικά έξοδα. Η δαπάνη πολλών χρημάτων μπορεί να μην οδηγήσει σε αυτό που οι γονείς περιμένουν να είναι τα παιδιά τους. Με λίγα λόγια, οι γονείς μπορούν να εξοικονομήσουν χρήματα, εάν τα παιδιά τους ζουν μαζί τους περισσότερο. Ο τρίτος πειστικός λόγος είναι ότι ο νεαρός ενήλικας χρειάζεται τις προτάσεις του πατέρα και της μητέρας. Όταν βρίσκονται σε δίλημμα, οι γονείς μπορούν να τον παρηγορήσουν και να του δώσουν ένα μεγάλο χέρι. Είναι οι άνθρωποι που είναι πιο εξοικειωμένοι με αυτόν μπορούν να δώσουν τις κατάλληλες συμβουλές και να τον οδηγήσουν στον σωστό δρόμο. Εάν οι γονείς δεν τον βοηθήσουν αμέσως, θα έπρεπε να υποφέρει περισσότερο πόνο. Ως εκ τούτου, λαμβάνοντας συμβουλές από τους γονείς, ο νεαρός ενήλικας μπορεί να περάσει εύκολα από εμπόδια. Συνοψίζοντας, η διαβίωση με τους γονείς φέρνει πλέον αναμνήσεις με τους γονείς, λιγότερο κόστος και συμβουλές από τους γονείς. Ως εκ τούτου, η παραμονή μεγαλύτερης διάρκειας με τους γονείς είναι καλύτερη επιλογή."
}