{
    "id": "4904a5e406e4b7d541c96b02a0e29e5e",
    "link": "",
    "description": "",
    "date": "",
    "tags": [],
    "publishedAt": "",
    "crawledAt": "",
    "domain": "",
    "netloc": "",
    "annotations": {
        "ADUs": [
            {
                "id": "T1",
                "type": "Claim",
                "starts": "364",
                "ends": "405",
                "segment": "της καινοτομίας ήταν θετική ή αρνητική.",
                "stance": [
                    {
                        "id": "A1",
                        "type": "Against"
                    }
                ]
            },
            {
                "id": "T2",
                "type": "MajorClaim",
                "starts": "428",
                "ends": "550",
                "segment": "το αντίθετο, πιστεύω ότι η πλειονότητα των ανθρώπων στον κόσμο έχουν επωφεληθεί πολύ από αυτά τα ισχυρά και αποτελεσματικά μέσα της σύγχρονης επικοινωνίας."
            },
            {
                "id": "T3",
                "type": "MajorClaim",
                "starts": "1794",
                "ends": "1896",
                "segment": "Ωστόσο, οι έχοντες δεν μπορούν να αγνοηθούν απλώς και μόνο επειδή δεν μπορούσαν να το αντέξουν οικονομικά."
            },
            {
                "id": "T4",
                "type": "Claim",
                "starts": "1132",
                "ends": "1214",
                "segment": "φαίνεται ότι αυτές οι νέες μορφές επικοινωνίας προσφέρουν μεγάλη άνεση στην ανθρωπότητα.",
                "stance": [
                    {
                        "id": "A2",
                        "type": "For"
                    }
                ]
            },
            {
                "id": "T5",
                "type": "Premise",
                "starts": "567",
                "ends": "718",
                "segment": "Κατ &#39;αρχάς, τα κινητά τηλέφωνα και άλλα εργαλεία σύγχρονης επικοινωνίας διευκολύνουν όχι μόνο την επαφή με φίλους και συγγενείς σε μακρινά μέρη αλλά και με τις παγκόσμιες επιχειρήσεις."
            },
            {
                "id": "T6",
                "type": "Premise",
                "starts": "720",
                "ends": "841",
                "segment": "Με το πάτημα ενός κουμπιού, η τεράστια ποσότητα πληροφοριών μπορεί να μεταδοθεί από την Αμερική στην Κίνα σε λίγα δευτερόλεπτα."
            },
            {
                "id": "T7",
                "type": "Premise",
                "starts": "856",
                "ends": "966",
                "segment": "Επιπλέον, θεωρείται γενικά ότι η πρόσβαση σε αυτά τα εργαλεία επικοινωνίας είναι διαθέσιμη σε κάθε γωνιά του κόσμου."
            },
            {
                "id": "T8",
                "type": "Premise",
                "starts": "968",
                "ends": "1105",
                "segment": "Με ένα κινητό τηλέφωνο ή φορητό υπολογιστή, ένα άτομο μπορεί να μιλήσει ή να στείλει μηνύματα στο διαδίκτυο σε στάση λεωφορείου, σε γωνιακό κατάστημα ή οπουδήποτε θα μπορούσε να φανταστεί."
            },
            {
                "id": "T9",
                "type": "Claim",
                "starts": "1658",
                "ends": "1755",
                "segment": "Εν κατακλείδι, πιστεύω ότι οι σύγχρονες τεχνολογίες επικοινωνίας θα ωφελήσουν περισσότερους ανθρώπους στο μέλλον καθώς αυξάνεται ο ρυθμός της ζωής.",
                "stance": [
                    {
                        "id": "A3",
                        "type": "Against"
                    }
                ]
            },
            {
                "id": "T10",
                "type": "Premise",
                "starts": "1281",
                "ends": "1331",
                "segment": "οι πιο προνομιούχοι μπορούν να απολαύσουν τα οφέλη."
            },
            {
                "id": "T11",
                "type": "Premise",
                "starts": "1361",
                "ends": "1472",
                "segment": "Όποιος σκοπεύει να χρησιμοποιήσει αυτές τις καινοτομίες πρέπει όχι μόνο να πληρώσει για συσκευές όπως κινητό τηλέφωνο ή υπολογιστή, αλλά και να καλύψει το κόστος για υπηρεσίες επικοινωνίας."
            },
            {
                "id": "T12",
                "type": "Premise",
                "starts": "1474",
                "ends": "1642",
                "segment": "Κατά συνέπεια, οι άνθρωποι που ζουν σε συνθήκες φτώχειας είναι λιγότερο πιθανό να επωφεληθούν από τις σύγχρονες τεχνολογίες επικοινωνίας."
            }
        ],
        "Relations": [
            {
                "id": "R1",
                "type": "supports",
                "arg1": "T8",
                "arg2": "T4"
            },
            {
                "id": "R2",
                "type": "supports",
                "arg1": "T7",
                "arg2": "T4"
            },
            {
                "id": "R3",
                "type": "supports",
                "arg1": "T6",
                "arg2": "T4"
            },
            {
                "id": "R4",
                "type": "supports",
                "arg1": "T5",
                "arg2": "T4"
            },
            {
                "id": "R5",
                "type": "supports",
                "arg1": "T10",
                "arg2": "T9"
            },
            {
                "id": "R6",
                "type": "supports",
                "arg1": "T11",
                "arg2": "T9"
            },
            {
                "id": "R7",
                "type": "supports",
                "arg1": "T12",
                "arg2": "T9"
            }
        ]
    },
    "content": "Μήπως οι σύγχρονες τεχνολογίες επικοινωνίας ωφελούν όλους τους ανθρώπους Οι σύγχρονες τεχνολογίες επικοινωνίας όπως τα κινητά τηλέφωνα, τα ηλεκτρονικά ταχυδρομεία και τα προγράμματα συνομιλίας μέσω διαδικτύου όπως το MSN Messenger έχουν φέρει σημαντικές αλλαγές στη ζωή μας τα τελευταία χρόνια. Ωστόσο, παραμένει κάποια διαφωνία ως προς το αν η συνολική επίδραση αυτής της καινοτομίας ήταν θετική ή αρνητική. Αν και υπάρχουν βάσιμα επιχειρήματα για το αντίθετο, πιστεύω ότι η πλειονότητα των ανθρώπων στον κόσμο έχουν επωφεληθεί πολύ από αυτά τα ισχυρά και αποτελεσματικά μέσα της σύγχρονης επικοινωνίας. Κατ &#39;αρχάς, τα κινητά τηλέφωνα και άλλα εργαλεία σύγχρονης επικοινωνίας διευκολύνουν όχι μόνο την επαφή με φίλους και συγγενείς σε μακρινά μέρη αλλά και με τις παγκόσμιες επιχειρήσεις. Με το πάτημα ενός κουμπιού, η τεράστια ποσότητα πληροφοριών μπορεί να μεταδοθεί από την Αμερική στην Κίνα σε λίγα δευτερόλεπτα. Επιπλέον, θεωρείται γενικά ότι η πρόσβαση σε αυτά τα εργαλεία επικοινωνίας είναι διαθέσιμη σε κάθε γωνιά του κόσμου. Με ένα κινητό τηλέφωνο ή φορητό υπολογιστή, ένα άτομο μπορεί να μιλήσει ή να στείλει μηνύματα στο διαδίκτυο σε στάση λεωφορείου, σε γωνιακό κατάστημα ή οπουδήποτε θα μπορούσε να φανταστεί. Επομένως, φαίνεται ότι αυτές οι νέες μορφές επικοινωνίας προσφέρουν μεγάλη άνεση στην ανθρωπότητα. Ωστόσο, οι αντίπαλοι των σύγχρονων επικοινωνιών ισχυρίζονται ότι μόνο οι πιο προνομιούχοι μπορούν να απολαύσουν τα οφέλη. Επισημαίνουν επίσης ότι η ευρεία χρήση αυτών των αποτελεσματικών και αποτελεσματικών τρόπων επικοινωνίας κοστίζει ένα σημαντικό χρηματικό ποσό. Όποιος σκοπεύει να χρησιμοποιήσει αυτές τις καινοτομίες πρέπει όχι μόνο να πληρώσει για συσκευές όπως κινητό τηλέφωνο ή υπολογιστή, αλλά και να καλύψει το κόστος για υπηρεσίες επικοινωνίας. Κατά συνέπεια, οι άνθρωποι που ζουν σε συνθήκες φτώχειας είναι λιγότερο πιθανό να επωφεληθούν από τις σύγχρονες τεχνολογίες επικοινωνίας. Εν κατακλείδι, πιστεύω ότι οι σύγχρονες τεχνολογίες επικοινωνίας θα ωφελήσουν περισσότερους ανθρώπους στο μέλλον καθώς αυξάνεται ο ρυθμός της ζωής. Ωστόσο, οι έχοντες δεν μπορούν να αγνοηθούν απλώς και μόνο επειδή δεν μπορούσαν να το αντέξουν οικονομικά."
}