{
    "id": "7f74b9abb07389a9a90b5841b8bd1a53",
    "link": "",
    "description": "",
    "date": "",
    "tags": [],
    "publishedAt": "",
    "crawledAt": "",
    "domain": "",
    "netloc": "",
    "annotations": {
        "ADUs": [
            {
                "id": "T1",
                "type": "MajorClaim",
                "starts": "480",
                "ends": "544",
                "segment": "Κατά τη γνώμη μου, η διαφήμιση δεν είναι η κύρια αιτία ανθυγιεινών διατροφικών συνηθειών."
            },
            {
                "id": "T2",
                "type": "MajorClaim",
                "starts": "2018",
                "ends": "2082",
                "segment": "Σε αυτές τις περιπτώσεις, η διαφημιστική βιομηχανία ενισχύει την ευαισθητοποίηση των ανθρώπων για υγιεινό τρόπο ζωής."
            },
            {
                "id": "T3",
                "type": "Claim",
                "starts": "2196",
                "ends": "2310",
                "segment": "Υπάρχει η ανάπτυξη της έννοιας σχετικά με τις υγιεινές διατροφικές συνήθειες και τον αυτοέλεγχο που έχουν σημασία.",
                "stance": [
                    {
                        "id": "A1",
                        "type": "For"
                    }
                ]
            },
            {
                "id": "T5",
                "type": "Premise",
                "starts": "623",
                "ends": "727",
                "segment": "Το κλειδί για τη διαμόρφωση ενός υγιεινού τρόπου διατροφής έγκειται στην ιδέα των ανθρώπων για υγιεινές δίαιτες και αυτοέλεγχο."
            },
            {
                "id": "T6",
                "type": "Premise",
                "starts": "745",
                "ends": "869",
                "segment": "Είναι σίγουρο ότι η διαφήμιση καθιστά πάντα τα προϊόντα τόσο δελεαστικά, ανεξάρτητα από το αν ενδέχεται να έχουν αρνητικές επιπτώσεις στο ανθρώπινο σώμα."
            },
            {
                "id": "T7",
                "type": "Premise",
                "starts": "880",
                "ends": "937",
                "segment": "ανεξάρτητα από το αν ενδέχεται να έχουν αρνητικές επιπτώσεις στο ανθρώπινο σώμα."
            },
            {
                "id": "T8",
                "type": "Premise",
                "starts": "939",
                "ends": "1039",
                "segment": "Ωστόσο, η διαφήμιση δεν είναι η μόνη πηγή πληροφοριών για τους ανθρώπους."
            },
            {
                "id": "T9",
                "type": "Premise",
                "starts": "1041",
                "ends": "1226",
                "segment": "Όσο οι άνθρωποι είναι ξεκάθαροι για το πώς να διατηρήσουν ένα υγιές σώμα και παρακολουθούν επίμονα τις διατροφικές τους συνήθειες, μπορούν να αποτρέψουν επιτυχώς τον εαυτό τους από αυτούς τους πειρασμούς."
            },
            {
                "id": "T10",
                "type": "Premise",
                "starts": "1228",
                "ends": "1380",
                "segment": "Δεν θα είναι πειστικό εάν οι άνθρωποι απλώς κατηγορούν τον διαφημιστικό τομέα μιας εταιρείας γρήγορου φαγητού που τους έκανε τόσο παχύρρευστους και δεν επανεκτιμήσουν τις δικές τους συμπεριφορές."
            },
            {
                "id": "T11",
                "type": "Claim",
                "starts": "560",
                "ends": "621",
                "segment": "Πρώτα απ &#39;όλα, η διαφήμιση δεν είναι απολύτως καθοριστική για την προσωπική διατροφική συνήθεια.",
                "stance": [
                    {
                        "id": "A3",
                        "type": "For"
                    }
                ]
            },
            {
                "id": "T12",
                "type": "Claim",
                "starts": "1571",
                "ends": "1635",
                "segment": "ορισμένες εταιρείες στοχεύουν πραγματικά σε αυτήν την αυξανόμενη τάση και αρχίζουν να προωθούν υγιεινά τρόφιμα.",
                "stance": [
                    {
                        "id": "A4",
                        "type": "For"
                    }
                ]
            },
            {
                "id": "T13",
                "type": "Premise",
                "starts": "1391",
                "ends": "1553",
                "segment": "Δεύτερον, στην εποχή που οι άνθρωποι συνειδητοποιούν έναν πιο υγιεινό τρόπο ζωής, ορισμένες εταιρείες στοχεύουν πραγματικά σε αυτήν την αυξανόμενη τάση και αρχίζουν να προωθούν υγιεινά τρόφιμα."
            },
            {
                "id": "T14",
                "type": "Premise",
                "starts": "1637",
                "ends": "1809",
                "segment": "Με άλλα λόγια, η διαφήμιση μπορεί ακόμη και να φέρει πιο υγιεινές διατροφικές συνήθειες στους ανθρώπους."
            },
            {
                "id": "T15",
                "type": "Premise",
                "starts": "1811",
                "ends": "1900",
                "segment": "αναπτύσσονται σε περιβάλλον χωρίς φυτοφάρμακα και εκείνα τα ακατέργαστα τρόφιμα στα οποία προστίθεται λιγότερο αλάτι ή λιγότερη ζάχαρη."
            },
            {
                "id": "T16",
                "type": "Premise",
                "starts": "1918",
                "ends": "2000",
                "segment": "είναι τα κύρια χαρακτηριστικά που η διαφήμιση χτυπά και τα συνολικά αποτελέσματα είναι καλά."
            },
            {
                "id": "T4",
                "type": "Claim",
                "starts": "2084",
                "ends": "2185",
                "segment": "Συμπερασματικά, η διαφήμιση δεν είναι ο πρωταρχικός λόγος των ανθυγιεινών διατροφικών συνηθειών.",
                "stance": [
                    {
                        "id": "A2",
                        "type": "For"
                    }
                ]
            }
        ],
        "Relations": [
            {
                "id": "R1",
                "type": "supports",
                "arg1": "T5",
                "arg2": "T11"
            },
            {
                "id": "R2",
                "type": "attacks",
                "arg1": "T6",
                "arg2": "T11"
            },
            {
                "id": "R3",
                "type": "supports",
                "arg1": "T7",
                "arg2": "T6"
            },
            {
                "id": "R4",
                "type": "supports",
                "arg1": "T8",
                "arg2": "T7"
            },
            {
                "id": "R5",
                "type": "supports",
                "arg1": "T9",
                "arg2": "T11"
            },
            {
                "id": "R6",
                "type": "supports",
                "arg1": "T10",
                "arg2": "T11"
            },
            {
                "id": "R7",
                "type": "supports",
                "arg1": "T13",
                "arg2": "T12"
            },
            {
                "id": "R8",
                "type": "supports",
                "arg1": "T14",
                "arg2": "T12"
            },
            {
                "id": "R9",
                "type": "supports",
                "arg1": "T15",
                "arg2": "T12"
            },
            {
                "id": "R10",
                "type": "supports",
                "arg1": "T16",
                "arg2": "T12"
            }
        ]
    },
    "content": "Η διαφήμιση είναι η κύρια αιτία ανθυγιεινών διατροφικών συνηθειών Η διαφήμιση γίνεται μέρος της σύγχρονης κοινωνίας μας. Διεισδύουν στη ζωή των ανθρώπων, επηρεάζοντας τις επιλογές των ανθρώπων σε διαφορετικά πράγματα. Ως εκ τούτου, έρχεται στη συζήτηση εάν η διαφήμιση έχει θετικές επιδράσεις στη ζωή των ανθρώπων. Μερικοί άνθρωποι λένε ότι η διαφήμιση πρέπει να κατηγορηθεί για τις ανθυγιεινές διατροφικές συνήθειες, ενώ άλλοι πιστεύουν ότι εξακολουθούν να υπάρχουν ορισμένοι άλλοι παράγοντες που κατευθύνουν τις κρίσεις των ανθρώπων. Κατά τη γνώμη μου, η διαφήμιση δεν είναι η κύρια αιτία ανθυγιεινών διατροφικών συνηθειών. Πρώτα απ &#39;όλα, η διαφήμιση δεν είναι απολύτως καθοριστική για την προσωπική διατροφική συνήθεια. Το κλειδί για τη διαμόρφωση ενός υγιεινού τρόπου διατροφής έγκειται στην ιδέα των ανθρώπων για υγιεινές δίαιτες και αυτοέλεγχο. Είναι σίγουρο ότι η διαφήμιση καθιστά πάντα τα προϊόντα τόσο δελεαστικά, ανεξάρτητα από το αν ενδέχεται να έχουν αρνητικές επιπτώσεις στο ανθρώπινο σώμα. Ωστόσο, η διαφήμιση δεν είναι η μόνη πηγή πληροφοριών για τους ανθρώπους. Οι άνθρωποι μπορούν ακόμα να αποκτήσουν διαφορετικές απόψεις για τρόφιμα από άλλες πηγές, όπως ειδήσεις ή περιοδικά. Όσο οι άνθρωποι είναι ξεκάθαροι για το πώς να διατηρήσουν ένα υγιές σώμα και παρακολουθούν επίμονα τις διατροφικές τους συνήθειες, μπορούν να αποτρέψουν επιτυχώς τον εαυτό τους από αυτούς τους πειρασμούς. Δεν θα είναι πειστικό εάν οι άνθρωποι απλώς κατηγορούν τον διαφημιστικό τομέα μιας εταιρείας γρήγορου φαγητού που τους έκανε τόσο παχύρρευστους και δεν επανεκτιμήσουν τις δικές τους συμπεριφορές. Δεύτερον, στην εποχή που οι άνθρωποι συνειδητοποιούν έναν πιο υγιεινό τρόπο ζωής, ορισμένες εταιρείες στοχεύουν πραγματικά σε αυτήν την αυξανόμενη τάση και αρχίζουν να προωθούν υγιεινά τρόφιμα. Με άλλα λόγια, η διαφήμιση μπορεί ακόμη και να φέρει πιο υγιεινές διατροφικές συνήθειες στους ανθρώπους. Σκεφτείτε τα πρόσφατα δημοφιλή βιολογικά τρόφιμα που ισχυρίζονται ότι αναπτύσσονται σε περιβάλλον χωρίς φυτοφάρμακα και εκείνα τα ακατέργαστα τρόφιμα στα οποία προστίθεται λιγότερο αλάτι ή λιγότερη ζάχαρη. Αυτά είναι τα κύρια χαρακτηριστικά που η διαφήμιση χτυπά και τα συνολικά αποτελέσματα είναι καλά. Σε αυτές τις περιπτώσεις, η διαφημιστική βιομηχανία ενισχύει την ευαισθητοποίηση των ανθρώπων για υγιεινό τρόπο ζωής. Συμπερασματικά, η διαφήμιση δεν είναι ο πρωταρχικός λόγος των ανθυγιεινών διατροφικών συνηθειών. Υπάρχει η ανάπτυξη της έννοιας σχετικά με τις υγιεινές διατροφικές συνήθειες και τον αυτοέλεγχο που έχουν σημασία. Εκτός αυτού, η διαφήμιση μπορεί να οδηγήσει σε υγιέστερα έθιμα διατροφής λόγω της αυξανόμενης συνειδητοποίησης της ζωής κάτω από έναν καλύτερο τρόπο ζωής. Είναι αναπόφευκτο να εκτίθεται στο περιβάλλον γεμάτο διαφημίσεις, αλλά δεν σημαίνει ότι καταργείται το δικαίωμά μας στην επιλογή. Θα είμαστε πάντα σε θέση να αποφασίσουμε τον δικό μας τρόπο ζωής."
}