{
    "id": "4c098c448a02f995187008fc6f0ca6f7",
    "link": "",
    "description": "",
    "date": "",
    "tags": [],
    "publishedAt": "",
    "crawledAt": "",
    "domain": "",
    "netloc": "",
    "annotations": {
        "ADUs": [
            {
                "id": "T1",
                "type": "MajorClaim",
                "starts": "1591",
                "ends": "1678",
                "segment": "Από τον υποψήφιο μου, ο άνθρωπος πρέπει να συμπεριφέρεται ως φύλακας στα ζώα και όχι ως κύριος ή κύριος του."
            },
            {
                "id": "T2",
                "type": "Claim",
                "starts": "1680",
                "ends": "1735",
                "segment": "στα ζώα και όχι ως κύριος ή κύριος του.",
                "stance": [
                    {
                        "id": "A1",
                        "type": "For"
                    }
                ]
            },
            {
                "id": "T3",
                "type": "Claim",
                "starts": "474",
                "ends": "598",
                "segment": "Το ανθρώπινο ον έχει οδηγήσει πολλά ζώα για προσωπική τους χρήση, όπως αγελάδες και άλλα γαλακτοκομικά ζώα για την παραγωγή γάλακτος από αυτά.",
                "stance": [
                    {
                        "id": "A2",
                        "type": "For"
                    }
                ]
            },
            {
                "id": "T4",
                "type": "Premise",
                "starts": "600",
                "ends": "717",
                "segment": "Παρομοίως, άλλα ζώα όπως, άλογα, αρπακτικά και γαϊδούρια για γεωργία, γεωργία και ως τρόπο μεταφοράς."
            },
            {
                "id": "T5",
                "type": "Premise",
                "starts": "719",
                "ends": "877",
                "segment": "Πολλοί άνθρωποι διατηρούν κατοικίδια ζώα όπως σκύλους και γάτες, τα εκπαίδευσαν ως σκύλοι εξυπηρέτησης και σκύλους που τα βοηθούν στην αστυνομία και ακόμη και σε μερικούς τυφλούς."
            },
            {
                "id": "T6",
                "type": "Premise",
                "starts": "879",
                "ends": "924",
                "segment": "Φυλάσσονται για λόγους ασφαλείας σε σπίτια."
            },
            {
                "id": "T7",
                "type": "Claim",
                "starts": "945",
                "ends": "1004",
                "segment": "Από την άλλη πλευρά, πολλοί αγρότες και ιδιοκτήτες εκμεταλλεύονται ζώα πέρα από τα όριά τους.",
                "stance": [
                    {
                        "id": "A3",
                        "type": "For"
                    }
                ]
            },
            {
                "id": "T8",
                "type": "Premise",
                "starts": "1020",
                "ends": "1111",
                "segment": "Για παράδειγμα, οι αγελάδες συχνά εγχέονται από την Oxytocin, μια ορμόνη που χρησιμοποιείται για την αύξηση της γαλουχίας."
            },
            {
                "id": "T9",
                "type": "Premise",
                "starts": "1113",
                "ends": "1175",
                "segment": "Αυτό με τη σειρά του, προκαλεί μεγάλη ταλαιπωρία και πόνο στα βοοειδή."
            },
            {
                "id": "T10",
                "type": "Claim",
                "starts": "1190",
                "ends": "1309",
                "segment": "Επιπλέον, χιλιάδες ζώα υφίστανται οδυνηρό πόνο ή θάνατο ως αποτέλεσμα της επιστημονικής έρευνας φαρμάκων και διαφόρων προϊόντων.",
                "stance": [
                    {
                        "id": "A4",
                        "type": "For"
                    }
                ]
            },
            {
                "id": "T11",
                "type": "Premise",
                "starts": "1311",
                "ends": "1381",
                "segment": "Ένα άλλο παράδειγμα αυτού είναι η κλουβιά που αντιβαίνει στα δικαιώματα των ζώων."
            },
            {
                "id": "T12",
                "type": "Premise",
                "starts": "1383",
                "ends": "1513",
                "segment": "Πολλές άλλες πρακτικές όπως, ιππικό άθλημα όπου τα άλογα τρέχουν μίλια και μίλια και ξυλοκοπούνται από αναβάτες για να τους κάνουν να τρέχουν πιο γρήγορα."
            },
            {
                "id": "T13",
                "type": "Premise",
                "starts": "1515",
                "ends": "1568",
                "segment": "να τους κάνουν να τρέχουν πιο γρήγορα."
            }
        ],
        "Relations": [
            {
                "id": "R1",
                "type": "supports",
                "arg1": "T4",
                "arg2": "T3"
            },
            {
                "id": "R2",
                "type": "supports",
                "arg1": "T5",
                "arg2": "T3"
            },
            {
                "id": "R3",
                "type": "supports",
                "arg1": "T6",
                "arg2": "T3"
            },
            {
                "id": "R7",
                "type": "supports",
                "arg1": "T8",
                "arg2": "T7"
            },
            {
                "id": "R8",
                "type": "supports",
                "arg1": "T9",
                "arg2": "T7"
            },
            {
                "id": "R4",
                "type": "supports",
                "arg1": "T11",
                "arg2": "T7"
            },
            {
                "id": "R5",
                "type": "supports",
                "arg1": "T12",
                "arg2": "T7"
            },
            {
                "id": "R6",
                "type": "supports",
                "arg1": "T13",
                "arg2": "T7"
            }
        ]
    },
    "content": "Οι άνθρωποι πρέπει να μπορούν να χρησιμοποιούν ζώα για το δικό τους όφελος; Ο άνθρωπος κυριάρχησε σε όλα τα όντα του στη γη λόγω του ανώτερου εγκεφάλου του. Έχει εξημερώσει μεγάλο αριθμό ζώων και πουλιών και τα χρησιμοποιεί για να κάνει τη ζωή ευκολότερη και βολική για τον εαυτό του. Πολλοί άνθρωποι ενθαρρύνουν τη χρήση ζώων για τις προσωπικές τους ανάγκες, ενώ άλλοι ανησυχούν ότι τα ζώα δεν πρέπει να κάνουν κακή χρήση. Αυτή η έκθεση θα συζητήσει ορισμένα επιχειρήματα υπέρ και κατά της εξημέρωσης των ζώων. Το ανθρώπινο ον έχει οδηγήσει πολλά ζώα για προσωπική τους χρήση, όπως αγελάδες και άλλα γαλακτοκομικά ζώα για την παραγωγή γάλακτος από αυτά. Παρομοίως, άλλα ζώα όπως, άλογα, αρπακτικά και γαϊδούρια για γεωργία, γεωργία και ως τρόπο μεταφοράς. Πολλοί άνθρωποι διατηρούν κατοικίδια ζώα όπως σκύλους και γάτες, τα εκπαίδευσαν ως σκύλοι εξυπηρέτησης και σκύλους που τα βοηθούν στην αστυνομία και ακόμη και σε μερικούς τυφλούς. Φυλάσσονται για λόγους ασφαλείας σε σπίτια. Από την άλλη πλευρά, πολλοί αγρότες και ιδιοκτήτες εκμεταλλεύονται ζώα πέρα από τα όριά τους. Για παράδειγμα, οι αγελάδες συχνά εγχέονται από την Oxytocin, μια ορμόνη που χρησιμοποιείται για την αύξηση της γαλουχίας. Αυτό με τη σειρά του, προκαλεί μεγάλη ταλαιπωρία και πόνο στα βοοειδή. Επιπλέον, χιλιάδες ζώα υφίστανται οδυνηρό πόνο ή θάνατο ως αποτέλεσμα της επιστημονικής έρευνας φαρμάκων και διαφόρων προϊόντων. Ένα άλλο παράδειγμα αυτού είναι η κλουβιά που αντιβαίνει στα δικαιώματα των ζώων. Πολλές άλλες πρακτικές όπως, ιππικό άθλημα όπου τα άλογα τρέχουν μίλια και μίλια και ξυλοκοπούνται από αναβάτες για να τους κάνουν να τρέχουν πιο γρήγορα. Και πάνω απ &#39;όλα ευχαρίστηση κυνήγι ανυπεράσπιστων ζώων. Από τον υποψήφιο μου, ο άνθρωπος πρέπει να συμπεριφέρεται ως φύλακας στα ζώα και όχι ως κύριος ή κύριος του. Τα δικαιώματα των ζώων προορίζονται να θέσουν όρια στην ανθρώπινη συμπεριφορά και η χειραγώγησή τους πρέπει να τιμωρείται ως σοβαρό έγκλημα."
}