{
    "id": "23b2d1792078845ab3c98347d994be1c",
    "link": "",
    "description": "",
    "date": "",
    "tags": [],
    "publishedAt": "",
    "crawledAt": "",
    "domain": "",
    "netloc": "",
    "annotations": {
        "ADUs": [
            {
                "id": "T1",
                "type": "MajorClaim",
                "starts": "123",
                "ends": "206",
                "segment": "αλήθεια ότι τα μέσα μαζικής ενημέρωσης δίνουν έμφαση στην προσωπική ζωή των διάσημων ανθρώπων σε αυτήν τη σύγχρονη κοινωνία."
            },
            {
                "id": "T2",
                "type": "MajorClaim",
                "starts": "229",
                "ends": "329",
                "segment": "Κατά την άποψή μου, τα μειονεκτήματα της υπερβολικής έμφασης στην προσωπική ζωή των διάσημων ανθρώπων από τα ΜΜΕ υπερτερούν των πλεονεκτημάτων του."
            },
            {
                "id": "T3",
                "type": "MajorClaim",
                "starts": "1601",
                "ends": "1686",
                "segment": "άλλα λόγια, η κίτρινη δημοσιογραφία αποκλείει τους θεατές από σημαντικές ειδήσεις, όπως εκπαίδευση, περιβάλλον και δημόσια θέματα."
            },
            {
                "id": "T4",
                "type": "Claim",
                "starts": "389",
                "ends": "499",
                "segment": "λόγοι μου περιλαμβάνουν τα εξής: Δεν υπάρχει αμφιβολία ότι τα μέσα ενημέρωσης παρέχουν πληροφορίες σχετικά με ένα γεγονός που συνέβη πρόσφατα κάπου και το οποίο είναι σημαντικό για τους ανθρώπους.",
                "stance": [
                    {
                        "id": "A1",
                        "type": "Against"
                    }
                ]
            },
            {
                "id": "T5",
                "type": "Premise",
                "starts": "501",
                "ends": "591",
                "segment": "Το πιο σημαντικό από όλα είναι ότι η ουσία της κάλυψης είναι ακριβής και δεν βασίζεται σε κουτσομπολιά."
            },
            {
                "id": "T6",
                "type": "Premise",
                "starts": "602",
                "ends": "624",
                "segment": "είναι ότι η ουσία της κάλυψης είναι ακριβής και δεν βασίζεται σε κουτσομπολιά."
            },
            {
                "id": "T7",
                "type": "Premise",
                "starts": "626",
                "ends": "774",
                "segment": "Ωστόσο, η δημοσιογραφία αλλάζει."
            },
            {
                "id": "T8",
                "type": "Claim",
                "starts": "1109",
                "ends": "1175",
                "segment": "ότι η γελοία κάλυψη μπορεί να είναι μια αναστάτωση για τους διάσημους ανθρώπους που αναφέρονται.",
                "stance": [
                    {
                        "id": "A2",
                        "type": "For"
                    }
                ]
            },
            {
                "id": "T9",
                "type": "Premise",
                "starts": "1291",
                "ends": "1425",
                "segment": "μέσα ενημέρωσης αντιμετωπίζουν την πρόκληση ότι τα στελέχη των μέσων ενημέρωσης πρέπει να επιλέξουν το περιεχόμενο, το οποίο μπορεί να προσελκύσει το κοινό."
            },
            {
                "id": "T10",
                "type": "Premise",
                "starts": "1443",
                "ends": "1550",
                "segment": "Έτσι, αυτές οι προσωπικές αναφορές διάσημων ανθρώπων, ασήμαντες πληροφορίες ή παραμορφωμένες ιστορίες, δεν θα λύσουν προβλήματα που σχετίζονται με την κοινωνία."
            },
            {
                "id": "T11",
                "type": "Premise",
                "starts": "1177",
                "ends": "1283",
                "segment": "Επιπλέον, ο αισθησιασμός αποσπά τους θεατές από δημόσια ή κοινωνικά προβλήματα."
            },
            {
                "id": "T12",
                "type": "Claim",
                "starts": "790",
                "ends": "894",
                "segment": "Πρώτα απ &#39;όλα, το κουτσομπολιό περιλαμβάνει παραπλανητικές εικόνες με σκοπό την ενίσχυση των πωλήσεων εφημερίδων ή τη συναρπαστική κοινή γνώμη.",
                "stance": [
                    {
                        "id": "A4",
                        "type": "For"
                    }
                ]
            },
            {
                "id": "T13",
                "type": "Premise",
                "starts": "896",
                "ends": "984",
                "segment": "κουτσομπολιό περιλαμβάνει παραπλανητικές εικόνες με σκοπό την ενίσχυση των πωλήσεων εφημερίδων ή τη συναρπαστική κοινή γνώμη."
            },
            {
                "id": "T14",
                "type": "Premise",
                "starts": "996",
                "ends": "1094",
                "segment": "Επιπλέον, είναι άδικο το γεγονός ότι η γελοία κάλυψη μπορεί να είναι μια αναστάτωση για τους διάσημους ανθρώπους που αναφέρονται."
            }
        ],
        "Relations": [
            {
                "id": "R1",
                "type": "supports",
                "arg1": "T5",
                "arg2": "T4"
            },
            {
                "id": "R2",
                "type": "attacks",
                "arg1": "T6",
                "arg2": "T4"
            },
            {
                "id": "R3",
                "type": "attacks",
                "arg1": "T7",
                "arg2": "T4"
            },
            {
                "id": "R5",
                "type": "supports",
                "arg1": "T11",
                "arg2": "T9"
            },
            {
                "id": "R6",
                "type": "supports",
                "arg1": "T9",
                "arg2": "T8"
            },
            {
                "id": "R8",
                "type": "supports",
                "arg1": "T13",
                "arg2": "T12"
            },
            {
                "id": "R9",
                "type": "supports",
                "arg1": "T14",
                "arg2": "T12"
            },
            {
                "id": "R4",
                "type": "supports",
                "arg1": "T10",
                "arg2": "T8"
            }
        ]
    },
    "content": "Υπερβολική έμφαση στην προσωπική ζωή των διάσημων ανθρώπων από τα μέσα μαζικής ενημέρωσης Ως φοιτητής μαζικής ενημέρωσης, πιστεύω ότι είναι αλήθεια ότι τα μέσα μαζικής ενημέρωσης δίνουν έμφαση στην προσωπική ζωή των διάσημων ανθρώπων σε αυτήν τη σύγχρονη κοινωνία. Κατά την άποψή μου, τα μειονεκτήματα της υπερβολικής έμφασης στην προσωπική ζωή των διάσημων ανθρώπων από τα ΜΜΕ υπερτερούν των πλεονεκτημάτων του. Οι λόγοι μου περιλαμβάνουν τα εξής: Δεν υπάρχει αμφιβολία ότι τα μέσα ενημέρωσης παρέχουν πληροφορίες σχετικά με ένα γεγονός που συνέβη πρόσφατα κάπου και το οποίο είναι σημαντικό για τους ανθρώπους. Το πιο σημαντικό από όλα είναι ότι η ουσία της κάλυψης είναι ακριβής και δεν βασίζεται σε κουτσομπολιά. Ωστόσο, η δημοσιογραφία αλλάζει. Μερικοί δημοσιογράφοι ενδιαφέρονται περισσότερο για κουτσομπολιό από ειδήσεις που σχετίζονται με δημόσια ζητήματα, δίνοντας πολύ μεγάλη προσοχή στην προσωπική ζωή των διάσημων ανθρώπων. Πρώτα απ &#39;όλα, το κουτσομπολιό περιλαμβάνει παραπλανητικές εικόνες με σκοπό την ενίσχυση των πωλήσεων εφημερίδων ή τη συναρπαστική κοινή γνώμη. Το κοινό μπορεί να δει πολλές φωτογραφίες στο είδος των αναφορών, που φαίνεται να αφηγούνται μια ιστορία. Επιπλέον, είναι άδικο το γεγονός ότι η γελοία κάλυψη μπορεί να είναι μια αναστάτωση για τους διάσημους ανθρώπους που αναφέρονται. Επιπλέον, ο αισθησιασμός αποσπά τους θεατές από δημόσια ή κοινωνικά προβλήματα. Τα μέσα ενημέρωσης αντιμετωπίζουν την πρόκληση ότι τα στελέχη των μέσων ενημέρωσης πρέπει να επιλέξουν το περιεχόμενο, το οποίο μπορεί να προσελκύσει το κοινό. Έτσι, αυτές οι προσωπικές αναφορές διάσημων ανθρώπων, ασήμαντες πληροφορίες ή παραμορφωμένες ιστορίες, δεν θα λύσουν προβλήματα που σχετίζονται με την κοινωνία. Με άλλα λόγια, η κίτρινη δημοσιογραφία αποκλείει τους θεατές από σημαντικές ειδήσεις, όπως εκπαίδευση, περιβάλλον και δημόσια θέματα. Με βάση την παραπάνω συζήτηση, συμφωνώ με το ότι η υπερβολική προσοχή στην προσωπική ζωή των διάσημων ανθρώπων μπορεί να είναι ένα σοβαρό πρόβλημα."
}