{
    "id": "73d219a0c593f98cc3d83f9ece82367a",
    "link": "",
    "description": "",
    "date": "",
    "tags": [],
    "publishedAt": "",
    "crawledAt": "",
    "domain": "",
    "netloc": "",
    "annotations": {
        "ADUs": [
            {
                "id": "T1",
                "type": "MajorClaim",
                "starts": "68",
                "ends": "227",
                "segment": "ότι η κυβέρνηση πρέπει να δώσει προτεραιότητες για να επενδύσει περισσότερα χρήματα στα βασικά κοινωνικά αποθέματα, όπως η εκπαίδευση και η στέγαση, αντί να επιδοτούν προγράμματα σχετικές με τις τέχνες."
            },
            {
                "id": "T2",
                "type": "MajorClaim",
                "starts": "1267",
                "ends": "1366",
                "segment": "Εν κατακλείδι, η τέχνη θα μπορούσε να διαδραματίσει ενεργό ρόλο στη βελτίωση της ποιότητας της ζωής των ανθρώπων, αλλά νομίζω ότι οι κυβερνήσεις θα πρέπει να αποδίδουν μεγαλύτερο βάρος σε άλλα κοινωνικά ζητήματα, όπως η εκπαίδευση και οι ανάγκες στέγασης, διότι αυτοί είναι οι πιο βασικοί τρόποι που επιτρέπουν στους ανθρώπους να κάνουν μια αξιοπρεπή ζωή ."
            },
            {
                "id": "T3",
                "type": "Claim",
                "starts": "1176",
                "ends": "1248",
                "segment": "Σε σύγκριση με αυτά τα ζητήματα, η επιδίωξη της τέχνης φαίνεται καθόλου ασήμαντη.",
                "stance": [
                    {
                        "id": "A1",
                        "type": "Against"
                    }
                ]
            },
            {
                "id": "T4",
                "type": "Claim",
                "starts": "1375",
                "ends": "1444",
                "segment": "ζωής των ανθρώπων, αλλά νομίζω ότι οι κυβερνήσεις θα πρέπει να αποδίδουν μεγαλύτερο βάρος σε άλλα κοινωνικά ζητήματα, όπως η εκπαίδευση και οι ανάγκες στέγασης, διότι αυτοί είναι οι πιο βασικοί τρόποι που επιτρέπουν στους ανθρώπους να κάνουν μια αξιοπρεπή ζωή .",
                "stance": [
                    {
                        "id": "A2",
                        "type": "For"
                    }
                ]
            },
            {
                "id": "T5",
                "type": "Claim",
                "starts": "229",
                "ends": "298",
                "segment": "Η τέχνη δεν είναι ο βασικός καθορισμός της ποιότητας ζωής, αλλά η εκπαίδευση είναι.",
                "stance": [
                    {
                        "id": "A3",
                        "type": "For"
                    }
                ]
            },
            {
                "id": "T6",
                "type": "Premise",
                "starts": "300",
                "ends": "482",
                "segment": "Προκειμένου να βελτιωθούν οι άνθρωποι, είναι πιο επείγον για τις κυβερνήσεις να δεσμεύσουν χρήματα σε κάποια θεμελιώδη βοήθεια, όπως η θέσπιση περισσότερων υποτροφιών στο τμήμα εκπαίδευσης για όλους τους πολίτες."
            },
            {
                "id": "T7",
                "type": "Premise",
                "starts": "507",
                "ends": "629",
                "segment": "Αυτό συμβαίνει μόνο επειδή η γνώση και η σοφία είναι η εγγύηση της βελτίωσης της ποιότητας της ζωής των ανθρώπων για ένα ολοκληρωμένο κοινωνικό σύστημα."
            },
            {
                "id": "T8",
                "type": "Claim",
                "starts": "643",
                "ends": "723",
                "segment": "Βεβαίως, η τέχνη, σε κάποιο βαθμό, εξυπηρετεί μια πολύτιμη λειτουργία για τον εμπλουτισμό της καθημερινής ζωής του ατόμου, για παράδειγμα, θα μπορούσε να φέρει την απελευθέρωση του μεγάλου βάρους της πίεσης της μελέτης και να αναζωογονήσει τα ανθρώπινα σώματα μέσα από μια δύσκολη μέρα από τη δουλειά.",
                "stance": [
                    {
                        "id": "A4",
                        "type": "Against"
                    }
                ]
            },
            {
                "id": "T9",
                "type": "Premise",
                "starts": "738",
                "ends": "851",
                "segment": "μια πολύτιμη λειτουργία για τον εμπλουτισμό της καθημερινής ζωής του ατόμου, για παράδειγμα, θα μπορούσε να φέρει την απελευθέρωση του μεγάλου βάρους της πίεσης της μελέτης και να αναζωογονήσει τα ανθρώπινα σώματα μέσα από μια δύσκολη μέρα από τη δουλειά."
            },
            {
                "id": "T10",
                "type": "Premise",
                "starts": "862",
                "ends": "1085",
                "segment": "Ωστόσο, δεν είναι ρεαλιστικό να επιδιώκουμε αυτό το υψηλό βιοτικό επίπεδο σε πολλές αναπτυσσόμενες χώρες, στις οποίες η βασική προσφορά στέγης εξακολουθεί να ήταν ένα τεράστιο πρόβλημα με πολλές οικογένειες χαμηλού εισοδήματος να έχουν πιεστεί σε ένα μικρό στενό δωμάτιο."
            },
            {
                "id": "T11",
                "type": "Premise",
                "starts": "1087",
                "ends": "1161",
                "segment": "εξακολουθεί να ήταν ένα τεράστιο πρόβλημα με πολλές οικογένειες χαμηλού εισοδήματος να έχουν πιεστεί σε ένα μικρό στενό δωμάτιο."
            }
        ],
        "Relations": [
            {
                "id": "R1",
                "type": "supports",
                "arg1": "T7",
                "arg2": "T6"
            },
            {
                "id": "R2",
                "type": "supports",
                "arg1": "T6",
                "arg2": "T5"
            },
            {
                "id": "R3",
                "type": "supports",
                "arg1": "T9",
                "arg2": "T8"
            },
            {
                "id": "R4",
                "type": "attacks",
                "arg1": "T10",
                "arg2": "T8"
            },
            {
                "id": "R5",
                "type": "attacks",
                "arg1": "T11",
                "arg2": "T8"
            }
        ]
    },
    "content": "Οι τέχνες και η μουσική βελτιώνουν την ποιότητα ζωής; Η άποψή μου είναι ότι η κυβέρνηση πρέπει να δώσει προτεραιότητες για να επενδύσει περισσότερα χρήματα στα βασικά κοινωνικά αποθέματα, όπως η εκπαίδευση και η στέγαση, αντί να επιδοτούν προγράμματα σχετικές με τις τέχνες. Η τέχνη δεν είναι ο βασικός καθορισμός της ποιότητας ζωής, αλλά η εκπαίδευση είναι. Προκειμένου να βελτιωθούν οι άνθρωποι, είναι πιο επείγον για τις κυβερνήσεις να δεσμεύσουν χρήματα σε κάποια θεμελιώδη βοήθεια, όπως η θέσπιση περισσότερων υποτροφιών στο τμήμα εκπαίδευσης για όλους τους πολίτες. Αυτό συμβαίνει μόνο επειδή η γνώση και η σοφία είναι η εγγύηση της βελτίωσης της ποιότητας της ζωής των ανθρώπων για ένα ολοκληρωμένο κοινωνικό σύστημα. Βεβαίως, η τέχνη, σε κάποιο βαθμό, εξυπηρετεί μια πολύτιμη λειτουργία για τον εμπλουτισμό της καθημερινής ζωής του ατόμου, για παράδειγμα, θα μπορούσε να φέρει την απελευθέρωση του μεγάλου βάρους της πίεσης της μελέτης και να αναζωογονήσει τα ανθρώπινα σώματα μέσα από μια δύσκολη μέρα από τη δουλειά. Ωστόσο, δεν είναι ρεαλιστικό να επιδιώκουμε αυτό το υψηλό βιοτικό επίπεδο σε πολλές αναπτυσσόμενες χώρες, στις οποίες η βασική προσφορά στέγης εξακολουθεί να ήταν ένα τεράστιο πρόβλημα με πολλές οικογένειες χαμηλού εισοδήματος να έχουν πιεστεί σε ένα μικρό στενό δωμάτιο. Σε σύγκριση με αυτά τα ζητήματα, η επιδίωξη της τέχνης φαίνεται καθόλου ασήμαντη. Εν κατακλείδι, η τέχνη θα μπορούσε να διαδραματίσει ενεργό ρόλο στη βελτίωση της ποιότητας της ζωής των ανθρώπων, αλλά νομίζω ότι οι κυβερνήσεις θα πρέπει να αποδίδουν μεγαλύτερο βάρος σε άλλα κοινωνικά ζητήματα, όπως η εκπαίδευση και οι ανάγκες στέγασης, διότι αυτοί είναι οι πιο βασικοί τρόποι που επιτρέπουν στους ανθρώπους να κάνουν μια αξιοπρεπή ζωή ."
}