{
    "id": "6525d20adfae6a2f83befce9c46df84b",
    "link": "",
    "description": "",
    "date": "",
    "tags": [],
    "publishedAt": "",
    "crawledAt": "",
    "domain": "",
    "netloc": "",
    "annotations": {
        "ADUs": [
            {
                "id": "T1",
                "type": "MajorClaim",
                "starts": "1537",
                "ends": "1648",
                "segment": "γλώσσες έχουν ιδιαίτερη σημασία για τους ανθρώπους που ανήκουν σε αυτές και η χρήση αγγλικών για την αντικατάστασή τους είναι ακατέργαστη."
            },
            {
                "id": "T2",
                "type": "Claim",
                "starts": "274",
                "ends": "343",
                "segment": "ισχυρίζονται ότι η επικράτηση των αγγλικών φέρνει ένα μεγάλο αριθμό οφέλη για τους ανθρώπους.",
                "stance": [
                    {
                        "id": "A1",
                        "type": "For"
                    }
                ]
            },
            {
                "id": "T3",
                "type": "Claim",
                "starts": "983",
                "ends": "1090",
                "segment": "Ωστόσο, οι αντίπαλοι πιστεύουν ότι το κυριαρχικό καθεστώς των αγγλικών έχει καταστρέψει την πολιτιστική πολυμορφία και πολλές λιγότερο χρησιμοποιούμενες γλώσσες εξαφανίζονται.",
                "stance": [
                    {
                        "id": "A2",
                        "type": "Against"
                    }
                ]
            },
            {
                "id": "T4",
                "type": "Premise",
                "starts": "1097",
                "ends": "1132",
                "segment": "καταστρέψει την πολιτιστική πολυμορφία και πολλές λιγότερο χρησιμοποιούμενες γλώσσες εξαφανίζονται."
            },
            {
                "id": "T5",
                "type": "Premise",
                "starts": "359",
                "ends": "462",
                "segment": "απ &#39;όλα, προωθεί την επικοινωνία και την αλληλεπίδραση μεταξύ διαφορετικών χωρών πιο εύκολα και καθαρά."
            },
            {
                "id": "T6",
                "type": "Premise",
                "starts": "464",
                "ends": "580",
                "segment": "Στην αρχαιότητα, οι διαφορετικές γλώσσες και η γεωγραφία έθεσαν εμπόδια στους ανθρώπους να ανταλλάσσουν αγαθά και ιδέες."
            },
            {
                "id": "T7",
                "type": "Premise",
                "starts": "595",
                "ends": "661",
                "segment": "η καινοτομία του αεροπλάνου και του τρένου έλυσε τα γεωγραφικά εμπόδια."
            },
            {
                "id": "T8",
                "type": "Premise",
                "starts": "663",
                "ends": "746",
                "segment": "Εάν μπορούμε να διαδώσουμε τη χρήση των αγγλικών, το εμπόδιο της γλώσσας θα εξαφανιστεί επίσης."
            },
            {
                "id": "T9",
                "type": "Premise",
                "starts": "761",
                "ends": "860",
                "segment": "τα αγγλικά είναι μια όμορφη γλώσσα, η οποία είναι πιο συστηματική και εκτεταμένη από πολλές άλλες γλώσσες."
            },
            {
                "id": "T10",
                "type": "Premise",
                "starts": "862",
                "ends": "945",
                "segment": "Η εκμάθηση αγγλικών μπορεί να ενισχύσει το συναίσθημα των ανθρώπων και να θρέψει τη λογοτεχνία και την τέχνη τους."
            },
            {
                "id": "T11",
                "type": "Premise",
                "starts": "1134",
                "ends": "1251",
                "segment": "Ακόμα και τα Αγγλικά είναι μια εκλεπτυσμένη γλώσσα."
            },
            {
                "id": "T12",
                "type": "Premise",
                "starts": "1275",
                "ends": "1394",
                "segment": "Είναι αναμφισβήτητο ότι η γλώσσα περιέχει πολλές πτυχές της καθημερινής ζωής των ανθρώπων, η οποία επηρεάζεται από τον πολιτισμό, το περιβάλλον καθώς και από τη θρησκευτική."
            },
            {
                "id": "T13",
                "type": "Premise",
                "starts": "1407",
                "ends": "1523",
                "segment": "ζωής των ανθρώπων, η οποία επηρεάζεται από τον πολιτισμό, το περιβάλλον καθώς και από τη θρησκευτική."
            },
            {
                "id": "T14",
                "type": "Claim",
                "starts": "1655",
                "ends": "1751",
                "segment": "Προσωπικά, τα αγγλικά ως κομψή γλώσσα πρέπει να υποστηρίζονται σε πολλούς τομείς για την επέκταση του παγκόσμιου εμπορίου και των επικοινωνιών.",
                "stance": [
                    {
                        "id": "A3",
                        "type": "Against"
                    }
                ]
            }
        ],
        "Relations": [
            {
                "id": "R1",
                "type": "supports",
                "arg1": "T5",
                "arg2": "T2"
            },
            {
                "id": "R2",
                "type": "supports",
                "arg1": "T6",
                "arg2": "T2"
            },
            {
                "id": "R3",
                "type": "supports",
                "arg1": "T7",
                "arg2": "T2"
            },
            {
                "id": "R4",
                "type": "supports",
                "arg1": "T8",
                "arg2": "T2"
            },
            {
                "id": "R5",
                "type": "supports",
                "arg1": "T9",
                "arg2": "T2"
            },
            {
                "id": "R6",
                "type": "supports",
                "arg1": "T10",
                "arg2": "T2"
            },
            {
                "id": "R7",
                "type": "supports",
                "arg1": "T11",
                "arg2": "T4"
            },
            {
                "id": "R8",
                "type": "supports",
                "arg1": "T4",
                "arg2": "T3"
            },
            {
                "id": "R9",
                "type": "supports",
                "arg1": "T12",
                "arg2": "T13"
            },
            {
                "id": "R10",
                "type": "supports",
                "arg1": "T13",
                "arg2": "T3"
            }
        ]
    },
    "content": "Πλεονεκτήματα και μειονεκτήματα της επικρατούσας αγγλικής γλώσσας Με την ανάπτυξη της παγκοσμιοποίησης, τα αγγλικά έγιναν η κυρίαρχη γλώσσα στο εθνικό εμπόριο, το συνέδριο και πολλά σημαντικά γεγονότα. Αυτό το φαινόμενο προκάλεσε έντονη συζήτηση στο κοινό. Μερικοί άνθρωποι ισχυρίζονται ότι η επικράτηση των αγγλικών φέρνει ένα μεγάλο αριθμό οφέλη για τους ανθρώπους. Πρώτα απ &#39;όλα, προωθεί την επικοινωνία και την αλληλεπίδραση μεταξύ διαφορετικών χωρών πιο εύκολα και καθαρά. Στην αρχαιότητα, οι διαφορετικές γλώσσες και η γεωγραφία έθεσαν εμπόδια στους ανθρώπους να ανταλλάσσουν αγαθά και ιδέες. Ευτυχώς, η καινοτομία του αεροπλάνου και του τρένου έλυσε τα γεωγραφικά εμπόδια. Εάν μπορούμε να διαδώσουμε τη χρήση των αγγλικών, το εμπόδιο της γλώσσας θα εξαφανιστεί επίσης. Επιπλέον, τα αγγλικά είναι μια όμορφη γλώσσα, η οποία είναι πιο συστηματική και εκτεταμένη από πολλές άλλες γλώσσες. Η εκμάθηση αγγλικών μπορεί να ενισχύσει το συναίσθημα των ανθρώπων και να θρέψει τη λογοτεχνία και την τέχνη τους. Ωστόσο, οι αντίπαλοι πιστεύουν ότι το κυριαρχικό καθεστώς των αγγλικών έχει καταστρέψει την πολιτιστική πολυμορφία και πολλές λιγότερο χρησιμοποιούμενες γλώσσες εξαφανίζονται. Ακόμα και τα Αγγλικά είναι μια εκλεπτυσμένη γλώσσα. Δεν εκφράζει κάθε λεπτομέρεια της ζωής, ιδίως στις χώρες της Ασίας, οι οποίες έχουν εντελώς διαφορετικό γλωσσικό σύστημα. Είναι αναμφισβήτητο ότι η γλώσσα περιέχει πολλές πτυχές της καθημερινής ζωής των ανθρώπων, η οποία επηρεάζεται από τον πολιτισμό, το περιβάλλον καθώς και από τη θρησκευτική. Προφανώς, αυτές οι γλώσσες έχουν ιδιαίτερη σημασία για τους ανθρώπους που ανήκουν σε αυτές και η χρήση αγγλικών για την αντικατάστασή τους είναι ακατέργαστη. Προσωπικά, τα αγγλικά ως κομψή γλώσσα πρέπει να υποστηρίζονται σε πολλούς τομείς για την επέκταση του παγκόσμιου εμπορίου και των επικοινωνιών. Όμως, χρειαζόμαστε ακόμη να διατηρήσουμε άλλες γλώσσες για να διατηρήσουμε τη γλωσσική και πολιτιστική πολυμορφία."
}