{
    "id": "ba1835c5423b07fdc16341befda2e98e",
    "link": "",
    "description": "",
    "date": "",
    "tags": [],
    "publishedAt": "",
    "crawledAt": "",
    "domain": "",
    "netloc": "",
    "content": "Η έκφραση &quot;Ποτέ, μην τα παρατάς ποτέ&quot; σημαίνει να συνεχίσεις να προσπαθείς και να μην σταματάς να δουλεύεις Πολλά άτομα καθ &#39;όλη τη διάρκεια της ζωής τους αντιμετωπίζουν τουλάχιστον μία αποτυχία σε διαφορετικούς τομείς όπως η εκπαίδευση, η αγάπη και η οικονομία. Μερικοί πιστεύουν ότι όταν ένα άτομο αντιμετωπίζει μια αποτυχία, ο καλύτερος τρόπος είναι να το ξεχάσει και να το απελευθερώσει. Ωστόσο, διαφωνώ απολύτως με αυτήν την ιδέα. Πάντα πιστεύω ότι ένα ηττημένο άτομο πρέπει να προσπαθεί μέχρι να πετύχει τον στόχο του. Πρώτα απ &#39;όλα, όταν οι άνθρωποι αντιμετωπίζουν μια αποτυχία μπορούν να μάθουν πολλά πράγματα από αυτήν την αποτυχία, επομένως στην επόμενη προσπάθεια προσπαθούν να αποφύγουν να κάνουν και να επαναλάβουν αυτά τα λάθη. Για παράδειγμα, οι περισσότεροι από τους εφευρέτες στην πρώτη φάση της εργασίας τους αντιμετωπίζουν κάποια προβλήματα και ήττες, αλλά στα επόμενα στάδια μαθαίνουν πώς να αντιμετωπίζουν προβλήματα. Δεύτερον, η εμπειρία δείχνει ενώ οι άνθρωποι κάνουν μια δουλειά συνεχώς, γίνονται πιο έμπειροι σε αυτό το θέμα, οπότε στην τελική προσπάθεια γίνονται επιτυχημένοι με το υψηλό εκατοστημόριο. Για παράδειγμα, οι επιστήμονες πειραματίζονται μια ουσία για μεγάλο χρονικό διάστημα, αφού αποκτήσουν πολλή εμπειρία και γνώση σχετικά με αυτό το θέμα αποφασίζουν να το κάνουν τελικό. Συνοψίζοντας, θα υποστήριζα ότι οι άνθρωποι δεν πρέπει να παραιτηθούν όταν αντιμετωπίζουν μια αποτυχία. Αντίθετα, πρέπει να μάθουν νέα σημεία από αυτήν την αποτυχία, και γίνονται πιο έμπειροι.",
    "annotations": {
        "ADUs": [
            {
                "id": "T1",
                "type": "MajorClaim",
                "starts": "373",
                "ends": "442",
                "segment": "Πάντα πιστεύω ότι ένα ηττημένο άτομο πρέπει να προσπαθεί μέχρι να πετύχει τον στόχο του."
            },
            {
                "id": "T2",
                "type": "MajorClaim",
                "starts": "1177",
                "ends": "1232",
                "segment": "οι άνθρωποι δεν πρέπει να παραιτηθούν όταν αντιμετωπίζουν μια αποτυχία."
            },
            {
                "id": "T3",
                "type": "Claim",
                "starts": "1247",
                "ends": "1328",
                "segment": NaN,
                "stance": [
                    {
                        "id": "A1",
                        "type": "For"
                    }
                ]
            },
            {
                "id": "T4",
                "type": "Claim",
                "starts": "459",
                "ends": "630",
                "segment": "Πρώτα απ &#39;όλα, όταν οι άνθρωποι αντιμετωπίζουν μια αποτυχία μπορούν να μάθουν πολλά πράγματα από αυτήν την αποτυχία, επομένως στην επόμενη προσπάθεια προσπαθούν να αποφύγουν να κάνουν και να επαναλάβουν αυτά τα λάθη.",
                "stance": [
                    {
                        "id": "A2",
                        "type": "For"
                    }
                ]
            },
            {
                "id": "T6",
                "type": "Premise",
                "starts": "646",
                "ends": "793",
                "segment": "Για παράδειγμα, οι περισσότεροι από τους εφευρέτες στην πρώτη φάση της εργασίας τους αντιμετωπίζουν κάποια προβλήματα και ήττες, αλλά στα επόμενα στάδια μαθαίνουν πώς να αντιμετωπίζουν προβλήματα."
            },
            {
                "id": "T5",
                "type": "Claim",
                "starts": "810",
                "ends": "980",
                "segment": "Δεύτερον, η εμπειρία δείχνει ενώ οι άνθρωποι κάνουν μια δουλειά συνεχώς, γίνονται πιο έμπειροι σε αυτό το θέμα, οπότε στην τελική προσπάθεια γίνονται επιτυχημένοι με το υψηλό εκατοστημόριο.",
                "stance": [
                    {
                        "id": "A3",
                        "type": "For"
                    }
                ]
            },
            {
                "id": "T7",
                "type": "Premise",
                "starts": "995",
                "ends": "1142",
                "segment": "Για παράδειγμα, οι επιστήμονες πειραματίζονται μια ουσία για μεγάλο χρονικό διάστημα, αφού αποκτήσουν πολλή εμπειρία και γνώση σχετικά με αυτό το θέμα αποφασίζουν να το κάνουν τελικό."
            }
        ],
        "Relations": [
            {
                "id": "R2",
                "type": "supports",
                "arg1": "T6",
                "arg2": "T4"
            },
            {
                "id": "R1",
                "type": "supports",
                "arg1": "T7",
                "arg2": "T5"
            }
        ]
    }
}