{
    "id": "a02217ebfc2d57a844ce4d7ce2f58470",
    "link": "",
    "description": "",
    "date": "",
    "tags": [],
    "publishedAt": "",
    "crawledAt": "",
    "domain": "",
    "netloc": "",
    "annotations": {
        "ADUs": [
            {
                "id": "T1",
                "type": "MajorClaim",
                "starts": "468",
                "ends": "539",
                "segment": "την προηγμένη εκπαίδευση, δεν υπάρχει αμφιβολία ότι μια κυβέρνηση υποτίθεται ότι προσφέρει επαρκή οικονομική υποστήριξη και για τα δύο."
            },
            {
                "id": "T2",
                "type": "MajorClaim",
                "starts": "1909",
                "ends": "1993",
                "segment": "κυβέρνησης για τα πανεπιστήμια μπορεί να προσελκύσει περισσότερους εξαιρετικούς διανοούμενους και ερευνητές στη χώρα και να απολαμβάνει υψηλότερης φήμης παγκοσμίως."
            },
            {
                "id": "T3",
                "type": "Claim",
                "starts": "1995",
                "ends": "2043",
                "segment": "Από τους λόγους που αναφέρονται παραπάνω, μπορούμε με ασφάλεια να καταλήξουμε στο συμπέρασμα ότι, μια κυβέρνηση πρέπει να καταβάλει προσπάθειες για την εκπαίδευση των μικρών παιδιών καθώς και τα πανεπιστήμια, και οι δύο είναι ζωτικής σημασίας στο δρόμο για ένα λαμπρό μέλλον.",
                "stance": [
                    {
                        "id": "A1",
                        "type": "For"
                    }
                ]
            },
            {
                "id": "T4",
                "type": "Claim",
                "starts": "960",
                "ends": "1167",
                "segment": "Με άλλα λόγια, εάν οι χώρες, ιδίως οι αναπτυσσόμενες χώρες, είναι αποφασισμένες να απογειωθούν, ένα από τα βασικά σημεία που πρέπει να θέσουν οι κυβερνήσεις στην ατζέντα είναι να εκπαιδεύσουν πιο καταρτισμένους μελλοντικούς πολίτες μέσω της στοιχειώδους εκπαίδευσης.",
                "stance": [
                    {
                        "id": "A2",
                        "type": "For"
                    }
                ]
            },
            {
                "id": "T5",
                "type": "Premise",
                "starts": "776",
                "ends": "942",
                "segment": "Έτσι, η έλλειψη καθιερωμένης πρωτοβάθμιας εκπαίδευσης συμβαδίζει με ένα υψηλό ποσοστό αναλφαβητισμού, και αυτή η αλληλεπίδραση θέτει σε κίνδυνο σοβαρά τη μελλοντική ανάπτυξη μιας χώρας."
            },
            {
                "id": "T6",
                "type": "Premise",
                "starts": "557",
                "ends": "687",
                "segment": "Όσον αφορά τη στοιχειώδη εκπαίδευση, όπως και η βάση μιας αρχιτεκτονικής, είναι η θεμελιώδης απαίτηση να είσαι ειδικευμένος πολίτης στη σημερινή κοινωνία, η κυβέρνηση πρέπει να εγγυηθεί ότι όλοι οι άνθρωποι έχουν ίση και βολική πρόσβαση σε αυτήν."
            },
            {
                "id": "T7",
                "type": "Premise",
                "starts": "689",
                "ends": "771",
                "segment": "θεμελιώδης απαίτηση να είσαι ειδικευμένος πολίτης στη σημερινή κοινωνία, η κυβέρνηση πρέπει να εγγυηθεί ότι όλοι οι άνθρωποι έχουν ίση και βολική πρόσβαση σε αυτήν."
            },
            {
                "id": "T8",
                "type": "Claim",
                "starts": "1687",
                "ends": "1840",
                "segment": "Οι έρευνες για τις ανθρωπιστικές επιστήμες και την τέχνη χρειάζονται ακόμη μεγάλο χρηματικό ποσό, επιπλέον, ο μεγάλος προϋπολογισμός της κυβέρνησης για τα πανεπιστήμια μπορεί να προσελκύσει περισσότερους εξαιρετικούς διανοούμενους και ερευνητές στη χώρα και να απολαμβάνει υψηλότερης φήμης παγκοσμίως.",
                "stance": [
                    {
                        "id": "A3",
                        "type": "For"
                    }
                ]
            },
            {
                "id": "T9",
                "type": "Premise",
                "starts": "1605",
                "ends": "1672",
                "segment": "Κάποιοι μπορεί να υποστηρίξουν ότι τα πανεπιστήμια μπορούν να τα υποστηρίξουν καλά μέσω δωρεάς ή εφεύρεσης, αλλά αυτό το επιχείρημα δεν είναι έγκυρο."
            },
            {
                "id": "T10",
                "type": "Premise",
                "starts": "1188",
                "ends": "1331",
                "segment": "Αυτό δεν είναι αρκετό, γιατί η τριτοβάθμια εκπαίδευση, που αντιπροσωπεύει την αιχμή των ακαδημαϊκών επιτευγμάτων μιας χώρας, ενεργεί ως πρωτοπόρος στην οικονομική και κοινωνική πρόοδο."
            },
            {
                "id": "T11",
                "type": "Premise",
                "starts": "1333",
                "ends": "1487",
                "segment": "Η υψηλή τεχνολογία και οι νέες ιδέες που εφαρμόζονται στην πράξη μπορεί όχι μόνο να οδηγήσουν μια χώρα στην άνθηση αλλά και να αναβαθμίσουν τη θέση της στη διεθνή κοινότητα."
            },
            {
                "id": "T12",
                "type": "Premise",
                "starts": "1489",
                "ends": "1573",
                "segment": "πράξη μπορεί όχι μόνο να οδηγήσουν μια χώρα στην άνθηση αλλά και να αναβαθμίσουν τη θέση της στη διεθνή κοινότητα."
            },
            {
                "id": "T13",
                "type": "Premise",
                "starts": "1579",
                "ends": "1603",
                "segment": "τη θέση της στη διεθνή κοινότητα."
            }
        ],
        "Relations": [
            {
                "id": "R1",
                "type": "supports",
                "arg1": "T5",
                "arg2": "T4"
            },
            {
                "id": "R2",
                "type": "supports",
                "arg1": "T7",
                "arg2": "T4"
            },
            {
                "id": "R3",
                "type": "supports",
                "arg1": "T6",
                "arg2": "T4"
            },
            {
                "id": "R4",
                "type": "attacks",
                "arg1": "T13",
                "arg2": "T12"
            },
            {
                "id": "R5",
                "type": "attacks",
                "arg1": "T12",
                "arg2": "T8"
            },
            {
                "id": "R6",
                "type": "supports",
                "arg1": "T9",
                "arg2": "T8"
            },
            {
                "id": "R7",
                "type": "supports",
                "arg1": "T11",
                "arg2": "T8"
            },
            {
                "id": "R8",
                "type": "supports",
                "arg1": "T10",
                "arg2": "T8"
            }
        ]
    },
    "content": "Εστίαση στον κυβερνητικό προϋπολογισμό, μικρά παιδιά ή πανεπιστήμιο; «Η εκπαίδευση είναι η επένδυση στο μέλλον μας», όπως επισήμανε κάποτε ο γερουσιαστής Bernie Sanders, η εκπαίδευση, η οποία προωθεί μια πολιτισμένη κοινωνία, παίζει σημαντικό ρόλο στη μακροχρόνια ευημερία μιας χώρας. Δεν είναι περίεργο που οι κυβερνήσεις σε όλο τον κόσμο δίνουν ιδιαίτερη έμφαση στην ανάπτυξη της εκπαίδευσης. Όσον αφορά τα δύο αναπόσπαστα στοιχεία του συστήματος, τη στοιχειώδη και την προηγμένη εκπαίδευση, δεν υπάρχει αμφιβολία ότι μια κυβέρνηση υποτίθεται ότι προσφέρει επαρκή οικονομική υποστήριξη και για τα δύο. Όσον αφορά τη στοιχειώδη εκπαίδευση, όπως και η βάση μιας αρχιτεκτονικής, είναι η θεμελιώδης απαίτηση να είσαι ειδικευμένος πολίτης στη σημερινή κοινωνία, η κυβέρνηση πρέπει να εγγυηθεί ότι όλοι οι άνθρωποι έχουν ίση και βολική πρόσβαση σε αυτήν. Έτσι, η έλλειψη καθιερωμένης πρωτοβάθμιας εκπαίδευσης συμβαδίζει με ένα υψηλό ποσοστό αναλφαβητισμού, και αυτή η αλληλεπίδραση θέτει σε κίνδυνο σοβαρά τη μελλοντική ανάπτυξη μιας χώρας. Με άλλα λόγια, εάν οι χώρες, ιδίως οι αναπτυσσόμενες χώρες, είναι αποφασισμένες να απογειωθούν, ένα από τα βασικά σημεία που πρέπει να θέσουν οι κυβερνήσεις στην ατζέντα είναι να εκπαιδεύσουν πιο καταρτισμένους μελλοντικούς πολίτες μέσω της στοιχειώδους εκπαίδευσης. Αυτό δεν είναι αρκετό, γιατί η τριτοβάθμια εκπαίδευση, που αντιπροσωπεύει την αιχμή των ακαδημαϊκών επιτευγμάτων μιας χώρας, ενεργεί ως πρωτοπόρος στην οικονομική και κοινωνική πρόοδο. Η υψηλή τεχνολογία και οι νέες ιδέες που εφαρμόζονται στην πράξη μπορεί όχι μόνο να οδηγήσουν μια χώρα στην άνθηση αλλά και να αναβαθμίσουν τη θέση της στη διεθνή κοινότητα. Κάποιοι μπορεί να υποστηρίξουν ότι τα πανεπιστήμια μπορούν να τα υποστηρίξουν καλά μέσω δωρεάς ή εφεύρεσης, αλλά αυτό το επιχείρημα δεν είναι έγκυρο. Οι έρευνες για τις ανθρωπιστικές επιστήμες και την τέχνη χρειάζονται ακόμη μεγάλο χρηματικό ποσό, επιπλέον, ο μεγάλος προϋπολογισμός της κυβέρνησης για τα πανεπιστήμια μπορεί να προσελκύσει περισσότερους εξαιρετικούς διανοούμενους και ερευνητές στη χώρα και να απολαμβάνει υψηλότερης φήμης παγκοσμίως. Από τους λόγους που αναφέρονται παραπάνω, μπορούμε με ασφάλεια να καταλήξουμε στο συμπέρασμα ότι, μια κυβέρνηση πρέπει να καταβάλει προσπάθειες για την εκπαίδευση των μικρών παιδιών καθώς και τα πανεπιστήμια, και οι δύο είναι ζωτικής σημασίας στο δρόμο για ένα λαμπρό μέλλον."
}