{
    "id": "a6a3991d67abba8a916c18911214707a",
    "link": "",
    "description": "",
    "date": "",
    "tags": [],
    "publishedAt": "",
    "crawledAt": "",
    "domain": "",
    "netloc": "",
    "annotations": {
        "ADUs": [
            {
                "id": "T1",
                "type": "MajorClaim",
                "starts": "376",
                "ends": "433",
                "segment": "Η μετάβαση σε άλλο μέρος για εκμάθηση γλώσσας είναι καλύτερη επιλογή."
            },
            {
                "id": "T2",
                "type": "MajorClaim",
                "starts": "1430",
                "ends": "1517",
                "segment": "με τον φίλο μου χωρίς να ανησυχώ για το να μιλάω λάθος."
            },
            {
                "id": "T3",
                "type": "Claim",
                "starts": "1526",
                "ends": "1583",
                "segment": "λόγος με κάνει να σημειώνω ταχύτερη πρόοδο στην ξένη γλώσσα.",
                "stance": [
                    {
                        "id": "A1",
                        "type": "For"
                    }
                ]
            },
            {
                "id": "T4",
                "type": "Claim",
                "starts": "1594",
                "ends": "1676",
                "segment": "κατακλείδι, προσωπικά πιστεύω ότι η εκμάθηση γλώσσας από ξένη χώρα είναι καλύτερη από την εκμάθηση γλώσσας στην πατρίδα, επειδή πρέπει να βελτιωθώ για να επικοινωνήσω με άλλους ανθρώπους.",
                "stance": [
                    {
                        "id": "A5",
                        "type": "For"
                    }
                ]
            },
            {
                "id": "T5",
                "type": "MajorClaim",
                "starts": "1678",
                "ends": "1766",
                "segment": "γλώσσας στην πατρίδα, επειδή πρέπει να βελτιωθώ για να επικοινωνήσω με άλλους ανθρώπους."
            },
            {
                "id": "T6",
                "type": "Premise",
                "starts": "610",
                "ends": "714",
                "segment": "Για παράδειγμα, όλοι γύρω μου μιλούν ξένη γλώσσα και έπειτα πρέπει να βελτιωθώ για να επικοινωνήσω με ανθρώπους."
            },
            {
                "id": "T7",
                "type": "Premise",
                "starts": "716",
                "ends": "810",
                "segment": "Αν δεν μπορούσα να επικοινωνήσω με άλλους ανθρώπους, δεν θα μπορούσα καν να αγοράσω φαγητό για να θυσιάσω την πείνα μου."
            },
            {
                "id": "T8",
                "type": "Premise",
                "starts": "812",
                "ends": "926",
                "segment": "Αυτό το περιβάλλον με κάνει να θέλω να αναπτύξω τον εαυτό μου για να μπορώ να επικοινωνώ με άτομα που μιλούν ξένη γλώσσα."
            },
            {
                "id": "T9",
                "type": "Claim",
                "starts": "493",
                "ends": "595",
                "segment": "Κατ &#39;αρχάς, η μετάβαση σε άλλη χώρα για εκμάθηση γλώσσας είναι ένα καλό περιβάλλον για να ενθαρρύνει τους ανθρώπους να μάθουν γλώσσα.",
                "stance": [
                    {
                        "id": "A3",
                        "type": "For"
                    }
                ]
            },
            {
                "id": "T10",
                "type": "Claim",
                "starts": "938",
                "ends": "1035",
                "segment": "αναπτύξω τον εαυτό μου για να μπορώ να επικοινωνώ με άτομα που μιλούν ξένη γλώσσα.",
                "stance": [
                    {
                        "id": "A4",
                        "type": "For"
                    }
                ]
            },
            {
                "id": "T11",
                "type": "Premise",
                "starts": "1051",
                "ends": "1176",
                "segment": "να έχεις φίλο που μιλά μια άλλη γλώσσα βοηθά τους ανθρώπους να κάνουν επαγγελματίες σε αυτήν τη γλώσσα πιο γρήγορα."
            },
            {
                "id": "T12",
                "type": "Premise",
                "starts": "1178",
                "ends": "1249",
                "segment": "Για παράδειγμα, αγγλικό σχολείο εκτός της χώρας μου, υπάρχουν πολλοί άνθρωποι που προέρχονται από διαφορετικά μέρη και από διαφορετικές γλώσσες."
            },
            {
                "id": "T13",
                "type": "Premise",
                "starts": "1257",
                "ends": "1322",
                "segment": "Η μόνη γλώσσα που θα μπορούσα να μιλήσω για να κάνω φίλους είναι η αγγλική γλώσσα."
            },
            {
                "id": "T14",
                "type": "Premise",
                "starts": "1324",
                "ends": "1387",
                "segment": "μπορούσα να μιλήσω για να κάνω φίλους είναι η αγγλική γλώσσα."
            }
        ],
        "Relations": [
            {
                "id": "R1",
                "type": "supports",
                "arg1": "T6",
                "arg2": "T9"
            },
            {
                "id": "R2",
                "type": "supports",
                "arg1": "T7",
                "arg2": "T9"
            },
            {
                "id": "R3",
                "type": "supports",
                "arg1": "T8",
                "arg2": "T9"
            },
            {
                "id": "R4",
                "type": "supports",
                "arg1": "T11",
                "arg2": "T10"
            },
            {
                "id": "R5",
                "type": "supports",
                "arg1": "T12",
                "arg2": "T10"
            },
            {
                "id": "R6",
                "type": "supports",
                "arg1": "T13",
                "arg2": "T10"
            },
            {
                "id": "R7",
                "type": "supports",
                "arg1": "T14",
                "arg2": "T10"
            }
        ]
    },
    "content": "Η εκμάθηση μιας ξένης γλώσσας στη χώρα μου ή σε άλλη χώρα Η γνώση της ξένης γλώσσας γίνεται όλο και πιο σημαντική αυτή τη στιγμή. Πολλοί άνθρωποι συνεχίζουν να σπουδάζουν ξένη γλώσσα. Υπάρχουν δύο επιλογές για να μάθετε ξένη γλώσσα. Πρώτα είναι η διαμονή στην πατρίδα για να σπουδάσει ξένη γλώσσα. Η δεύτερη επιλογή είναι ότι πηγαίνετε να μελετήσετε σε άλλο μέρος που ομιλείται ξένη γλώσσα. Η μετάβαση σε άλλο μέρος για εκμάθηση γλώσσας είναι καλύτερη επιλογή. Θα δώσω λόγους για να υποστηρίξω τη γνώμη μου. Κατ &#39;αρχάς, η μετάβαση σε άλλη χώρα για εκμάθηση γλώσσας είναι ένα καλό περιβάλλον για να ενθαρρύνει τους ανθρώπους να μάθουν γλώσσα. Για παράδειγμα, όλοι γύρω μου μιλούν ξένη γλώσσα και έπειτα πρέπει να βελτιωθώ για να επικοινωνήσω με ανθρώπους. Αν δεν μπορούσα να επικοινωνήσω με άλλους ανθρώπους, δεν θα μπορούσα καν να αγοράσω φαγητό για να θυσιάσω την πείνα μου. Αυτό το περιβάλλον με κάνει να θέλω να αναπτύξω τον εαυτό μου για να μπορώ να επικοινωνώ με άτομα που μιλούν ξένη γλώσσα. Δεύτερον, το να έχεις φίλο που μιλά μια άλλη γλώσσα βοηθά τους ανθρώπους να κάνουν επαγγελματίες σε αυτήν τη γλώσσα πιο γρήγορα. Για παράδειγμα, αγγλικό σχολείο εκτός της χώρας μου, υπάρχουν πολλοί άνθρωποι που προέρχονται από διαφορετικά μέρη και από διαφορετικές γλώσσες. Η μόνη γλώσσα που θα μπορούσα να μιλήσω για να κάνω φίλους είναι η αγγλική γλώσσα. Έτσι, θα μπορούσα να μιλήσω με τον φίλο μου χωρίς να ανησυχώ για το να μιλάω λάθος. Αυτός ο λόγος με κάνει να σημειώνω ταχύτερη πρόοδο στην ξένη γλώσσα. Εν κατακλείδι, προσωπικά πιστεύω ότι η εκμάθηση γλώσσας από ξένη χώρα είναι καλύτερη από την εκμάθηση γλώσσας στην πατρίδα, επειδή πρέπει να βελτιωθώ για να επικοινωνήσω με άλλους ανθρώπους. Εκτός αυτού, σε ξένη χώρα θα μπορούσα να μιλήσω ξένη γλώσσα με τους φίλους μου. Η εκμάθηση ξένων γλωσσών από άλλη χώρα είναι καλύτερη επιλογή για μένα να μελετήσω γλώσσα."
}