{
    "id": "9f8aaf780fc9d89edd66964cfd0490c9",
    "link": "",
    "description": "",
    "date": "",
    "tags": [],
    "publishedAt": "",
    "crawledAt": "",
    "domain": "",
    "netloc": "",
    "annotations": {
        "ADUs": [
            {
                "id": "T1",
                "type": "MajorClaim",
                "starts": "47",
                "ends": "103",
                "segment": "δηλώνει ότι κάθε γρήγορη και όχι καλά μελετημένη απόφαση είναι χαμένη."
            },
            {
                "id": "T2",
                "type": "MajorClaim",
                "starts": "1237",
                "ends": "1282",
                "segment": "Όπως μπορεί να φανεί από αυτό, είναι ότι μια βιαστική απόφαση σχεδόν ποτέ δεν είναι καλή."
            },
            {
                "id": "T3",
                "type": "Claim",
                "starts": "323",
                "ends": "375",
                "segment": "Κατά συνέπεια, η λήψη γρήγορων αποφάσεων οδηγεί σε πιθανά κακά αποτελέσματα.",
                "stance": [
                    {
                        "id": "A1",
                        "type": "For"
                    }
                ]
            },
            {
                "id": "T4",
                "type": "Premise",
                "starts": "193",
                "ends": "307",
                "segment": "λόγους: Για ένα πράγμα, η λήψη μιας γρήγορης απόφασης σημαίνει ότι δεν είναι πολύ μελετημένη και ότι δεν έχει ελεγχθεί από όλες τις πτυχές της."
            },
            {
                "id": "T5",
                "type": "Premise",
                "starts": "390",
                "ends": "549",
                "segment": "Για παράδειγμα: εάν κάποιος αποφάσισε να εγκαταλείψει τη δουλειά του χωρίς να σκεφτεί πραγματικά την εναλλακτική λύση, ή ένα σχέδιο Β, θα μπορούσε να καταλήξει να είναι άνεργος, λόγω της ταχείας απόφασής του."
            },
            {
                "id": "T6",
                "type": "Claim",
                "starts": "564",
                "ends": "662",
                "segment": "Επιπλέον, η λήψη μιας βιαστικής απόφασης θα μπορούσε επίσης να σημαίνει ότι το άτομο χάνει μια πιθανή ευκαιρία.",
                "stance": [
                    {
                        "id": "A2",
                        "type": "For"
                    }
                ]
            },
            {
                "id": "T7",
                "type": "Premise",
                "starts": "681",
                "ends": "832",
                "segment": "Με άλλα λόγια, αν αυτό το άτομο περίμενε και σκέφτηκε την απόφασή του, δεν θα είχε χάσει το άνοιγμα της εργασίας στην ίδια εταιρεία, αλλά σε διαφορετική θέση."
            },
            {
                "id": "T8",
                "type": "Premise",
                "starts": "841",
                "ends": "873",
                "segment": "εταιρεία, αλλά σε διαφορετική θέση."
            },
            {
                "id": "T9",
                "type": "Claim",
                "starts": "896",
                "ends": "989",
                "segment": "Για να μην αναφέρουμε, ότι οι βιαστικές αποφάσεις, όχι μόνο σπαταλούν, αλλά επίσης, θα μπορούσαν να επηρεάσουν ολόκληρη τη ζωή του ατόμου.",
                "stance": [
                    {
                        "id": "A3",
                        "type": "For"
                    }
                ]
            },
            {
                "id": "T10",
                "type": "Premise",
                "starts": "991",
                "ends": "1155",
                "segment": "Για να το θέσω διαφορετικά, είναι ότι αφού αυτό το άτομο εγκαταλείψει τη δουλειά του και ανέργειε, δεν μπορεί πλέον να πληρώσει τους λογαριασμούς του ούτε να αγοράσει ό, τι χρειάζεται για τις καθημερινές του ανάγκες, έτσι, η ζωή του είχε γυρίσει στη χειρότερη."
            },
            {
                "id": "T11",
                "type": "Premise",
                "starts": "1163",
                "ends": "1201",
                "segment": "του ούτε να αγοράσει ό, τι χρειάζεται για τις καθημερινές του ανάγκες, έτσι, η ζωή του είχε γυρίσει στη χειρότερη."
            }
        ],
        "Relations": [
            {
                "id": "R1",
                "type": "supports",
                "arg1": "T5",
                "arg2": "T3"
            },
            {
                "id": "R2",
                "type": "supports",
                "arg1": "T4",
                "arg2": "T3"
            },
            {
                "id": "R3",
                "type": "supports",
                "arg1": "T7",
                "arg2": "T8"
            },
            {
                "id": "R4",
                "type": "supports",
                "arg1": "T8",
                "arg2": "T6"
            },
            {
                "id": "R5",
                "type": "supports",
                "arg1": "T10",
                "arg2": "T11"
            },
            {
                "id": "R6",
                "type": "supports",
                "arg1": "T11",
                "arg2": "T9"
            }
        ]
    },
    "content": "Η βιασύνη κάνει σπατάλη Αυτό το ρητό δηλώνει ότι κάθε γρήγορη και όχι καλά μελετημένη απόφαση είναι χαμένη. Κατά τη γνώμη μου, αυτή η δήλωση είναι απολύτως αληθινή, για αυτούς τους λίγους λόγους: Για ένα πράγμα, η λήψη μιας γρήγορης απόφασης σημαίνει ότι δεν είναι πολύ μελετημένη και ότι δεν έχει ελεγχθεί από όλες τις πτυχές της. Κατά συνέπεια, η λήψη γρήγορων αποφάσεων οδηγεί σε πιθανά κακά αποτελέσματα. Για παράδειγμα: εάν κάποιος αποφάσισε να εγκαταλείψει τη δουλειά του χωρίς να σκεφτεί πραγματικά την εναλλακτική λύση, ή ένα σχέδιο Β, θα μπορούσε να καταλήξει να είναι άνεργος, λόγω της ταχείας απόφασής του. Επιπλέον, η λήψη μιας βιαστικής απόφασης θα μπορούσε επίσης να σημαίνει ότι το άτομο χάνει μια πιθανή ευκαιρία. Με άλλα λόγια, αν αυτό το άτομο περίμενε και σκέφτηκε την απόφασή του, δεν θα είχε χάσει το άνοιγμα της εργασίας στην ίδια εταιρεία, αλλά σε διαφορετική θέση. Ως εκ τούτου, δεν θα ήταν άνεργος. Για να μην αναφέρουμε, ότι οι βιαστικές αποφάσεις, όχι μόνο σπαταλούν, αλλά επίσης, θα μπορούσαν να επηρεάσουν ολόκληρη τη ζωή του ατόμου. Για να το θέσω διαφορετικά, είναι ότι αφού αυτό το άτομο εγκαταλείψει τη δουλειά του και ανέργειε, δεν μπορεί πλέον να πληρώσει τους λογαριασμούς του ούτε να αγοράσει ό, τι χρειάζεται για τις καθημερινές του ανάγκες, έτσι, η ζωή του είχε γυρίσει στη χειρότερη. Όπως μπορεί να φανεί από αυτό, είναι ότι μια βιαστική απόφαση σχεδόν ποτέ δεν είναι καλή. Γι &#39;αυτό πρέπει πάντα να μελετάμε την απόφασή του προσεκτικά και αργά, για να διασφαλίσουμε ότι η απόφαση που παίρνει το άτομο είναι η καλύτερη για αυτόν."
}