{
    "id": "9f06373d2e1cc21f2925eb721881b1de",
    "link": "",
    "description": "",
    "date": "",
    "tags": [],
    "publishedAt": "",
    "crawledAt": "",
    "domain": "",
    "netloc": "",
    "annotations": {
        "ADUs": [
            {
                "id": "T1",
                "type": "MajorClaim",
                "starts": "1915",
                "ends": "2027",
                "segment": "έθνη μπορούν να παρέχουν χρηματοοικονομικές υπηρεσίες σε φτωχότερες χώρες για να ενθαρρύνουν τις συναλλαγές."
            },
            {
                "id": "T2",
                "type": "Claim",
                "starts": "2029",
                "ends": "2156",
                "segment": "επίσης να δώσει συμβουλές σχετικά με τη δημιουργία μιας πλήρους και αποτελεσματικής υποδομής μεταφορών για την υποστήριξη των συναλλαγών.",
                "stance": [
                    {
                        "id": "A1",
                        "type": "For"
                    }
                ]
            },
            {
                "id": "T3",
                "type": "MajorClaim",
                "starts": "171",
                "ends": "257",
                "segment": "Τα φτωχότερα έθνη χρειάζονται βοήθεια από πλουσιότερα έθνη σε αυτούς τους τομείς για να αναπτύξουν τις χώρες τους."
            },
            {
                "id": "T4",
                "type": "Claim",
                "starts": "638",
                "ends": "766",
                "segment": "Για την επίλυση αυτών των ζητημάτων, τα πλουσιότερα έθνη μπορούν να συνεισφέρουν αναθέτοντας γιατρούς και νοσηλευτές σε αυτά τα έθνη εξουσίας καθώς και δωρίζοντας χρήματα για την κατασκευή νοσοκομείων.",
                "stance": [
                    {
                        "id": "A2",
                        "type": "For"
                    }
                ]
            },
            {
                "id": "T5",
                "type": "Premise",
                "starts": "268",
                "ends": "382",
                "segment": "Πρώτον, στον τομέα της υγείας, τα φτωχότερα έθνη έχουν συνήθως λιγότερη ποσότητα γιατρών και νοσοκόμων σε σύγκριση με τα πλουσιότερα έθνη."
            },
            {
                "id": "T6",
                "type": "Premise",
                "starts": "384",
                "ends": "521",
                "segment": "Ο υψηλός πληθυσμός στις φτωχότερες χώρες λόγω της έλλειψης οικογενειακού προγραμματισμού προκάλεσε την ανισορροπία του ποσοστού των γιατρών με την ποσότητα των κατοίκων."
            },
            {
                "id": "T7",
                "type": "Premise",
                "starts": "539",
                "ends": "613",
                "segment": "προκάλεσε την ανισορροπία του ποσοστού των γιατρών με την ποσότητα των κατοίκων."
            },
            {
                "id": "T8",
                "type": "Claim",
                "starts": "1102",
                "ends": "1210",
                "segment": "Προκειμένου να επιλυθεί το πρόβλημα του ανθρώπινου δυναμικού, οι πλουσιότερες χώρες μπορούν να διαθέσουν έμπειρους εκπαιδευτικούς για να εκπαιδεύσουν περισσότερους εκπαιδευτικούς και καθηγητές σε φτωχότερες χώρες.",
                "stance": [
                    {
                        "id": "A3",
                        "type": "For"
                    }
                ]
            },
            {
                "id": "T9",
                "type": "Claim",
                "starts": "1223",
                "ends": "1332",
                "segment": "ανθρώπινου δυναμικού, οι πλουσιότερες χώρες μπορούν να διαθέσουν έμπειρους εκπαιδευτικούς για να εκπαιδεύσουν περισσότερους εκπαιδευτικούς και καθηγητές σε φτωχότερες χώρες.",
                "stance": [
                    {
                        "id": "A4",
                        "type": "For"
                    }
                ]
            },
            {
                "id": "T10",
                "type": "Premise",
                "starts": "778",
                "ends": "936",
                "segment": "Δεύτερον, στον τομέα της εκπαίδευσης, είναι γενικά αποδεκτό ότι οι φτωχότερες χώρες συχνά στερούνται καθηγητών στα σχολεία, καθώς και καθηγητές σε ιδρύματα τριτοβάθμιας εκπαίδευσης."
            },
            {
                "id": "T11",
                "type": "Premise",
                "starts": "952",
                "ends": "1050",
                "segment": "Εκτός αυτού, η εκπαίδευση για αυτές τις χώρες κανονικά δεν είναι δωρεάν, έτσι μόνο μια συγκεκριμένη ομάδα μαθητών μπορεί να την αντέξει."
            },
            {
                "id": "T12",
                "type": "Claim",
                "starts": "1342",
                "ends": "1462",
                "segment": "Εν τω μεταξύ, για την έκδοση της αμοιβής εκπαίδευσης, οι πλουσιότερες χώρες θα πρέπει να προσφέρουν υποτροφίες και δάνειο στους ειδικευμένους φοιτητές.",
                "stance": [
                    {
                        "id": "A5",
                        "type": "For"
                    }
                ]
            },
            {
                "id": "T13",
                "type": "Premise",
                "starts": "1464",
                "ends": "1570",
                "segment": "Τέλος, στον τομέα του εμπορίου, κανείς δεν μπορεί να αρνηθεί ότι οι φτωχότερες χώρες υστερούν έναντι των πλουσιότερων χωρών λόγω έλλειψης χρημάτων."
            },
            {
                "id": "T14",
                "type": "Premise",
                "starts": "1585",
                "ends": "1660",
                "segment": "Οι συναλλαγές είναι λιγότερο ενεργές σε φτωχότερες χώρες μπορεί επίσης να οφείλονται σε ελλιπή μεταφορική υποδομή."
            },
            {
                "id": "T15",
                "type": "Premise",
                "starts": "1686",
                "ends": "1771",
                "segment": "Για παράδειγμα, οι κάτοικοι στις αγροτικές περιοχές εξακολουθούν να εξαρτώνται από τη δική τους φάρμα για την παραγωγή τροφίμων."
            },
            {
                "id": "T16",
                "type": "Premise",
                "starts": "1773",
                "ends": "1898",
                "segment": "Ως ένδειξη καλής θέλησης, τα πλουσιότερα έθνη μπορούν να παρέχουν χρηματοοικονομικές υπηρεσίες σε φτωχότερες χώρες για να ενθαρρύνουν τις συναλλαγές."
            }
        ],
        "Relations": [
            {
                "id": "R1",
                "type": "supports",
                "arg1": "T7",
                "arg2": "T4"
            },
            {
                "id": "R2",
                "type": "supports",
                "arg1": "T6",
                "arg2": "T4"
            },
            {
                "id": "R3",
                "type": "supports",
                "arg1": "T5",
                "arg2": "T4"
            },
            {
                "id": "R4",
                "type": "supports",
                "arg1": "T10",
                "arg2": "T8"
            },
            {
                "id": "R5",
                "type": "supports",
                "arg1": "T11",
                "arg2": "T9"
            },
            {
                "id": "R6",
                "type": "supports",
                "arg1": "T13",
                "arg2": "T12"
            },
            {
                "id": "R7",
                "type": "supports",
                "arg1": "T14",
                "arg2": "T12"
            },
            {
                "id": "R8",
                "type": "supports",
                "arg1": "T15",
                "arg2": "T12"
            },
            {
                "id": "R9",
                "type": "supports",
                "arg1": "T16",
                "arg2": "T12"
            }
        ]
    },
    "content": "Τα πλουσιότερα έθνη πρέπει να βοηθήσουν τα φτωχότερα έθνη στην υγεία, την εκπαίδευση και το εμπόριο Οι βελτιώσεις στην υγεία, την εκπαίδευση και το εμπόριο είναι απαραίτητες για την ανάπτυξη των φτωχότερων εθνών. Τα φτωχότερα έθνη χρειάζονται βοήθεια από πλουσιότερα έθνη σε αυτούς τους τομείς για να αναπτύξουν τις χώρες τους. Πρώτον, στον τομέα της υγείας, τα φτωχότερα έθνη έχουν συνήθως λιγότερη ποσότητα γιατρών και νοσοκόμων σε σύγκριση με τα πλουσιότερα έθνη. Ο υψηλός πληθυσμός στις φτωχότερες χώρες λόγω της έλλειψης οικογενειακού προγραμματισμού προκάλεσε την ανισορροπία του ποσοστού των γιατρών με την ποσότητα των κατοίκων. Επιπλέον, τα φτωχότερα έθνη έχουν έλλειψη νοσοκομείων για να ικανοποιήσουν τη ζήτηση των ασθενών. Για την επίλυση αυτών των ζητημάτων, τα πλουσιότερα έθνη μπορούν να συνεισφέρουν αναθέτοντας γιατρούς και νοσηλευτές σε αυτά τα έθνη εξουσίας καθώς και δωρίζοντας χρήματα για την κατασκευή νοσοκομείων. Δεύτερον, στον τομέα της εκπαίδευσης, είναι γενικά αποδεκτό ότι οι φτωχότερες χώρες συχνά στερούνται καθηγητών στα σχολεία, καθώς και καθηγητές σε ιδρύματα τριτοβάθμιας εκπαίδευσης. Εκτός αυτού, η εκπαίδευση για αυτές τις χώρες κανονικά δεν είναι δωρεάν, έτσι μόνο μια συγκεκριμένη ομάδα μαθητών μπορεί να την αντέξει. Προκειμένου να επιλυθεί το πρόβλημα του ανθρώπινου δυναμικού, οι πλουσιότερες χώρες μπορούν να διαθέσουν έμπειρους εκπαιδευτικούς για να εκπαιδεύσουν περισσότερους εκπαιδευτικούς και καθηγητές σε φτωχότερες χώρες. Εν τω μεταξύ, για την έκδοση της αμοιβής εκπαίδευσης, οι πλουσιότερες χώρες θα πρέπει να προσφέρουν υποτροφίες και δάνειο στους ειδικευμένους φοιτητές. Τέλος, στον τομέα του εμπορίου, κανείς δεν μπορεί να αρνηθεί ότι οι φτωχότερες χώρες υστερούν έναντι των πλουσιότερων χωρών λόγω έλλειψης χρημάτων. Οι συναλλαγές είναι λιγότερο ενεργές σε φτωχότερες χώρες μπορεί επίσης να οφείλονται σε ελλιπή μεταφορική υποδομή. Για παράδειγμα, οι κάτοικοι στις αγροτικές περιοχές εξακολουθούν να εξαρτώνται από τη δική τους φάρμα για την παραγωγή τροφίμων. Ως ένδειξη καλής θέλησης, τα πλουσιότερα έθνη μπορούν να παρέχουν χρηματοοικονομικές υπηρεσίες σε φτωχότερες χώρες για να ενθαρρύνουν τις συναλλαγές. Ο πρώτος μπορεί επίσης να δώσει συμβουλές σχετικά με τη δημιουργία μιας πλήρους και αποτελεσματικής υποδομής μεταφορών για την υποστήριξη των συναλλαγών. Εν κατακλείδι, τα πλουσιότερα έθνη πρέπει να αναλάβουν περισσότερη ευθύνη για να βοηθήσουν τα φτωχότερα έθνη σε όλα τα θέματα υγείας, εκπαίδευσης και εμπορίου. Οι βελτιώσεις σε αυτούς τους τομείς θα δημιουργήσουν μια καλύτερη ζωή για τους κατοίκους σε φτωχότερα έθνη που μπορούν να χρησιμοποιήσουν για να καλλιεργήσουν την πατρίδα τους."
}