{
    "id": "d4703d4a87faef9cd4eb456f7714ff26",
    "link": "",
    "description": "",
    "date": "",
    "tags": [],
    "publishedAt": "",
    "crawledAt": "",
    "domain": "",
    "netloc": "",
    "annotations": {
        "ADUs": [
            {
                "id": "T1",
                "type": "MajorClaim",
                "starts": "243",
                "ends": "302",
                "segment": "πιστεύουν ότι κανείς άλλος δεν είναι καλύτερος από τους γονείς μας όσον αφορά τους εκπαιδευτικούς."
            },
            {
                "id": "T2",
                "type": "Premise",
                "starts": "602",
                "ends": "730",
                "segment": "Επιπλέον, όταν μεγαλώνουμε, μας διδάσκουν πολλά παραμύθια και πολλά σημαντικά μαθήματα ηθικής που μας επηρεάζουν μέχρι το τέλος της ζωής μας."
            },
            {
                "id": "T3",
                "type": "Premise",
                "starts": "454",
                "ends": "590",
                "segment": "Καθώς γεννηθήκαμε, οι γονείς μας δίδαξαν από τα πολύ μικρά πράγματα όπως το πώς να χαμογελάμε, πώς να περπατάμε στις συνήθεις ρουτίνες όπως το φαγητό."
            },
            {
                "id": "T4",
                "type": "Claim",
                "starts": "391",
                "ends": "452",
                "segment": "Πρώτον, οι γονείς είναι οι δάσκαλοί μας από πολύ νωρίς στη ζωή μας.",
                "stance": [
                    {
                        "id": "A1",
                        "type": "For"
                    }
                ]
            },
            {
                "id": "T5",
                "type": "Claim",
                "starts": "1087",
                "ends": "1139",
                "segment": "ποτέ τι μας έχουν διδάξει οι γονείς μας γιατί το χρησιμοποιούμε καθημερινά.",
                "stance": [
                    {
                        "id": "A3",
                        "type": "For"
                    }
                ]
            },
            {
                "id": "T6",
                "type": "Premise",
                "starts": "1148",
                "ends": "1167",
                "segment": "Για παράδειγμα, πιστεύω ότι δεν θα ξεχάσω ποτέ τι μου είπε οι γονείς μου για το πώς να είμαι ευγνώμων σε άλλους ανθρώπους που με βοηθούν."
            },
            {
                "id": "T7",
                "type": "Premise",
                "starts": "1182",
                "ends": "1288",
                "segment": "ξεχάσω ποτέ τι μου είπε οι γονείς μου για το πώς να είμαι ευγνώμων σε άλλους ανθρώπους που με βοηθούν."
            },
            {
                "id": "T8",
                "type": "Premise",
                "starts": "742",
                "ends": "847",
                "segment": "σχολείο μελετάμε μεγαλύτερα πράγματα για τις επιστήμες και τις γλώσσες, αλλά μετά το σχολείο μαθαίνουμε από τους γονείς μας."
            },
            {
                "id": "T9",
                "type": "Premise",
                "starts": "864",
                "ends": "933",
                "segment": "γνώμη μου, περνάμε τον περισσότερο χρόνο μας στο σπίτι με τις οικογένειές μας παρά στο σχολείο."
            },
            {
                "id": "T10",
                "type": "Premise",
                "starts": "943",
                "ends": "1062",
                "segment": "ότι όταν αφήνουμε το σχολείο, ίσως να ξεχάσουμε τμήματα των μαθημάτων που μαθαίνουμε στο σχολείο αν δεν τα βιώσουμε στη ζωή, αλλά πιστεύω ακράδαντα ότι δεν θα ξεχάσουμε ποτέ τι μας έχουν διδάξει οι γονείς μας γιατί το χρησιμοποιούμε καθημερινά."
            },
            {
                "id": "T11",
                "type": "Claim",
                "starts": "1382",
                "ends": "1573",
                "segment": "Επομένως, ακόμη και όταν μεγαλώνουμε, παντρευόμαστε και μετά έχουμε τις δικές μας οικογένειες με συζύγους και παιδιά, οι γονείς μας παρακολουθούν πάντα και μας βοηθούν να συνειδητοποιήσουμε ποιο είναι σωστό και ποιο είναι λάθος στη ζωή.",
                "stance": [
                    {
                        "id": "A2",
                        "type": "For"
                    }
                ]
            },
            {
                "id": "T12",
                "type": "Premise",
                "starts": "1317",
                "ends": "1369",
                "segment": "γονείς αγαπούν τους γιους ή τις κόρες τους άνευ όρων."
            },
            {
                "id": "T13",
                "type": "Premise",
                "starts": "1589",
                "ends": "1768",
                "segment": "Για παράδειγμα, ο μεγαλύτερος αδερφός μου παντρεύτηκε και έζησε ανεξάρτητα για δύο χρόνια, αλλά όταν αντιμετωπίζει δυσκολίες στη δουλειά ή τη ζωή του, επιστρέφει για να συναντήσει τους γονείς μας και να ζητήσει συμβουλές."
            },
            {
                "id": "T14",
                "type": "MajorClaim",
                "starts": "1807",
                "ends": "1836",
                "segment": "οι γονείς είναι οι καλύτεροι δάσκαλοί μας."
            }
        ],
        "Relations": [
            {
                "id": "R1",
                "type": "supports",
                "arg1": "T3",
                "arg2": "T4"
            },
            {
                "id": "R2",
                "type": "supports",
                "arg1": "T2",
                "arg2": "T4"
            },
            {
                "id": "R3",
                "type": "supports",
                "arg1": "T6",
                "arg2": "T5"
            },
            {
                "id": "R4",
                "type": "supports",
                "arg1": "T7",
                "arg2": "T5"
            },
            {
                "id": "R5",
                "type": "supports",
                "arg1": "T9",
                "arg2": "T5"
            },
            {
                "id": "R6",
                "type": "supports",
                "arg1": "T10",
                "arg2": "T5"
            },
            {
                "id": "R7",
                "type": "supports",
                "arg1": "T8",
                "arg2": "T5"
            },
            {
                "id": "R8",
                "type": "supports",
                "arg1": "T13",
                "arg2": "T11"
            },
            {
                "id": "R9",
                "type": "supports",
                "arg1": "T12",
                "arg2": "T11"
            }
        ]
    },
    "content": "Οι γονείς είναι οι δάσκαλοί μας από πολύ νωρίς στη ζωή μας Η μάθηση είναι κάτι που κάνουμε σε όλη μας τη ζωή. Η απόκτηση των καλύτερων μαθημάτων, εκτός από τις ικανότητές μας για αυτο-μελέτη, εξαρτάται πολύ από τους δασκάλους μας. Υπάρχουν άνθρωποι που πιστεύουν ότι κανείς άλλος δεν είναι καλύτερος από τους γονείς μας όσον αφορά τους εκπαιδευτικούς. Συμφωνώ ολόψυχα με αυτήν την άποψη λόγω αυτών των ακόλουθων λόγων. Πρώτον, οι γονείς είναι οι δάσκαλοί μας από πολύ νωρίς στη ζωή μας. Καθώς γεννηθήκαμε, οι γονείς μας δίδαξαν από τα πολύ μικρά πράγματα όπως το πώς να χαμογελάμε, πώς να περπατάμε στις συνήθεις ρουτίνες όπως το φαγητό. Επιπλέον, όταν μεγαλώνουμε, μας διδάσκουν πολλά παραμύθια και πολλά σημαντικά μαθήματα ηθικής που μας επηρεάζουν μέχρι το τέλος της ζωής μας. Δεύτερον, στο σχολείο μελετάμε μεγαλύτερα πράγματα για τις επιστήμες και τις γλώσσες, αλλά μετά το σχολείο μαθαίνουμε από τους γονείς μας. Κατά τη γνώμη μου, περνάμε τον περισσότερο χρόνο μας στο σπίτι με τις οικογένειές μας παρά στο σχολείο. Νομίζω ότι όταν αφήνουμε το σχολείο, ίσως να ξεχάσουμε τμήματα των μαθημάτων που μαθαίνουμε στο σχολείο αν δεν τα βιώσουμε στη ζωή, αλλά πιστεύω ακράδαντα ότι δεν θα ξεχάσουμε ποτέ τι μας έχουν διδάξει οι γονείς μας γιατί το χρησιμοποιούμε καθημερινά. Για παράδειγμα, πιστεύω ότι δεν θα ξεχάσω ποτέ τι μου είπε οι γονείς μου για το πώς να είμαι ευγνώμων σε άλλους ανθρώπους που με βοηθούν. Τρίτον, πιστεύω απόλυτα ότι οι γονείς αγαπούν τους γιους ή τις κόρες τους άνευ όρων. Επομένως, ακόμη και όταν μεγαλώνουμε, παντρευόμαστε και μετά έχουμε τις δικές μας οικογένειες με συζύγους και παιδιά, οι γονείς μας παρακολουθούν πάντα και μας βοηθούν να συνειδητοποιήσουμε ποιο είναι σωστό και ποιο είναι λάθος στη ζωή. Για παράδειγμα, ο μεγαλύτερος αδερφός μου παντρεύτηκε και έζησε ανεξάρτητα για δύο χρόνια, αλλά όταν αντιμετωπίζει δυσκολίες στη δουλειά ή τη ζωή του, επιστρέφει για να συναντήσει τους γονείς μας και να ζητήσει συμβουλές. Εν κατακλείδι, πιστεύω ακράδαντα ότι οι γονείς είναι οι καλύτεροι δάσκαλοί μας."
}