{
    "id": "e58acbd545906a2f5d535b8eae1075a7",
    "link": "",
    "description": "",
    "date": "",
    "tags": [],
    "publishedAt": "",
    "crawledAt": "",
    "domain": "",
    "netloc": "",
    "annotations": {
        "ADUs": [
            {
                "id": "T1",
                "type": "Premise",
                "starts": "1406",
                "ends": "1460",
                "segment": "Κατά τη γνώμη μου, θα αποφέρει περισσότερα αρνητικά αποτελέσματα από θετικά."
            },
            {
                "id": "T2",
                "type": "MajorClaim",
                "starts": "1473",
                "ends": "1529",
                "segment": "Γι &#39;αυτό πρέπει να διατίθεται για ένα ευρύ φάσμα μαθητών."
            },
            {
                "id": "T3",
                "type": "Claim",
                "starts": "1344",
                "ends": "1389",
                "segment": "Συμπερασματικά, ο πανεπιστημιακός περιορισμός έχει και τα υπέρ και τα κατά.",
                "stance": [
                    {
                        "id": "A2",
                        "type": "Against"
                    }
                ]
            },
            {
                "id": "T4",
                "type": "Premise",
                "starts": "485",
                "ends": "631",
                "segment": "να είμαστε ακριβείς, μια τέτοια αφηρημένη ή περίπλοκη πληροφορική, που απορροφάται εύκολα από αυτούς τους μαθητές, μπορεί να αποδειχθεί ως πίεση για όσους δεν έχουν ισοδύναμες δεξιότητες."
            },
            {
                "id": "T5",
                "type": "Premise",
                "starts": "664",
                "ends": "693",
                "segment": "αυτού, είναι αναμφισβήτητο ότι αξίζει αυτό που έχει κάνει."
            },
            {
                "id": "T6",
                "type": "Claim",
                "starts": "375",
                "ends": "468",
                "segment": "&#39;αρχάς, οι εξαιρετικοί ακαδημαϊκοί φοιτητές είναι επιλέξιμοι για πανεπιστήμιο λόγω του πνευματικού τους πλεονεκτήματος.",
                "stance": [
                    {
                        "id": "A1",
                        "type": "For"
                    }
                ]
            },
            {
                "id": "T7",
                "type": "Premise",
                "starts": "695",
                "ends": "779",
                "segment": "Το πανεπιστήμιο είναι σαν ένα δώρο που παρουσιάζεται σε όσους έχουν φτάσει σε μεγάλο βαθμό για να το επιτύχουν."
            },
            {
                "id": "T8",
                "type": "Claim",
                "starts": "916",
                "ends": "1041",
                "segment": "Ως εκ τούτου, πρέπει να αρπάξει για την πλειονότητα των νέων, που επιθυμούν να συνεχίσουν το πάθος τους και να αναπτύξουν συνολικά.",
                "stance": [
                    {
                        "id": "A3",
                        "type": "For"
                    }
                ]
            },
            {
                "id": "T9",
                "type": "Premise",
                "starts": "790",
                "ends": "903",
                "segment": "Ωστόσο, το πανεπιστήμιο δεν αφορά μόνο ακαδημαϊκές σπουδές, αλλά και ένα μέρος για την καλλιέργεια καλλιτεχνικών ταλέντων και την ανάπτυξη μαλακών δεξιοτήτων."
            },
            {
                "id": "T10",
                "type": "Claim",
                "starts": "1058",
                "ends": "1160",
                "segment": "Επιπλέον, υπάρχει μια τάση να αυξάνονται οι κοινωνικές κακίες εάν το πανεπιστήμιο περιορίζεται μόνο στους καλύτερους ανθρώπους.",
                "stance": [
                    {
                        "id": "A4",
                        "type": "For"
                    }
                ]
            },
            {
                "id": "T11",
                "type": "Premise",
                "starts": "1162",
                "ends": "1327",
                "segment": "Εκτός από τα απογοητευμένα, πολλές από τις απαραίτητες προετοιμασίες είναι πιθανό να είναι συνταγές για αποτυχία κατά την υποβολή αιτήσεων για εργασία, κυρίως οι λευκές γιακά."
            }
        ],
        "Relations": [
            {
                "id": "R1",
                "type": "attacks",
                "arg1": "T1",
                "arg2": "T3"
            },
            {
                "id": "R2",
                "type": "supports",
                "arg1": "T4",
                "arg2": "T6"
            },
            {
                "id": "R3",
                "type": "supports",
                "arg1": "T5",
                "arg2": "T6"
            },
            {
                "id": "R4",
                "type": "supports",
                "arg1": "T7",
                "arg2": "T6"
            },
            {
                "id": "R5",
                "type": "supports",
                "arg1": "T9",
                "arg2": "T8"
            },
            {
                "id": "R6",
                "type": "supports",
                "arg1": "T11",
                "arg2": "T10"
            }
        ]
    },
    "content": "Περιορισμός πανεπιστημιακής εκπαίδευσης Το Πανεπιστήμιο είναι μια είσοδος στη ζωή. Μας εξοπλίζει με ένα πακέτο σοφίας και αρετής για να πετύχουμε. Είναι η σπουδαιότητα του πανεπιστημίου που θέτει ένα ερώτημα εάν φοιτητές με την καλύτερη σχολική απόδοση αξίζουν πανεπιστημιακές σπουδές ή οποιοδήποτε νέο ευσεβές άτομο. Και οι δύο πλευρές πρέπει να συζητηθούν πριν καταλήξει σε ένα συμπέρασμα. Κατ &#39;αρχάς, οι εξαιρετικοί ακαδημαϊκοί φοιτητές είναι επιλέξιμοι για πανεπιστήμιο λόγω του πνευματικού τους πλεονεκτήματος. Για να είμαστε ακριβείς, μια τέτοια αφηρημένη ή περίπλοκη πληροφορική, που απορροφάται εύκολα από αυτούς τους μαθητές, μπορεί να αποδειχθεί ως πίεση για όσους δεν έχουν ισοδύναμες δεξιότητες. Εκτός αυτού, είναι αναμφισβήτητο ότι αξίζει αυτό που έχει κάνει. Το πανεπιστήμιο είναι σαν ένα δώρο που παρουσιάζεται σε όσους έχουν φτάσει σε μεγάλο βαθμό για να το επιτύχουν. Ωστόσο, το πανεπιστήμιο δεν αφορά μόνο ακαδημαϊκές σπουδές, αλλά και ένα μέρος για την καλλιέργεια καλλιτεχνικών ταλέντων και την ανάπτυξη μαλακών δεξιοτήτων. Ως εκ τούτου, πρέπει να αρπάξει για την πλειονότητα των νέων, που επιθυμούν να συνεχίσουν το πάθος τους και να αναπτύξουν συνολικά. Επιπλέον, υπάρχει μια τάση να αυξάνονται οι κοινωνικές κακίες εάν το πανεπιστήμιο περιορίζεται μόνο στους καλύτερους ανθρώπους. Εκτός από τα απογοητευμένα, πολλές από τις απαραίτητες προετοιμασίες είναι πιθανό να είναι συνταγές για αποτυχία κατά την υποβολή αιτήσεων για εργασία, κυρίως οι λευκές γιακά. Συμπερασματικά, ο πανεπιστημιακός περιορισμός έχει και τα υπέρ και τα κατά. Κατά τη γνώμη μου, θα αποφέρει περισσότερα αρνητικά αποτελέσματα από θετικά. Γι &#39;αυτό πρέπει να διατίθεται για ένα ευρύ φάσμα μαθητών."
}