{
    "id": "16e3cca26ca194513f5b08768233f966",
    "link": "",
    "description": "",
    "date": "",
    "tags": [],
    "publishedAt": "",
    "crawledAt": "",
    "domain": "",
    "netloc": "",
    "annotations": {
        "ADUs": [
            {
                "id": "T1",
                "type": "MajorClaim",
                "starts": "1961",
                "ends": "2063",
                "segment": "επιφάνεια κάνει τη μεταφορά και την κίνηση να γίνει ασφαλέστερη και ευκολότερη."
            },
            {
                "id": "T2",
                "type": "MajorClaim",
                "starts": "250",
                "ends": "326",
                "segment": "Από την άποψή μου, η πιο δυνατή λύση σε αυτά τα προβλήματα είναι η βελτίωση των δρόμων και των αυτοκινητοδρόμων για τρεις κρίσιμους λόγους."
            },
            {
                "id": "T3",
                "type": "Claim",
                "starts": "381",
                "ends": "479",
                "segment": "Πρώτα απ &#39;όλα, όλοι γνωρίζουμε ότι η αναβάθμιση των δημόσιων συγκοινωνιών σίγουρα θα επιδεινώσει τη ρύπανση και τα ατυχήματα.",
                "stance": [
                    {
                        "id": "A1",
                        "type": "For"
                    }
                ]
            },
            {
                "id": "T4",
                "type": "Claim",
                "starts": "987",
                "ends": "1084",
                "segment": "Δεύτερον, η επένδυση σε δρόμους και αυτοκινητόδρομους μπορεί να διευρύνει την περιοχή και να επιτρέψει τη λειτουργία περισσότερων δημόσιων συγκοινωνιών.",
                "stance": [
                    {
                        "id": "A2",
                        "type": "For"
                    }
                ]
            },
            {
                "id": "T5",
                "type": "Premise",
                "starts": "481",
                "ends": "606",
                "segment": "Τα λεωφορεία, τα αυτοκίνητα και τα τρένα εκπέμπουν τακτικά ένα επιβλαβές αέριο που προκαλεί πολλές θανατηφόρες ασθένειες όπως ο καρκίνος του πνεύμονα και η πνευμονία."
            },
            {
                "id": "T6",
                "type": "Premise",
                "starts": "618",
                "ends": "676",
                "segment": "προκαλεί πολλές θανατηφόρες ασθένειες όπως ο καρκίνος του πνεύμονα και η πνευμονία."
            },
            {
                "id": "T7",
                "type": "Premise",
                "starts": "696",
                "ends": "743",
                "segment": "Επιπλέον, ο ήχος που προέρχεται από τους κινητήρες μπορεί να επιδεινώσει την ακοή μας."
            },
            {
                "id": "T8",
                "type": "Premise",
                "starts": "758",
                "ends": "835",
                "segment": "Το πιο σημαντικό, υπάρχουν πολλά ατυχήματα στους δρόμους."
            },
            {
                "id": "T9",
                "type": "Premise",
                "starts": "848",
                "ends": "975",
                "segment": "Κάθε χρόνο, το Βιετνάμ πεθαίνει περίπου δώδεκα χιλιάδες άτομα από ατυχήματα που ισοδυναμούν με τον αριθμό των νεκρών του τσουνάμι στην Ιαπωνία."
            },
            {
                "id": "T10",
                "type": "Premise",
                "starts": "1086",
                "ends": "1162",
                "segment": "δρόμους και αυτοκινητόδρομους μπορεί να διευρύνει την περιοχή και να επιτρέψει τη λειτουργία περισσότερων δημόσιων συγκοινωνιών."
            },
            {
                "id": "T11",
                "type": "Premise",
                "starts": "1178",
                "ends": "1270",
                "segment": "Όχι μόνο τα λεωφορεία αλλά και άλλα προσωπικά οχήματα μπορούν να κινούνται εύκολα στους δρόμους."
            },
            {
                "id": "T12",
                "type": "Premise",
                "starts": "1272",
                "ends": "1361",
                "segment": "φεύγω πάντα από το σχολείο τη στιγμή που όλοι σπεύδουν στους δρόμους και επιστρέφουν βιαστικά στο σπίτι."
            },
            {
                "id": "T13",
                "type": "Premise",
                "starts": "1376",
                "ends": "1473",
                "segment": "Αντίθετα, εάν οι δρόμοι είναι μεγεθυνμένοι, όλοι μπορούν να πάνε σπίτι τους σε σύντομο χρονικό διάστημα και σχεδόν καθόλου συγκρούσεις."
            },
            {
                "id": "T14",
                "type": "Claim",
                "starts": "1496",
                "ends": "1565",
                "segment": "πάνε σπίτι τους σε σύντομο χρονικό διάστημα και σχεδόν καθόλου συγκρούσεις.",
                "stance": [
                    {
                        "id": "A3",
                        "type": "For"
                    }
                ]
            },
            {
                "id": "T15",
                "type": "Premise",
                "starts": "1567",
                "ends": "1639",
                "segment": "Τέλος, οι δαπάνες για την ανακαίνιση των αυτοκινητοδρόμων και των δρόμων μπορούν να βελτιώσουν την ποιότητα."
            },
            {
                "id": "T16",
                "type": "Premise",
                "starts": "1641",
                "ends": "1732",
                "segment": "Όλοι μας φοβόμαστε να κινηθούμε στους σκληρούς δρόμους με πολλές παραφωτίδες."
            },
            {
                "id": "T17",
                "type": "Premise",
                "starts": "1734",
                "ends": "1787",
                "segment": "κακές συνθήκες έχουν ως αποτέλεσμα πολλά τρομερά ατυχήματα και κάνουν πολλούς ανθρώπους να αισθάνονται ανήσυχοι."
            },
            {
                "id": "T18",
                "type": "Premise",
                "starts": "1796",
                "ends": "1851",
                "segment": "Δεν πρέπει να κατηγορούμε τους οδηγούς ότι προκαλούν ατυχήματα επειδή ένα μέρος της ευθύνης ανήκει στις αρχές."
            },
            {
                "id": "T19",
                "type": "Premise",
                "starts": "1853",
                "ends": "1944",
                "segment": "τους οδηγούς ότι προκαλούν ατυχήματα επειδή ένα μέρος της ευθύνης ανήκει στις αρχές."
            }
        ],
        "Relations": [
            {
                "id": "R1",
                "type": "supports",
                "arg1": "T8",
                "arg2": "T7"
            },
            {
                "id": "R2",
                "type": "supports",
                "arg1": "T9",
                "arg2": "T7"
            },
            {
                "id": "R3",
                "type": "supports",
                "arg1": "T6",
                "arg2": "T3"
            },
            {
                "id": "R4",
                "type": "supports",
                "arg1": "T5",
                "arg2": "T3"
            },
            {
                "id": "R5",
                "type": "supports",
                "arg1": "T7",
                "arg2": "T3"
            },
            {
                "id": "R6",
                "type": "supports",
                "arg1": "T10",
                "arg2": "T4"
            },
            {
                "id": "R7",
                "type": "supports",
                "arg1": "T11",
                "arg2": "T4"
            },
            {
                "id": "R8",
                "type": "supports",
                "arg1": "T12",
                "arg2": "T4"
            },
            {
                "id": "R9",
                "type": "supports",
                "arg1": "T13",
                "arg2": "T4"
            },
            {
                "id": "R10",
                "type": "supports",
                "arg1": "T18",
                "arg2": "T17"
            },
            {
                "id": "R11",
                "type": "supports",
                "arg1": "T15",
                "arg2": "T14"
            },
            {
                "id": "R12",
                "type": "supports",
                "arg1": "T16",
                "arg2": "T14"
            },
            {
                "id": "R13",
                "type": "supports",
                "arg1": "T17",
                "arg2": "T14"
            },
            {
                "id": "R14",
                "type": "supports",
                "arg1": "T19",
                "arg2": "T14"
            }
        ]
    },
    "content": "Η κυβέρνηση πρέπει να θεωρήσει την επένδυση στην κατασκευή δρόμων ως την πιο σημαντική. Η έκρηξη του πληθυσμού έχει ως αποτέλεσμα τις υψηλές απαιτήσεις μεταφοράς. Πολλές χώρες υποφέρουν από ρύπανση, θόρυβο και θύματα για πολύ καιρό. Από την άποψή μου, η πιο δυνατή λύση σε αυτά τα προβλήματα είναι η βελτίωση των δρόμων και των αυτοκινητοδρόμων για τρεις κρίσιμους λόγους. Πρώτα απ &#39;όλα, όλοι γνωρίζουμε ότι η αναβάθμιση των δημόσιων συγκοινωνιών σίγουρα θα επιδεινώσει τη ρύπανση και τα ατυχήματα. Τα λεωφορεία, τα αυτοκίνητα και τα τρένα εκπέμπουν τακτικά ένα επιβλαβές αέριο που προκαλεί πολλές θανατηφόρες ασθένειες όπως ο καρκίνος του πνεύμονα και η πνευμονία. Επιπλέον, ο ήχος που προέρχεται από τους κινητήρες μπορεί να επιδεινώσει την ακοή μας. Το πιο σημαντικό, υπάρχουν πολλά ατυχήματα στους δρόμους. Για παράδειγμα, στη χώρα μου, τα λεωφορεία οφείλονται στην αιτία της ανόδου των ατυχημάτων. Κάθε χρόνο, το Βιετνάμ πεθαίνει περίπου δώδεκα χιλιάδες άτομα από ατυχήματα που ισοδυναμούν με τον αριθμό των νεκρών του τσουνάμι στην Ιαπωνία. Δεύτερον, η επένδυση σε δρόμους και αυτοκινητόδρομους μπορεί να διευρύνει την περιοχή και να επιτρέψει τη λειτουργία περισσότερων δημόσιων συγκοινωνιών. Όχι μόνο τα λεωφορεία αλλά και άλλα προσωπικά οχήματα μπορούν να κινούνται εύκολα στους δρόμους. Για παράδειγμα, φεύγω πάντα από το σχολείο τη στιγμή που όλοι σπεύδουν στους δρόμους και επιστρέφουν βιαστικά στο σπίτι. Είναι εξαιρετικά ενοχλητικό για μένα να ξεφύγω από το πλήθος στους δρόμους σε μία μόνο ώρα. Αντίθετα, εάν οι δρόμοι είναι μεγεθυνμένοι, όλοι μπορούν να πάνε σπίτι τους σε σύντομο χρονικό διάστημα και σχεδόν καθόλου συγκρούσεις. Τέλος, οι δαπάνες για την ανακαίνιση των αυτοκινητοδρόμων και των δρόμων μπορούν να βελτιώσουν την ποιότητα. Όλοι μας φοβόμαστε να κινηθούμε στους σκληρούς δρόμους με πολλές παραφωτίδες. Αυτές οι κακές συνθήκες έχουν ως αποτέλεσμα πολλά τρομερά ατυχήματα και κάνουν πολλούς ανθρώπους να αισθάνονται ανήσυχοι. Δεν πρέπει να κατηγορούμε τους οδηγούς ότι προκαλούν ατυχήματα επειδή ένα μέρος της ευθύνης ανήκει στις αρχές. Επιπλέον, μια λεία επιφάνεια κάνει τη μεταφορά και την κίνηση να γίνει ασφαλέστερη και ευκολότερη. Με λίγα λόγια, τα πλεονεκτήματα της αναβάθμισης των δρόμων που ανέφερα παραπάνω είναι απολύτως πειστικά και απαραίτητα. Συνήθως τείνω σε αυτήν την ιδέα και ελπίζω ότι η κυβέρνηση θα θεωρήσει την επένδυση στην κατασκευή δρόμων ως το πιο σημαντικό πράγμα."
}