{
    "id": "8030ecf5e9a6eea4431fd9a97d0d1c07",
    "link": "",
    "description": "",
    "date": "",
    "tags": [],
    "publishedAt": "",
    "crawledAt": "",
    "domain": "",
    "netloc": "",
    "annotations": {
        "ADUs": [
            {
                "id": "T1",
                "type": "MajorClaim",
                "starts": "206",
                "ends": "279",
                "segment": "Κατά τη γνώμη μου, πρέπει να βοηθήσουμε τα ζώα να ζουν με ασφάλεια και άνεση στο δικό τους περιβάλλον."
            },
            {
                "id": "T2",
                "type": "MajorClaim",
                "starts": "1347",
                "ends": "1422",
                "segment": "Συμπερασματικά, πιστεύω ακράδαντα ότι πρέπει να βοηθήσουμε τα ζώα και να τους προσφέρουμε την καλύτερη δυνατή ποιότητα ζωής."
            },
            {
                "id": "T3",
                "type": "Claim",
                "starts": "1424",
                "ends": "1491",
                "segment": "Επιστημονικά στοιχεία έδειξαν τη ζημία που μπορούν να προκαλέσουν ζωολογικοί κήποι στα ζώα.",
                "stance": [
                    {
                        "id": "A1",
                        "type": "For"
                    }
                ]
            },
            {
                "id": "T4",
                "type": "Claim",
                "starts": "1503",
                "ends": "1564",
                "segment": "Επιπλέον, πολλοί ζωολογικοί κήποι δεν πληρούν τα πρότυπα φροντίδας που απαιτούνται για αυτούς.",
                "stance": [
                    {
                        "id": "A2",
                        "type": "For"
                    }
                ]
            },
            {
                "id": "T5",
                "type": "Claim",
                "starts": "281",
                "ends": "365",
                "segment": "τα ζώα να ζουν με ασφάλεια και άνεση στο δικό τους περιβάλλον.",
                "stance": [
                    {
                        "id": "A3",
                        "type": "For"
                    }
                ]
            },
            {
                "id": "T6",
                "type": "Premise",
                "starts": "376",
                "ends": "457",
                "segment": "μελέτες έχουν αποκαλύψει τη ζημία που προκαλούν οι ζωολογικοί κήποι στα ζώα."
            },
            {
                "id": "T7",
                "type": "Premise",
                "starts": "524",
                "ends": "661",
                "segment": "Δεξιότητες που τους βοηθούν να ζήσουν και να επιβιώσουν στις περιοχές διαμονής τους."
            },
            {
                "id": "T8",
                "type": "Premise",
                "starts": "670",
                "ends": "805",
                "segment": "Ως εκ τούτου, όταν απελευθερώνονται ή στη χειρότερη περίπτωση, όταν δραπετεύουν, ενεργούν αποπροσανατολισμένα και αυτό συμβάλλει στο ποσοστό θνησιμότητας των ζώων."
            },
            {
                "id": "T9",
                "type": "Claim",
                "starts": "843",
                "ends": "940",
                "segment": "Εκτός από το προηγούμενο σημείο, διάφοροι ζωολογικοί κήποι δεν έχουν τα κατάλληλα εργαλεία ή πολιτικές που διασφαλίζουν την ποιότητα της φροντίδας των ζώων.",
                "stance": [
                    {
                        "id": "A4",
                        "type": "For"
                    }
                ]
            },
            {
                "id": "T10",
                "type": "Premise",
                "starts": "1003",
                "ends": "1058",
                "segment": "Για παράδειγμα, θυμάμαι το πρώτο μου ταξίδι σε ζωολογικό κήπο, σε ηλικία οκτώ ετών."
            },
            {
                "id": "T11",
                "type": "Premise",
                "starts": "1060",
                "ends": "1166",
                "segment": "Με συγκλόνισε η σκληρότητα που αντιμετώπιζαν τα ζώα."
            },
            {
                "id": "T12",
                "type": "Premise",
                "starts": "1168",
                "ends": "1185",
                "segment": "είχε κακή συμπεριφορά απέναντι στα ζώα του ζωολογικού κήπου."
            },
            {
                "id": "T13",
                "type": "Premise",
                "starts": "1194",
                "ends": "1306",
                "segment": "Τους χτύπησαν επειδή δεν ήθελαν να φάνε τα γεύματά τους και στη συνέχεια συγχωρήθηκαν λέγοντας ότι ήταν ένας τρόπος να εκπαιδεύονται τα ζώα."
            }
        ],
        "Relations": [
            {
                "id": "R1",
                "type": "supports",
                "arg1": "T7",
                "arg2": "T8"
            },
            {
                "id": "R2",
                "type": "supports",
                "arg1": "T6",
                "arg2": "T5"
            },
            {
                "id": "R3",
                "type": "supports",
                "arg1": "T8",
                "arg2": "T5"
            },
            {
                "id": "R4",
                "type": "supports",
                "arg1": "T10",
                "arg2": "T9"
            },
            {
                "id": "R5",
                "type": "supports",
                "arg1": "T11",
                "arg2": "T9"
            },
            {
                "id": "R6",
                "type": "supports",
                "arg1": "T12",
                "arg2": "T9"
            },
            {
                "id": "R7",
                "type": "supports",
                "arg1": "T13",
                "arg2": "T12"
            }
        ]
    },
    "content": "Πρέπει τα ζώα να είναι ελεύθερα ή να ζουν σε ζωολογικούς κήπους; Πολλοί άνθρωποι δηλώνουν ότι οι ζωολογικοί κήποι είναι ένα μεγάλο πλεονέκτημα για τα ζώα. Άλλοι πιστεύουν ότι είναι κατώτερα πλάσματα και επομένως δεν αξίζουν την προσοχή μας. Κατά τη γνώμη μου, πρέπει να βοηθήσουμε τα ζώα να ζουν με ασφάλεια και άνεση στο δικό τους περιβάλλον. Πολλές επιστημονικές μελέτες έχουν αποκαλύψει τη ζημία που προκαλούν οι ζωολογικοί κήποι στα ζώα. Πρώτον, όπως εμείς, τα ανθρώπινα όντα, τα ζώα παραδίδονται σε αυτόν τον κόσμο με γενετικά ένστικτα. Δεξιότητες που τους βοηθούν να ζήσουν και να επιβιώσουν στις περιοχές διαμονής τους. Όταν γοητεύουμε τα ζώα και τα θέτουμε να ζήσουν έναν τρόπο ζωής με τον οποίο δεν είναι εξοικειωμένοι, αρχίζουν να χάνουν αυτά τα γεννημένα ένστικτα. Ως εκ τούτου, όταν απελευθερώνονται ή στη χειρότερη περίπτωση, όταν δραπετεύουν, ενεργούν αποπροσανατολισμένα και αυτό συμβάλλει στο ποσοστό θνησιμότητας των ζώων. Εκτός από το προηγούμενο σημείο, διάφοροι ζωολογικοί κήποι δεν έχουν τα κατάλληλα εργαλεία ή πολιτικές που διασφαλίζουν την ποιότητα της φροντίδας των ζώων. Για παράδειγμα, θυμάμαι το πρώτο μου ταξίδι σε ζωολογικό κήπο, σε ηλικία οκτώ ετών. Με συγκλόνισε η σκληρότητα που αντιμετώπιζαν τα ζώα. Δεν μπορώ να σκεφτώ κανέναν υπάλληλο που δεν είχε κακή συμπεριφορά απέναντι στα ζώα του ζωολογικού κήπου. Τους χτύπησαν επειδή δεν ήθελαν να φάνε τα γεύματά τους και στη συνέχεια συγχωρήθηκαν λέγοντας ότι ήταν ένας τρόπος να εκπαιδεύονται τα ζώα. Συμπερασματικά, πιστεύω ακράδαντα ότι πρέπει να βοηθήσουμε τα ζώα και να τους προσφέρουμε την καλύτερη δυνατή ποιότητα ζωής. Επιστημονικά στοιχεία έδειξαν τη ζημία που μπορούν να προκαλέσουν ζωολογικοί κήποι στα ζώα. Επιπλέον, πολλοί ζωολογικοί κήποι δεν πληρούν τα πρότυπα φροντίδας που απαιτούνται για αυτούς."
}