{
    "id": "65deece49d8a0e10c43687cda45bffb3",
    "link": "",
    "description": "",
    "date": "",
    "tags": [],
    "publishedAt": "",
    "crawledAt": "",
    "domain": "",
    "netloc": "",
    "annotations": {
        "ADUs": [
            {
                "id": "T1",
                "type": "MajorClaim",
                "starts": "63",
                "ends": "127",
                "segment": "παραδοσιακό σχολείο Δεν νομίζω ότι η τεχνολογία μπορεί να αντικαταστήσει τους δασκάλους και την τάξη."
            },
            {
                "id": "T2",
                "type": "MajorClaim",
                "starts": "1832",
                "ends": "1883",
                "segment": "Η μόνη μελέτη στο σπίτι μπορεί να μας στερήσει αυτές τις σημαντικές και πολύτιμες ευκαιρίες."
            },
            {
                "id": "T3",
                "type": "Claim",
                "starts": "151",
                "ends": "201",
                "segment": "Εδώ είναι οι λόγοι μου.",
                "stance": [
                    {
                        "id": "A1",
                        "type": "Against"
                    }
                ]
            },
            {
                "id": "T4",
                "type": "Premise",
                "starts": "203",
                "ends": "291",
                "segment": "Το μεγαλύτερο πλεονέκτημα είναι ότι η τάξη και ο εκπαιδευτής σας είναι διαθέσιμοι 24 ώρες την ημέρα."
            },
            {
                "id": "T5",
                "type": "Premise",
                "starts": "306",
                "ends": "384",
                "segment": "Επιπλέον, θα μπορούσατε να φτιάξετε το δικό σας πρόγραμμα για την ολοκλήρωση των απαιτήσεων του μαθήματος."
            },
            {
                "id": "T6",
                "type": "Premise",
                "starts": "386",
                "ends": "417",
                "segment": "το δικό σας πρόγραμμα για την ολοκλήρωση των απαιτήσεων του μαθήματος."
            },
            {
                "id": "T7",
                "type": "Premise",
                "starts": "428",
                "ends": "552",
                "segment": "Μπορείτε να μελετήσετε όποτε θέλετε."
            },
            {
                "id": "T8",
                "type": "Premise",
                "starts": "908",
                "ends": "988",
                "segment": "Δυστυχώς, μπορεί να είναι ένα πρόβλημα όταν αντιμετωπίζετε κάποια προβλήματα στη μάθηση χωρίς καμία βοήθεια."
            },
            {
                "id": "T9",
                "type": "Premise",
                "starts": "561",
                "ends": "632",
                "segment": "είναι πολύ δύσκολο να ολοκληρώσετε ένα μάθημα στο σπίτι."
            },
            {
                "id": "T10",
                "type": "Premise",
                "starts": "645",
                "ends": "784",
                "segment": "Ειδικά όταν δεν έχετε εκπαιδευτή εκεί για να σας καθοδηγήσει, εναπόκειται σε εσάς να βεβαιωθείτε ότι κατανοείτε και ολοκληρώνετε όλες τις απαιτήσεις του μαθήματος."
            },
            {
                "id": "T11",
                "type": "Claim",
                "starts": "786",
                "ends": "891",
                "segment": "Οι μαθητές μπορεί να εγείρουν ερωτήσεις και μπορεί να έχουν προβλήματα κατανόησης συγκεκριμένων θεμάτων ή θεμάτων.",
                "stance": [
                    {
                        "id": "A3",
                        "type": "For"
                    }
                ]
            },
            {
                "id": "T12",
                "type": "Claim",
                "starts": "1207",
                "ends": "1286",
                "segment": "Οι μαθητές μπορεί να θεωρήσουν ότι είναι δύσκολο να μελετήσουν χωρίς να τεθούν υπό την επίβλεψη.",
                "stance": [
                    {
                        "id": "A2",
                        "type": "For"
                    }
                ]
            },
            {
                "id": "T13",
                "type": "Premise",
                "starts": "1288",
                "ends": "1383",
                "segment": "Εάν είστε ο τύπος που αποσπάται εύκολα, ένα πρόγραμμα εξ αποστάσεως εκπαίδευσης μπορεί να μην είναι κατάλληλο για εσάς."
            },
            {
                "id": "T14",
                "type": "Premise",
                "starts": "999",
                "ends": "1059",
                "segment": "Δεύτερον, η μελέτη στο σπίτι είναι πολύ διαφορετική από την παραδοσιακή μάθηση."
            },
            {
                "id": "T15",
                "type": "Premise",
                "starts": "1061",
                "ends": "1205",
                "segment": "Σε αντίθεση με τις παραδοσιακές τάξεις, τα μαθήματα εξ αποστάσεως εκπαίδευσης δεν πραγματοποιούνται σε μια τάξη, όπου περιβάλλετε τους δασκάλους και τους συμμαθητές σας."
            },
            {
                "id": "T16",
                "type": "Claim",
                "starts": "1398",
                "ends": "1499",
                "segment": "αποσπάται εύκολα, ένα πρόγραμμα εξ αποστάσεως εκπαίδευσης μπορεί να μην είναι κατάλληλο για εσάς.",
                "stance": [
                    {
                        "id": "A4",
                        "type": "For"
                    }
                ]
            },
            {
                "id": "T17",
                "type": "Premise",
                "starts": "1501",
                "ends": "1541",
                "segment": "Επιπλέον, υπάρχει ένα πλεονέκτημα του παραδοσιακού σχολείου - η κοινωνικοποίηση - δημιουργεί σχέση με συμμαθητές."
            },
            {
                "id": "T18",
                "type": "Premise",
                "starts": "1552",
                "ends": "1624",
                "segment": "Μπορούμε να μάθουμε πολλά από προγράμματα στο σπίτι."
            },
            {
                "id": "T19",
                "type": "Premise",
                "starts": "1639",
                "ends": "1704",
                "segment": "οι υπολογιστές ή οι τηλεοράσεις μας δεν μπορούν να μας διδάξουν πώς να συναντηθούμε με τους ανθρώπους."
            },
            {
                "id": "T20",
                "type": "Premise",
                "starts": "1706",
                "ends": "1793",
                "segment": "Για παράδειγμα, οι μαθητές μπορούν να μάθουν πώς να συνεργάζονται με συμμαθητές από την ομαδική εργασία."
            }
        ],
        "Relations": [
            {
                "id": "R1",
                "type": "supports",
                "arg1": "T4",
                "arg2": "T3"
            },
            {
                "id": "R2",
                "type": "supports",
                "arg1": "T5",
                "arg2": "T3"
            },
            {
                "id": "R3",
                "type": "supports",
                "arg1": "T6",
                "arg2": "T3"
            },
            {
                "id": "R4",
                "type": "attacks",
                "arg1": "T7",
                "arg2": "T3"
            },
            {
                "id": "R5",
                "type": "supports",
                "arg1": "T10",
                "arg2": "T11"
            },
            {
                "id": "R6",
                "type": "supports",
                "arg1": "T9",
                "arg2": "T11"
            },
            {
                "id": "R7",
                "type": "supports",
                "arg1": "T8",
                "arg2": "T11"
            },
            {
                "id": "R8",
                "type": "supports",
                "arg1": "T13",
                "arg2": "T12"
            },
            {
                "id": "R9",
                "type": "supports",
                "arg1": "T15",
                "arg2": "T12"
            },
            {
                "id": "R10",
                "type": "supports",
                "arg1": "T14",
                "arg2": "T12"
            },
            {
                "id": "R12",
                "type": "supports",
                "arg1": "T19",
                "arg2": "T16"
            },
            {
                "id": "R13",
                "type": "attacks",
                "arg1": "T17",
                "arg2": "T16"
            },
            {
                "id": "R11",
                "type": "attacks",
                "arg1": "T18",
                "arg2": "T17"
            },
            {
                "id": "R14",
                "type": "supports",
                "arg1": "T20",
                "arg2": "T16"
            }
        ]
    },
    "content": "Σπουδές στο σπίτι χρησιμοποιώντας τεχνολογία / μελέτη ή παραδοσιακό σχολείο Δεν νομίζω ότι η τεχνολογία μπορεί να αντικαταστήσει τους δασκάλους και την τάξη. Εδώ είναι οι λόγοι μου. Η μελέτη στο σπίτι με τη χρήση τεχνολογίας είναι βολική. Το μεγαλύτερο πλεονέκτημα είναι ότι η τάξη και ο εκπαιδευτής σας είναι διαθέσιμοι 24 ώρες την ημέρα. Επιπλέον, θα μπορούσατε να φτιάξετε το δικό σας πρόγραμμα για την ολοκλήρωση των απαιτήσεων του μαθήματος. Μπορείτε να μελετήσετε όποτε θέλετε. Ωστόσο, εάν δεν είστε εξαιρετικά αφοσιωμένοι ή έχετε καλές δεξιότητες διαχείρισης χρόνου, μπορεί να είναι πολύ δύσκολο να ολοκληρώσετε ένα μάθημα στο σπίτι. Πρώτον, η παρακολούθηση μαθημάτων στο σπίτι απαιτεί επιμονή και υπομονή. Ειδικά όταν δεν έχετε εκπαιδευτή εκεί για να σας καθοδηγήσει, εναπόκειται σε εσάς να βεβαιωθείτε ότι κατανοείτε και ολοκληρώνετε όλες τις απαιτήσεις του μαθήματος. Οι μαθητές μπορεί να εγείρουν ερωτήσεις και μπορεί να έχουν προβλήματα κατανόησης συγκεκριμένων θεμάτων ή θεμάτων. Δυστυχώς, μπορεί να είναι ένα πρόβλημα όταν αντιμετωπίζετε κάποια προβλήματα στη μάθηση χωρίς καμία βοήθεια. Δεύτερον, η μελέτη στο σπίτι είναι πολύ διαφορετική από την παραδοσιακή μάθηση. Σε αντίθεση με τις παραδοσιακές τάξεις, τα μαθήματα εξ αποστάσεως εκπαίδευσης δεν πραγματοποιούνται σε μια τάξη, όπου περιβάλλετε τους δασκάλους και τους συμμαθητές σας. Οι μαθητές μπορεί να θεωρήσουν ότι είναι δύσκολο να μελετήσουν χωρίς να τεθούν υπό την επίβλεψη. Εάν είστε ο τύπος που αποσπάται εύκολα, ένα πρόγραμμα εξ αποστάσεως εκπαίδευσης μπορεί να μην είναι κατάλληλο για εσάς. Επιπλέον, υπάρχει ένα πλεονέκτημα του παραδοσιακού σχολείου - η κοινωνικοποίηση - δημιουργεί σχέση με συμμαθητές. Μπορούμε να μάθουμε πολλά από προγράμματα στο σπίτι. Ωστόσο, οι υπολογιστές ή οι τηλεοράσεις μας δεν μπορούν να μας διδάξουν πώς να συναντηθούμε με τους ανθρώπους. Για παράδειγμα, οι μαθητές μπορούν να μάθουν πώς να συνεργάζονται με συμμαθητές από την ομαδική εργασία. Η μόνη μελέτη στο σπίτι μπορεί να μας στερήσει αυτές τις σημαντικές και πολύτιμες ευκαιρίες. Για τους παραπάνω λόγους, συμφωνώ ότι η εξ αποστάσεως εκπαίδευση δεν μπορεί να αντικαταστήσει το παραδοσιακό σχολείο."
}