{
    "id": "bb8e01f0ed11fd36df2a0de2f77486ca",
    "link": "",
    "description": "",
    "date": "",
    "tags": [],
    "publishedAt": "",
    "crawledAt": "",
    "domain": "",
    "netloc": "",
    "annotations": {
        "ADUs": [
            {
                "id": "T1",
                "type": "MajorClaim",
                "starts": "267",
                "ends": "303",
                "segment": "απόλυτα πεπεισμένος ότι αυτοί οι φόροι είναι απολύτως απαραίτητοι."
            },
            {
                "id": "T2",
                "type": "Claim",
                "starts": "314",
                "ends": "435",
                "segment": "Πρώτον, πληρώνοντας φόρους για το δημόσιο σχολείο, οι εύποροι άνθρωποι συμβάλλουν αποτελεσματικά στη μείωση του χάσματος μεταξύ πλουσίων και φτωχών.",
                "stance": [
                    {
                        "id": "A1",
                        "type": "For"
                    }
                ]
            },
            {
                "id": "T3",
                "type": "Premise",
                "starts": "453",
                "ends": "541",
                "segment": "Είναι αλήθεια ότι πολλές φτωχές οικογένειες δεν είναι σε θέση να πληρώσουν δίδακτρα για τα παιδιά τους να παρακολουθήσουν ένα μάθημα."
            },
            {
                "id": "T4",
                "type": "Premise",
                "starts": "543",
                "ends": "729",
                "segment": "Με το φορολογικό ποσό για το οποίο πληρώνουν, οι πλούσιοι μπορούν να βοηθήσουν μεγάλο αριθμό μαθητών από οικογένειες με φτώχεια να συνεχίσουν τις σπουδές τους και να αποκτήσουν καλύτερη ποιότητα ζωής."
            },
            {
                "id": "T5",
                "type": "Premise",
                "starts": "863",
                "ends": "925",
                "segment": "Προφανώς, αυτή η μείωση θα προκαλούσε δυσκολία στον υπολογισμό του φόρου."
            },
            {
                "id": "T6",
                "type": "Premise",
                "starts": "938",
                "ends": "1038",
                "segment": "Ως εκ τούτου, η κυβέρνηση θα πρέπει να προσλάβει μεγαλύτερο εργατικό δυναμικό για να χειριστεί αυτό το περίπλοκο ζήτημα."
            },
            {
                "id": "T7",
                "type": "Premise",
                "starts": "1053",
                "ends": "1237",
                "segment": "Επιπλέον, η κυβέρνηση θα πληρώσει επίσης το μισθό για τους υπερβολικούς υπαλλήλους, και αυτό θα είχε ως αποτέλεσμα ανεπαρκείς επενδύσεις σε άλλους κρίσιμους δημόσιους τομείς όπως η εκπαίδευση ή η υγειονομική περίθαλψη."
            },
            {
                "id": "T8",
                "type": "Claim",
                "starts": "741",
                "ends": "850",
                "segment": "Δεύτερον, η μείωση του φόρου για τους γονείς παιδιών που σπουδάζουν σε ιδιωτικά σχολεία θα οδηγούσε σε σπατάλη δημόσιου κεφαλαίου.",
                "stance": [
                    {
                        "id": "A2",
                        "type": "For"
                    }
                ]
            },
            {
                "id": "T9",
                "type": "MajorClaim",
                "starts": "1662",
                "ends": "1791",
                "segment": "που πληρώνουν για τα κρατικά σχολεία είναι απαραίτητοι για να είναι υποχρεωτικοί για όλα τα μέλη της κοινωνίας, ανεξάρτητα από το πού εγγράφονται τα παιδιά τους."
            },
            {
                "id": "T10",
                "type": "Claim",
                "starts": "1304",
                "ends": "1341",
                "segment": "την ιδέα των εκπτώσεων φόρου ισχυρίζονται ότι τέτοιες πληρωμές φόρου είναι άδικες για αυτούς.",
                "stance": [
                    {
                        "id": "A3",
                        "type": "Against"
                    }
                ]
            },
            {
                "id": "T11",
                "type": "Premise",
                "starts": "1363",
                "ends": "1432",
                "segment": "Επισημαίνουν ότι είναι παράλογο να απαιτείται από αυτούς να πληρώνουν για τους φόρους που δεν χρησιμοποιούν."
            },
            {
                "id": "T12",
                "type": "Premise",
                "starts": "1448",
                "ends": "1561",
                "segment": "Παρ &#39;όλα αυτά, πληρώνουμε επίσης για τις δημόσιες υπηρεσίες που ακόμη και δεν έχουμε την ευκαιρία να εργαστούμε όπως η αστυνομία ή η πυροσβεστική."
            },
            {
                "id": "T13",
                "type": "Premise",
                "starts": "1563",
                "ends": "1628",
                "segment": "Σίγουρα δεν ελπίζουμε για μείωση αυτών των ειδών φόρων."
            }
        ],
        "Relations": [
            {
                "id": "R1",
                "type": "supports",
                "arg1": "T3",
                "arg2": "T2"
            },
            {
                "id": "R2",
                "type": "supports",
                "arg1": "T4",
                "arg2": "T2"
            },
            {
                "id": "R3",
                "type": "supports",
                "arg1": "T5",
                "arg2": "T6"
            },
            {
                "id": "R4",
                "type": "supports",
                "arg1": "T6",
                "arg2": "T8"
            },
            {
                "id": "R5",
                "type": "supports",
                "arg1": "T7",
                "arg2": "T8"
            },
            {
                "id": "R6",
                "type": "supports",
                "arg1": "T11",
                "arg2": "T10"
            },
            {
                "id": "R7",
                "type": "attacks",
                "arg1": "T12",
                "arg2": "T10"
            },
            {
                "id": "R8",
                "type": "attacks",
                "arg1": "T13",
                "arg2": "T10"
            }
        ]
    },
    "content": "Η μείωση του φόρου του κρατικού σχολείου για γονείς που έχουν παιδιά που φοιτούν σε ιδιωτικό σύστημα Μερικοί άνθρωποι που στέλνουν τα παιδιά τους σε ιδιωτικά σχολεία υποστηρίζουν ότι το ποσό των φόρων που πληρώνουν για την κρατική εκπαίδευση είναι παράλογο. Ωστόσο, είμαι απόλυτα πεπεισμένος ότι αυτοί οι φόροι είναι απολύτως απαραίτητοι. Πρώτον, πληρώνοντας φόρους για το δημόσιο σχολείο, οι εύποροι άνθρωποι συμβάλλουν αποτελεσματικά στη μείωση του χάσματος μεταξύ πλουσίων και φτωχών. Είναι αλήθεια ότι πολλές φτωχές οικογένειες δεν είναι σε θέση να πληρώσουν δίδακτρα για τα παιδιά τους να παρακολουθήσουν ένα μάθημα. Με το φορολογικό ποσό για το οποίο πληρώνουν, οι πλούσιοι μπορούν να βοηθήσουν μεγάλο αριθμό μαθητών από οικογένειες με φτώχεια να συνεχίσουν τις σπουδές τους και να αποκτήσουν καλύτερη ποιότητα ζωής. Δεύτερον, η μείωση του φόρου για τους γονείς παιδιών που σπουδάζουν σε ιδιωτικά σχολεία θα οδηγούσε σε σπατάλη δημόσιου κεφαλαίου. Προφανώς, αυτή η μείωση θα προκαλούσε δυσκολία στον υπολογισμό του φόρου. Ως εκ τούτου, η κυβέρνηση θα πρέπει να προσλάβει μεγαλύτερο εργατικό δυναμικό για να χειριστεί αυτό το περίπλοκο ζήτημα. Επιπλέον, η κυβέρνηση θα πληρώσει επίσης το μισθό για τους υπερβολικούς υπαλλήλους, και αυτό θα είχε ως αποτέλεσμα ανεπαρκείς επενδύσεις σε άλλους κρίσιμους δημόσιους τομείς όπως η εκπαίδευση ή η υγειονομική περίθαλψη. Πολλοί γονείς που υποστηρίζουν την ιδέα των εκπτώσεων φόρου ισχυρίζονται ότι τέτοιες πληρωμές φόρου είναι άδικες για αυτούς. Επισημαίνουν ότι είναι παράλογο να απαιτείται από αυτούς να πληρώνουν για τους φόρους που δεν χρησιμοποιούν. Παρ &#39;όλα αυτά, πληρώνουμε επίσης για τις δημόσιες υπηρεσίες που ακόμη και δεν έχουμε την ευκαιρία να εργαστούμε όπως η αστυνομία ή η πυροσβεστική. Σίγουρα δεν ελπίζουμε για μείωση αυτών των ειδών φόρων. Συνολικά, πιστεύω ότι οι φόροι που πληρώνουν για τα κρατικά σχολεία είναι απαραίτητοι για να είναι υποχρεωτικοί για όλα τα μέλη της κοινωνίας, ανεξάρτητα από το πού εγγράφονται τα παιδιά τους."
}