{
    "id": "897488a70352572c2f1a479b7ccd3d69",
    "link": "",
    "description": "",
    "date": "",
    "tags": [],
    "publishedAt": "",
    "crawledAt": "",
    "domain": "",
    "netloc": "",
    "annotations": {
        "ADUs": [
            {
                "id": "T1",
                "type": "MajorClaim",
                "starts": "272",
                "ends": "348",
                "segment": "Καταρχάς, το να ξοδεύουμε πάρα πολύ χρόνο σε κινητά τηλέφωνα ασκούν πολλές αρνητικές επιπτώσεις στις κοινωνικές μας δεξιότητες."
            },
            {
                "id": "T2",
                "type": "Claim",
                "starts": "1818",
                "ends": "1861",
                "segment": "τα κινητά τηλέφωνα έχουν μειώσει την απόσταση επικοινωνίας.",
                "stance": [
                    {
                        "id": "A1",
                        "type": "Against"
                    }
                ]
            },
            {
                "id": "T3",
                "type": "MajorClaim",
                "starts": "1863",
                "ends": "1962",
                "segment": "Συνοψίζοντας, αν και τα κινητά τηλέφωνα κάνουν την επικοινωνία μας πιο γρήγορη, δημιουργεί επίσης πολλά κοινωνικά προβλήματα, όπως οι κοινωνικές δεξιότητες των παιδιών και η ψυχική τους υγεία."
            },
            {
                "id": "T4",
                "type": "Premise",
                "starts": "475",
                "ends": "722",
                "segment": "έφηβοι τείνουν όλο και περισσότερο να εστιάζουν στα τηλέφωνά τους, ενδέχεται να χάσουν τα ενδιαφέροντά τους για καθημερινές δραστηριότητες, όπως συνάντηση με φίλους και αυτή η έλλειψη επικοινωνίας μπορεί να επηρεάσει τις μελλοντικές διαπραγματεύσεις και τις διαπροσωπικές τους δεξιότητες."
            },
            {
                "id": "T5",
                "type": "Premise",
                "starts": "734",
                "ends": "822",
                "segment": "Επιπλέον, η συνεχής χρήση κινητών τηλεφώνων μπορεί επίσης να βλάψει την όραση και τη φυσική στάση των παιδιών."
            },
            {
                "id": "T6",
                "type": "Claim",
                "starts": "837",
                "ends": "889",
                "segment": "Ως αποτέλεσμα, είναι επιβλαβές για εμάς να χρησιμοποιούμε συχνά κινητά τηλέφωνα.",
                "stance": [
                    {
                        "id": "A2",
                        "type": "For"
                    }
                ]
            },
            {
                "id": "T7",
                "type": "Premise",
                "starts": "370",
                "ends": "460",
                "segment": "Για παράδειγμα, καθώς οι άνθρωποι, ειδικά οι έφηβοι τείνουν όλο και περισσότερο να εστιάζουν στα τηλέφωνά τους, ενδέχεται να χάσουν τα ενδιαφέροντά τους για καθημερινές δραστηριότητες, όπως συνάντηση με φίλους και αυτή η έλλειψη επικοινωνίας μπορεί να επηρεάσει τις μελλοντικές διαπραγματεύσεις και τις διαπροσωπικές τους δεξιότητες."
            },
            {
                "id": "T8",
                "type": "Premise",
                "starts": "992",
                "ends": "1085",
                "segment": "Για παράδειγμα, υπάρχουν πολλές διαθέσιμες εφαρμογές παιχνιδιών στο διαδίκτυο και πολλές από αυτές είναι αρκετά επιθετικής φύσης."
            },
            {
                "id": "T9",
                "type": "Premise",
                "starts": "1087",
                "ends": "1299",
                "segment": "Σε αυτά τα παιχνίδια, τα παιδιά ανταμείβονται για να βοηθήσουν τους χαρακτήρες τους να σκοτώσουν ή να πυροβολήσουν τέρατα ή χαρακτήρες που ελέγχονται από άλλους παίκτες, και αυτό οδηγεί σε ανάπτυξη επιθετικών συναισθημάτων, σκέψεων και συμπεριφορών."
            },
            {
                "id": "T10",
                "type": "Premise",
                "starts": "1315",
                "ends": "1364",
                "segment": "σε ανάπτυξη επιθετικών συναισθημάτων, σκέψεων και συμπεριφορών."
            },
            {
                "id": "T11",
                "type": "Claim",
                "starts": "904",
                "ends": "976",
                "segment": "Επιπλέον, ο αυξανόμενος αριθμός παιχνιδιών κινητών θα επηρεάσει την ψυχική τους ανάπτυξη.",
                "stance": [
                    {
                        "id": "A3",
                        "type": "For"
                    }
                ]
            },
            {
                "id": "T12",
                "type": "Premise",
                "starts": "1536",
                "ends": "1729",
                "segment": "Ο λόγος είναι ότι, καθώς οι περισσότερες εταιρείες τηλεπικοινωνιών μας παρέχουν πρόσβαση στο Διαδίκτυο μέσω των τηλεφώνων μας, οι άνθρωποι μπορούν να απολαύσουν την αποστολή άμεσων μηνυμάτων και την πραγματοποίηση διεθνών κλήσεων δωρεάν."
            },
            {
                "id": "T13",
                "type": "Claim",
                "starts": "1737",
                "ends": "1795",
                "segment": "απολαύσουν την αποστολή άμεσων μηνυμάτων και την πραγματοποίηση διεθνών κλήσεων δωρεάν.",
                "stance": [
                    {
                        "id": "A4",
                        "type": "Against"
                    }
                ]
            },
            {
                "id": "T14",
                "type": "Premise",
                "starts": "1429",
                "ends": "1514",
                "segment": "Ωστόσο, ενδέχεται να αντιληφθούμε αυτό το ζήτημα από διαφορετικές απόψεις."
            }
        ],
        "Relations": [
            {
                "id": "R1",
                "type": "supports",
                "arg1": "T4",
                "arg2": "T7"
            },
            {
                "id": "R2",
                "type": "supports",
                "arg1": "T7",
                "arg2": "T6"
            },
            {
                "id": "R3",
                "type": "supports",
                "arg1": "T5",
                "arg2": "T6"
            },
            {
                "id": "R4",
                "type": "supports",
                "arg1": "T8",
                "arg2": "T11"
            },
            {
                "id": "R5",
                "type": "supports",
                "arg1": "T9",
                "arg2": "T10"
            },
            {
                "id": "R6",
                "type": "supports",
                "arg1": "T10",
                "arg2": "T11"
            },
            {
                "id": "R8",
                "type": "supports",
                "arg1": "T14",
                "arg2": "T13"
            },
            {
                "id": "R7",
                "type": "supports",
                "arg1": "T12",
                "arg2": "T14"
            }
        ]
    },
    "content": "Κινητά τηλέφωνα: ταχύτερη επικοινωνία έναντι κοινωνικών προβλημάτων Πρόσφατα, υπήρξε κοινωνική ανησυχία σχετικά με το εάν τα κινητά τηλέφωνα έχουν αρνητικές επιπτώσεις στην κοινωνική μας ζωή. Πράγματι, τα κινητά τηλέφωνα έχουν χρησιμοποιηθεί ευρέως από άτομα όλων των ηλικιών. Ωστόσο, πιστεύω, αυτή η μεγάλη εφεύρεση του 21ου αιώνα προκαλεί πολλά προβλήματα στην κοινωνία μας. Καταρχάς, το να ξοδεύουμε πάρα πολύ χρόνο σε κινητά τηλέφωνα ασκούν πολλές αρνητικές επιπτώσεις στις κοινωνικές μας δεξιότητες. Για παράδειγμα, καθώς οι άνθρωποι, ειδικά οι έφηβοι τείνουν όλο και περισσότερο να εστιάζουν στα τηλέφωνά τους, ενδέχεται να χάσουν τα ενδιαφέροντά τους για καθημερινές δραστηριότητες, όπως συνάντηση με φίλους και αυτή η έλλειψη επικοινωνίας μπορεί να επηρεάσει τις μελλοντικές διαπραγματεύσεις και τις διαπροσωπικές τους δεξιότητες. Επιπλέον, η συνεχής χρήση κινητών τηλεφώνων μπορεί επίσης να βλάψει την όραση και τη φυσική στάση των παιδιών. Ως αποτέλεσμα, είναι επιβλαβές για εμάς να χρησιμοποιούμε συχνά κινητά τηλέφωνα. Επιπλέον, ο αυξανόμενος αριθμός παιχνιδιών κινητών θα επηρεάσει την ψυχική τους ανάπτυξη. Για παράδειγμα, υπάρχουν πολλές διαθέσιμες εφαρμογές παιχνιδιών στο διαδίκτυο και πολλές από αυτές είναι αρκετά επιθετικής φύσης. Σε αυτά τα παιχνίδια, τα παιδιά ανταμείβονται για να βοηθήσουν τους χαρακτήρες τους να σκοτώσουν ή να πυροβολήσουν τέρατα ή χαρακτήρες που ελέγχονται από άλλους παίκτες, και αυτό οδηγεί σε ανάπτυξη επιθετικών συναισθημάτων, σκέψεων και συμπεριφορών. Κατά συνέπεια, συχνές συγκρούσεις ενδέχεται να προκύψουν κατά την επικοινωνία. Ωστόσο, ενδέχεται να αντιληφθούμε αυτό το ζήτημα από διαφορετικές απόψεις. Τα κινητά τηλέφωνα, όπως τα έξυπνα τηλέφωνα, έχουν κάνει την επικοινωνία μας εύκολη και ευκολία. Ο λόγος είναι ότι, καθώς οι περισσότερες εταιρείες τηλεπικοινωνιών μας παρέχουν πρόσβαση στο Διαδίκτυο μέσω των τηλεφώνων μας, οι άνθρωποι μπορούν να απολαύσουν την αποστολή άμεσων μηνυμάτων και την πραγματοποίηση διεθνών κλήσεων δωρεάν. Έτσι, τα κινητά τηλέφωνα έχουν μειώσει την απόσταση επικοινωνίας. Συνοψίζοντας, αν και τα κινητά τηλέφωνα κάνουν την επικοινωνία μας πιο γρήγορη, δημιουργεί επίσης πολλά κοινωνικά προβλήματα, όπως οι κοινωνικές δεξιότητες των παιδιών και η ψυχική τους υγεία. Επομένως, υποστηρίζω ανεπιφύλακτα ότι πρέπει να χρησιμοποιούμε κινητό τηλέφωνο με μέτρο για να αποφύγουμε αυτά τα σοβαρά προβλήματα."
}