{
  "settings": {
    "SECRET_KEY": "k1y#m&6x5am119wtqd96ttipq)4c)t(jg0yme6z1j*9@n171^-",
    "DEBUG": true,
    "ALLOWED_HOSTS": [
      "*"
    ],
    "DATABASES": {
      "default": {
        "ENGINE": "django.db.backends.mysql",
        "NAME": "exec_registry",
        "USER": "root",
        "PASSWORD": "root",
        "HOST": "exec-reg-db",
        "PORT": "3306",
        "OPTIONS": {
          "charset": "utf8"
        }
      },
      "test": {
        "ENGINE": "django.db.backends.sqlite3",
        "NAME": "exec_registry",
        "USER": "root",
        "PASSWORD": "root",
        "HOST": "localhost",
        "PORT": "3306",
        "OPTIONS": {
          "charset": "utf8"
        }
      }
    },
    "use_database": "default"
  }
}
