John,31-10-2018,15:00-17:00,true
Mary,31-10-2018,15:00-17:00,true
Nikiforos,31-10-2018,15:00-17:00,false
George,31-10-2018,15:00-17:00,false
John,01-11-2018,11:00-13:00,false
Mary,01-11-2018,11:00-13:00,false
George,01-11-2018,11:00-13:00,true
Nikiforos,01-11-2018,11:00-13:00,false
John,02-11-2018,12:00-14:00,true
Mary,02-11-2018,12:00-14:00,true
Nikiforos,02-11-2018,12:00-14:00,true
George,02-11-2018,12:00-14:00,false
John,02-11-2018,11:00-13:00,true
Mary,02-11-2018,11:00-13:00,true
Nikiforos,02-11-2018,11:00-13:00,true
George,02-11-2018,11:00-13:00,false
