{
  "totalCost": 2237.3261204587843,
  "routes": [
    {
      "truckId": 1,
      "remainingSpace": 0,
      "filledSpace": 1500,
      "totalTimeNeeded": {
        "hour": 4,
        "minute": 55,
        "second": 0,
        "nano": 0
      },
      "totalDistance": 138.1115383375339,
      "clientsToVisit": [
        {
          "clientId": 0,
          "latitude": 50,
          "longitude": 50,
          "products": 0
        },
        {
          "clientId": 2,
          "visited": true,
          "latitude": 73,
          "longitude": 1,
          "serviceTime": 0.25,
          "products": 500
        },
        {
          "clientId": 3,
          "visited": true,
          "latitude": 94,
          "longitude": 6,
          "serviceTime": 0.25,
          "products": 300
        },
        {
          "clientId": 53,
          "visited": true,
          "latitude": 87,
          "longitude": 15,
          "serviceTime": 0.25,
          "products": 200
        },
        {
          "clientId": 94,
          "visited": true,
          "latitude": 81,
          "longitude": 22,
          "serviceTime": 0.25,
          "products": 100
        },
        {
          "clientId": 23,
          "visited": true,
          "latitude": 72,
          "longitude": 30,
          "serviceTime": 0.25,
          "products": 400
        },
        {
          "clientId": 0,
          "latitude": 50,
          "longitude": 50,
          "products": 0
        }
      ]
    },
    {
      "truckId": 2,
      "remainingSpace": 0,
      "filledSpace": 1500,
      "totalTimeNeeded": {
        "hour": 4,
        "minute": 59,
        "second": 0,
        "nano": 0
      },
      "totalDistance": 129.9971433153453,
      "clientsToVisit": [
        {
          "clientId": 0,
          "latitude": 50,
          "longitude": 50,
          "products": 0
        },
        {
          "clientId": 4,
          "visited": true,
          "latitude": 66,
          "longitude": 73,
          "serviceTime": 0.25,
          "products": 200
        },
        {
          "clientId": 87,
          "visited": true,
          "latitude": 67,
          "longitude": 95,
          "serviceTime": 0.25,
          "products": 300
        },
        {
          "clientId": 80,
          "visited": true,
          "latitude": 82,
          "longitude": 94,
          "serviceTime": 0.25,
          "products": 500
        },
        {
          "clientId": 6,
          "visited": true,
          "latitude": 89,
          "longitude": 89,
          "serviceTime": 0.25,
          "products": 200
        },
        {
          "clientId": 22,
          "visited": true,
          "latitude": 76,
          "longitude": 68,
          "serviceTime": 0.25,
          "products": 300
        },
        {
          "clientId": 0,
          "latitude": 50,
          "longitude": 50,
          "products": 0
        }
      ]
    },
    {
      "truckId": 3,
      "remainingSpace": 400,
      "filledSpace": 1100,
      "totalTimeNeeded": {
        "hour": 4,
        "minute": 52,
        "second": 0,
        "nano": 0
      },
      "totalDistance": 49.97815599936856,
      "clientsToVisit": [
        {
          "clientId": 0,
          "latitude": 50,
          "longitude": 50,
          "products": 0
        },
        {
          "clientId": 48,
          "visited": true,
          "latitude": 67,
          "longitude": 66,
          "serviceTime": 0.25,
          "products": 400
        },
        {
          "clientId": 13,
          "visited": true,
          "latitude": 66,
          "longitude": 66,
          "serviceTime": 0.25,
          "products": 200
        },
        {
          "clientId": 81,
          "visited": true,
          "latitude": 64,
          "longitude": 68,
          "serviceTime": 0.25,
          "products": 200
        },
        {
          "clientId": 66,
          "visited": true,
          "latitude": 61,
          "longitude": 64,
          "serviceTime": 0.25,
          "products": 300
        },
        {
          "clientId": 0,
          "latitude": 50,
          "longitude": 50,
          "products": 0
        }
      ]
    },
    {
      "truckId": 4,
      "remainingSpace": 0,
      "filledSpace": 1500,
      "totalTimeNeeded": {
        "hour": 4,
        "minute": 59,
        "second": 0,
        "nano": 0
      },
      "totalDistance": 163.95996616300255,
      "clientsToVisit": [
        {
          "clientId": 0,
          "latitude": 50,
          "longitude": 50,
          "products": 0
        },
        {
          "clientId": 97,
          "visited": true,
          "latitude": 11,
          "longitude": 54,
          "serviceTime": 0.25,
          "products": 100
        },
        {
          "clientId": 10,
          "visited": true,
          "latitude": 7,
          "longitude": 55,
          "serviceTime": 0.25,
          "products": 300
        },
        {
          "clientId": 21,
          "visited": true,
          "latitude": 16,
          "longitude": 36,
          "serviceTime": 0.25,
          "products": 100
        },
        {
          "clientId": 85,
          "visited": true,
          "latitude": 31,
          "longitude": 21,
          "serviceTime": 0.25,
          "products": 200
        },
        {
          "clientId": 55,
          "visited": true,
          "latitude": 40,
          "longitude": 1,
          "serviceTime": 0.25,
          "products": 100
        },
        {
          "clientId": 11,
          "visited": true,
          "latitude": 42,
          "longitude": 3,
          "serviceTime": 0.25,
          "products": 300
        },
        {
          "clientId": 61,
          "visited": true,
          "latitude": 46,
          "longitude": 1,
          "serviceTime": 0.25,
          "products": 400
        },
        {
          "clientId": 0,
          "latitude": 50,
          "longitude": 50,
          "products": 0
        }
      ]
    },
    {
      "truckId": 5,
      "remainingSpace": 200,
      "filledSpace": 1300,
      "totalTimeNeeded": {
        "hour": 4,
        "minute": 58,
        "second": 0,
        "nano": 0
      },
      "totalDistance": 66.29036999360902,
      "clientsToVisit": [
        {
          "clientId": 0,
          "latitude": 50,
          "longitude": 50,
          "products": 0
        },
        {
          "clientId": 75,
          "visited": true,
          "latitude": 50,
          "longitude": 78,
          "serviceTime": 0.25,
          "products": 300
        },
        {
          "clientId": 15,
          "visited": true,
          "latitude": 56,
          "longitude": 81,
          "serviceTime": 0.25,
          "products": 500
        },
        {
          "clientId": 17,
          "visited": true,
          "latitude": 55,
          "longitude": 77,
          "serviceTime": 0.25,
          "products": 500
        },
        {
          "clientId": 0,
          "latitude": 50,
          "longitude": 50,
          "products": 0
        }
      ]
    },
    {
      "truckId": 6,
      "remainingSpace": 0,
      "filledSpace": 1500,
      "totalTimeNeeded": {
        "hour": 4,
        "minute": 34,
        "second": 0,
        "nano": 0
      },
      "totalDistance": 120.90084748718236,
      "clientsToVisit": [
        {
          "clientId": 0,
          "latitude": 50,
          "longitude": 50,
          "products": 0
        },
        {
          "clientId": 50,
          "visited": true,
          "latitude": 30,
          "longitude": 34,
          "serviceTime": 0.25,
          "products": 400
        },
        {
          "clientId": 19,
          "visited": true,
          "latitude": 13,
          "longitude": 13,
          "serviceTime": 0.25,
          "products": 300
        },
        {
          "clientId": 7,
          "visited": true,
          "latitude": 11,
          "longitude": 25,
          "serviceTime": 0.25,
          "products": 100
        },
        {
          "clientId": 20,
          "visited": true,
          "latitude": 12,
          "longitude": 42,
          "serviceTime": 0.25,
          "products": 400
        },
        {
          "clientId": 32,
          "visited": true,
          "latitude": 35,
          "longitude": 49,
          "serviceTime": 0.25,
          "products": 300
        },
        {
          "clientId": 0,
          "latitude": 50,
          "longitude": 50,
          "products": 0
        }
      ]
    },
    {
      "truckId": 7,
      "remainingSpace": 1500,
      "filledSpace": 0,
      "totalTimeNeeded": {
        "hour": 4,
        "minute": 56,
        "second": 0,
        "nano": 0
      },
      "totalDistance": -3.552713678800501E-15,
      "clientsToVisit": [
        {
          "clientId": 0,
          "latitude": 50,
          "longitude": 50,
          "products": 0
        },
        {
          "clientId": 0,
          "latitude": 50,
          "longitude": 50,
          "products": 0
        }
      ]
    },
    {
      "truckId": 8,
      "remainingSpace": 100,
      "filledSpace": 1400,
      "totalTimeNeeded": {
        "hour": 4,
        "minute": 47,
        "second": 0,
        "nano": 0
      },
      "totalDistance": 87.34360672752001,
      "clientsToVisit": [
        {
          "clientId": 0,
          "latitude": 50,
          "longitude": 50,
          "products": 0
        },
        {
          "clientId": 5,
          "visited": true,
          "latitude": 67,
          "longitude": 40,
          "serviceTime": 0.25,
          "products": 300
        },
        {
          "clientId": 31,
          "visited": true,
          "latitude": 76,
          "longitude": 41,
          "serviceTime": 0.25,
          "products": 100
        },
        {
          "clientId": 27,
          "visited": true,
          "latitude": 91,
          "longitude": 48,
          "serviceTime": 0.25,
          "products": 500
        },
        {
          "clientId": 28,
          "visited": true,
          "latitude": 91,
          "longitude": 49,
          "serviceTime": 0.25,
          "products": 500
        },
        {
          "clientId": 0,
          "latitude": 50,
          "longitude": 50,
          "products": 0
        }
      ]
    },
    {
      "truckId": 9,
      "remainingSpace": 0,
      "filledSpace": 1500,
      "totalTimeNeeded": {
        "hour": 4,
        "minute": 58,
        "second": 0,
        "nano": 0
      },
      "totalDistance": 108.96851568468918,
      "clientsToVisit": [
        {
          "clientId": 0,
          "latitude": 50,
          "longitude": 50,
          "products": 0
        },
        {
          "clientId": 58,
          "visited": true,
          "latitude": 45,
          "longitude": 94,
          "serviceTime": 0.25,
          "products": 300
        },
        {
          "clientId": 30,
          "visited": true,
          "latitude": 41,
          "longitude": 98,
          "serviceTime": 0.25,
          "products": 400
        },
        {
          "clientId": 54,
          "visited": true,
          "latitude": 36,
          "longitude": 96,
          "serviceTime": 0.25,
          "products": 400
        },
        {
          "clientId": 34,
          "visited": true,
          "latitude": 36,
          "longitude": 59,
          "serviceTime": 0.25,
          "products": 400
        },
        {
          "clientId": 0,
          "latitude": 50,
          "longitude": 50,
          "products": 0
        }
      ]
    },
    {
      "truckId": 10,
      "remainingSpace": 200,
      "filledSpace": 1300,
      "totalTimeNeeded": {
        "hour": 4,
        "minute": 47,
        "second": 0,
        "nano": 0
      },
      "totalDistance": 58.05210571774147,
      "clientsToVisit": [
        {
          "clientId": 0,
          "latitude": 50,
          "longitude": 50,
          "products": 0
        },
        {
          "clientId": 74,
          "visited": true,
          "latitude": 57,
          "longitude": 47,
          "serviceTime": 0.25,
          "products": 300
        },
        {
          "clientId": 12,
          "visited": true,
          "latitude": 71,
          "longitude": 34,
          "serviceTime": 0.25,
          "products": 300
        },
        {
          "clientId": 35,
          "visited": true,
          "latitude": 71,
          "longitude": 31,
          "serviceTime": 0.25,
          "products": 300
        },
        {
          "clientId": 43,
          "visited": true,
          "latitude": 66,
          "longitude": 36,
          "serviceTime": 0.25,
          "products": 400
        },
        {
          "clientId": 0,
          "latitude": 50,
          "longitude": 50,
          "products": 0
        }
      ]
    },
    {
      "truckId": 11,
      "remainingSpace": 100,
      "filledSpace": 1400,
      "totalTimeNeeded": {
        "hour": 4,
        "minute": 46,
        "second": 0,
        "nano": 0
      },
      "totalDistance": 66.912331892362,
      "clientsToVisit": [
        {
          "clientId": 0,
          "latitude": 50,
          "longitude": 50,
          "products": 0
        },
        {
          "clientId": 37,
          "visited": true,
          "latitude": 68,
          "longitude": 71,
          "serviceTime": 0.25,
          "products": 400
        },
        {
          "clientId": 45,
          "visited": true,
          "latitude": 71,
          "longitude": 76,
          "serviceTime": 0.25,
          "products": 500
        },
        {
          "clientId": 83,
          "visited": true,
          "latitude": 66,
          "longitude": 70,
          "serviceTime": 0.25,
          "products": 500
        },
        {
          "clientId": 0,
          "latitude": 50,
          "longitude": 50,
          "products": 0
        }
      ]
    },
    {
      "truckId": 12,
      "remainingSpace": 0,
      "filledSpace": 1500,
      "totalTimeNeeded": {
        "hour": 4,
        "minute": 59,
        "second": 0,
        "nano": 0
      },
      "totalDistance": 112.29828581284184,
      "clientsToVisit": [
        {
          "clientId": 0,
          "latitude": 50,
          "longitude": 50,
          "products": 0
        },
        {
          "clientId": 93,
          "visited": true,
          "latitude": 62,
          "longitude": 47,
          "serviceTime": 0.25,
          "products": 100
        },
        {
          "clientId": 38,
          "visited": true,
          "latitude": 93,
          "longitude": 40,
          "serviceTime": 0.25,
          "products": 300
        },
        {
          "clientId": 76,
          "visited": true,
          "latitude": 90,
          "longitude": 33,
          "serviceTime": 0.25,
          "products": 400
        },
        {
          "clientId": 25,
          "visited": true,
          "latitude": 86,
          "longitude": 22,
          "serviceTime": 0.25,
          "products": 100
        },
        {
          "clientId": 33,
          "visited": true,
          "latitude": 80,
          "longitude": 24,
          "serviceTime": 0.25,
          "products": 100
        },
        {
          "clientId": 60,
          "visited": true,
          "latitude": 69,
          "longitude": 25,
          "serviceTime": 0.25,
          "products": 100
        },
        {
          "clientId": 72,
          "visited": true,
          "latitude": 61,
          "longitude": 34,
          "serviceTime": 0.25,
          "products": 400
        },
        {
          "clientId": 0,
          "latitude": 50,
          "longitude": 50,
          "products": 0
        }
      ]
    },
    {
      "truckId": 13,
      "remainingSpace": 100,
      "filledSpace": 1400,
      "totalTimeNeeded": {
        "hour": 4,
        "minute": 29,
        "second": 0,
        "nano": 0
      },
      "totalDistance": 92.96141062797756,
      "clientsToVisit": [
        {
          "clientId": 0,
          "latitude": 50,
          "longitude": 50,
          "products": 0
        },
        {
          "clientId": 40,
          "visited": true,
          "latitude": 48,
          "longitude": 78,
          "serviceTime": 0.25,
          "products": 400
        },
        {
          "clientId": 56,
          "visited": true,
          "latitude": 48,
          "longitude": 88,
          "serviceTime": 0.25,
          "products": 300
        },
        {
          "clientId": 42,
          "visited": true,
          "latitude": 63,
          "longitude": 87,
          "serviceTime": 0.25,
          "products": 100
        },
        {
          "clientId": 89,
          "visited": true,
          "latitude": 60,
          "longitude": 83,
          "serviceTime": 0.25,
          "products": 100
        },
        {
          "clientId": 1,
          "visited": true,
          "latitude": 60,
          "longitude": 76,
          "serviceTime": 0.25,
          "products": 500
        },
        {
          "clientId": 0,
          "latitude": 50,
          "longitude": 50,
          "products": 0
        }
      ]
    },
    {
      "truckId": 14,
      "remainingSpace": 0,
      "filledSpace": 1500,
      "totalTimeNeeded": {
        "hour": 3,
        "minute": 59,
        "second": 0,
        "nano": 0
      },
      "totalDistance": 35.50328267271028,
      "clientsToVisit": [
        {
          "clientId": 0,
          "latitude": 50,
          "longitude": 50,
          "products": 0
        },
        {
          "clientId": 77,
          "visited": true,
          "latitude": 61,
          "longitude": 41,
          "serviceTime": 0.25,
          "products": 500
        },
        {
          "clientId": 46,
          "visited": true,
          "latitude": 58,
          "longitude": 37,
          "serviceTime": 0.25,
          "products": 500
        },
        {
          "clientId": 47,
          "visited": true,
          "latitude": 51,
          "longitude": 43,
          "serviceTime": 0.25,
          "products": 500
        },
        {
          "clientId": 0,
          "latitude": 50,
          "longitude": 50,
          "products": 0
        }
      ]
    },
    {
      "truckId": 15,
      "remainingSpace": 100,
      "filledSpace": 1400,
      "totalTimeNeeded": {
        "hour": 4,
        "minute": 35,
        "second": 0,
        "nano": 0
      },
      "totalDistance": 125.622857795805,
      "clientsToVisit": [
        {
          "clientId": 0,
          "latitude": 50,
          "longitude": 50,
          "products": 0
        },
        {
          "clientId": 57,
          "visited": true,
          "latitude": 38,
          "longitude": 56,
          "serviceTime": 0.25,
          "products": 300
        },
        {
          "clientId": 71,
          "visited": true,
          "latitude": 5,
          "longitude": 87,
          "serviceTime": 0.25,
          "products": 400
        },
        {
          "clientId": 52,
          "visited": true,
          "latitude": 2,
          "longitude": 90,
          "serviceTime": 0.25,
          "products": 200
        },
        {
          "clientId": 16,
          "visited": true,
          "latitude": 12,
          "longitude": 84,
          "serviceTime": 0.25,
          "products": 300
        },
        {
          "clientId": 88,
          "visited": true,
          "latitude": 21,
          "longitude": 77,
          "serviceTime": 0.25,
          "products": 200
        },
        {
          "clientId": 0,
          "latitude": 50,
          "longitude": 50,
          "products": 0
        }
      ]
    },
    {
      "truckId": 16,
      "remainingSpace": 1500,
      "filledSpace": 0,
      "totalTimeNeeded": {
        "hour": 4,
        "minute": 35,
        "second": 0,
        "nano": 0
      },
      "totalDistance": 0.0,
      "clientsToVisit": [
        {
          "clientId": 0,
          "latitude": 50,
          "longitude": 50,
          "products": 0
        },
        {
          "clientId": 0,
          "latitude": 50,
          "longitude": 50,
          "products": 0
        }
      ]
    },
    {
      "truckId": 17,
      "remainingSpace": 1500,
      "filledSpace": 0,
      "totalTimeNeeded": {
        "hour": 4,
        "minute": 56,
        "second": 0,
        "nano": 0
      },
      "totalDistance": -7.105427357601002E-15,
      "clientsToVisit": [
        {
          "clientId": 0,
          "latitude": 50,
          "longitude": 50,
          "products": 0
        },
        {
          "clientId": 0,
          "latitude": 50,
          "longitude": 50,
          "products": 0
        }
      ]
    },
    {
      "truckId": 18,
      "remainingSpace": 1500,
      "filledSpace": 0,
      "totalTimeNeeded": {
        "hour": 4,
        "minute": 59,
        "second": 0,
        "nano": 0
      },
      "totalDistance": -7.105427357601002E-15,
      "clientsToVisit": [
        {
          "clientId": 0,
          "latitude": 50,
          "longitude": 50,
          "products": 0
        },
        {
          "clientId": 0,
          "latitude": 50,
          "longitude": 50,
          "products": 0
        }
      ]
    },
    {
      "truckId": 19,
      "remainingSpace": 100,
      "filledSpace": 1400,
      "totalTimeNeeded": {
        "hour": 4,
        "minute": 34,
        "second": 0,
        "nano": 0
      },
      "totalDistance": 110.67123184890676,
      "clientsToVisit": [
        {
          "clientId": 0,
          "latitude": 50,
          "longitude": 50,
          "products": 0
        },
        {
          "clientId": 63,
          "visited": true,
          "latitude": 9,
          "longitude": 71,
          "serviceTime": 0.25,
          "products": 300
        },
        {
          "clientId": 18,
          "visited": true,
          "latitude": 7,
          "longitude": 70,
          "serviceTime": 0.25,
          "products": 100
        },
        {
          "clientId": 65,
          "visited": true,
          "latitude": 1,
          "longitude": 61,
          "serviceTime": 0.25,
          "products": 400
        },
        {
          "clientId": 73,
          "visited": true,
          "latitude": 4,
          "longitude": 57,
          "serviceTime": 0.25,
          "products": 500
        },
        {
          "clientId": 59,
          "visited": true,
          "latitude": 6,
          "longitude": 57,
          "serviceTime": 0.25,
          "products": 100
        },
        {
          "clientId": 0,
          "latitude": 50,
          "longitude": 50,
          "products": 0
        }
      ]
    },
    {
      "truckId": 20,
      "remainingSpace": 0,
      "filledSpace": 1500,
      "totalTimeNeeded": {
        "hour": 4,
        "minute": 59,
        "second": 0,
        "nano": 0
      },
      "totalDistance": 186.49896209681356,
      "clientsToVisit": [
        {
          "clientId": 0,
          "latitude": 50,
          "longitude": 50,
          "products": 0
        },
        {
          "clientId": 98,
          "visited": true,
          "latitude": 82,
          "longitude": 70,
          "serviceTime": 0.25,
          "products": 300
        },
        {
          "clientId": 64,
          "visited": true,
          "latitude": 88,
          "longitude": 71,
          "serviceTime": 0.25,
          "products": 100
        },
        {
          "clientId": 67,
          "visited": true,
          "latitude": 64,
          "longitude": 6,
          "serviceTime": 0.25,
          "products": 300
        },
        {
          "clientId": 91,
          "visited": true,
          "latitude": 63,
          "longitude": 5,
          "serviceTime": 0.25,
          "products": 300
        },
        {
          "clientId": 96,
          "visited": true,
          "latitude": 72,
          "longitude": 0,
          "serviceTime": 0.25,
          "products": 300
        },
        {
          "clientId": 39,
          "visited": true,
          "latitude": 79,
          "longitude": 8,
          "serviceTime": 0.25,
          "products": 100
        },
        {
          "clientId": 90,
          "visited": true,
          "latitude": 68,
          "longitude": 23,
          "serviceTime": 0.25,
          "products": 100
        },
        {
          "clientId": 0,
          "latitude": 50,
          "longitude": 50,
          "products": 0
        }
      ]
    },
    {
      "truckId": 21,
      "remainingSpace": 0,
      "filledSpace": 1500,
      "totalTimeNeeded": {
        "hour": 4,
        "minute": 45,
        "second": 0,
        "nano": 0
      },
      "totalDistance": 199.49985503508714,
      "clientsToVisit": [
        {
          "clientId": 0,
          "latitude": 50,
          "longitude": 50,
          "products": 0
        },
        {
          "clientId": 69,
          "visited": true,
          "latitude": 92,
          "longitude": 75,
          "serviceTime": 0.25,
          "products": 300
        },
        {
          "clientId": 29,
          "visited": true,
          "latitude": 94,
          "longitude": 75,
          "serviceTime": 0.25,
          "products": 200
        },
        {
          "clientId": 41,
          "visited": true,
          "latitude": 99,
          "longitude": 74,
          "serviceTime": 0.25,
          "products": 100
        },
        {
          "clientId": 79,
          "visited": true,
          "latitude": 95,
          "longitude": 49,
          "serviceTime": 0.25,
          "products": 200
        },
        {
          "clientId": 49,
          "visited": true,
          "latitude": 96,
          "longitude": 23,
          "serviceTime": 0.25,
          "products": 100
        },
        {
          "clientId": 70,
          "visited": true,
          "latitude": 92,
          "longitude": 2,
          "serviceTime": 0.25,
          "products": 200
        },
        {
          "clientId": 92,
          "visited": true,
          "latitude": 74,
          "longitude": 3,
          "serviceTime": 0.25,
          "products": 300
        },
        {
          "clientId": 14,
          "visited": true,
          "latitude": 55,
          "longitude": 41,
          "serviceTime": 0.25,
          "products": 100
        },
        {
          "clientId": 0,
          "latitude": 50,
          "longitude": 50,
          "products": 0
        }
      ]
    },
    {
      "truckId": 22,
      "remainingSpace": 1500,
      "filledSpace": 0,
      "totalTimeNeeded": {
        "hour": 4,
        "minute": 33,
        "second": 0,
        "nano": 0
      },
      "totalDistance": -7.105427357601002E-15,
      "clientsToVisit": [
        {
          "clientId": 0,
          "latitude": 50,
          "longitude": 50,
          "products": 0
        },
        {
          "clientId": 0,
          "latitude": 50,
          "longitude": 50,
          "products": 0
        }
      ]
    },
    {
      "truckId": 23,
      "remainingSpace": 700,
      "filledSpace": 800,
      "totalTimeNeeded": {
        "hour": 4,
        "minute": 24,
        "second": 0,
        "nano": 0
      },
      "totalDistance": 72.0253026722136,
      "clientsToVisit": [
        {
          "clientId": 0,
          "latitude": 50,
          "longitude": 50,
          "products": 0
        },
        {
          "clientId": 44,
          "visited": true,
          "latitude": 80,
          "longitude": 57,
          "serviceTime": 0.25,
          "products": 500
        },
        {
          "clientId": 82,
          "visited": true,
          "latitude": 85,
          "longitude": 58,
          "serviceTime": 0.25,
          "products": 200
        },
        {
          "clientId": 9,
          "visited": true,
          "latitude": 78,
          "longitude": 58,
          "serviceTime": 0.25,
          "products": 100
        },
        {
          "clientId": 0,
          "latitude": 50,
          "longitude": 50,
          "products": 0
        }
      ]
    },
    {
      "truckId": 24,
      "remainingSpace": 1500,
      "filledSpace": 0,
      "totalTimeNeeded": {
        "hour": 4,
        "minute": 15,
        "second": 0,
        "nano": 0
      },
      "totalDistance": -2.8421709430404007E-14,
      "clientsToVisit": [
        {
          "clientId": 0,
          "latitude": 50,
          "longitude": 50,
          "products": 0
        },
        {
          "clientId": 0,
          "latitude": 50,
          "longitude": 50,
          "products": 0
        }
      ]
    },
    {
      "truckId": 25,
      "remainingSpace": 0,
      "filledSpace": 1500,
      "totalTimeNeeded": {
        "hour": 4,
        "minute": 33,
        "second": 0,
        "nano": 0
      },
      "totalDistance": 114.5997421543464,
      "clientsToVisit": [
        {
          "clientId": 0,
          "latitude": 50,
          "longitude": 50,
          "products": 0
        },
        {
          "clientId": 100,
          "visited": true,
          "latitude": 48,
          "longitude": 49,
          "serviceTime": 0.25,
          "products": 300
        },
        {
          "clientId": 8,
          "visited": true,
          "latitude": 44,
          "longitude": 40,
          "serviceTime": 0.25,
          "products": 100
        },
        {
          "clientId": 84,
          "visited": true,
          "latitude": 27,
          "longitude": 20,
          "serviceTime": 0.25,
          "products": 300
        },
        {
          "clientId": 86,
          "visited": true,
          "latitude": 48,
          "longitude": 2,
          "serviceTime": 0.25,
          "products": 500
        },
        {
          "clientId": 62,
          "visited": true,
          "latitude": 51,
          "longitude": 14,
          "serviceTime": 0.25,
          "products": 100
        },
        {
          "clientId": 26,
          "visited": true,
          "latitude": 49,
          "longitude": 23,
          "serviceTime": 0.25,
          "products": 200
        },
        {
          "clientId": 0,
          "latitude": 50,
          "longitude": 50,
          "products": 0
        }
      ]
    },
    {
      "truckId": 26,
      "remainingSpace": 1500,
      "filledSpace": 0,
      "totalTimeNeeded": {
        "hour": 4,
        "minute": 3,
        "second": 0,
        "nano": 0
      },
      "totalDistance": 7.105427357601002E-15,
      "clientsToVisit": [
        {
          "clientId": 0,
          "latitude": 50,
          "longitude": 50,
          "products": 0
        },
        {
          "clientId": 0,
          "latitude": 50,
          "longitude": 50,
          "products": 0
        }
      ]
    },
    {
      "truckId": 27,
      "remainingSpace": 0,
      "filledSpace": 1500,
      "totalTimeNeeded": {
        "hour": 4,
        "minute": 2,
        "second": 0,
        "nano": 0
      },
      "totalDistance": 146.5253287828217,
      "clientsToVisit": [
        {
          "clientId": 0,
          "latitude": 50,
          "longitude": 50,
          "products": 0
        },
        {
          "clientId": 24,
          "visited": true,
          "latitude": 25,
          "longitude": 5,
          "serviceTime": 0.25,
          "products": 500
        },
        {
          "clientId": 36,
          "visited": true,
          "latitude": 11,
          "longitude": 13,
          "serviceTime": 0.25,
          "products": 400
        },
        {
          "clientId": 95,
          "visited": true,
          "latitude": 0,
          "longitude": 11,
          "serviceTime": 0.25,
          "products": 500
        },
        {
          "clientId": 51,
          "visited": true,
          "latitude": 2,
          "longitude": 24,
          "serviceTime": 0.25,
          "products": 100
        },
        {
          "clientId": 0,
          "latitude": 50,
          "longitude": 50,
          "products": 0
        }
      ]
    },
    {
      "truckId": 28,
      "remainingSpace": 1500,
      "filledSpace": 0,
      "totalTimeNeeded": {
        "hour": 3,
        "minute": 42,
        "second": 0,
        "nano": 0
      },
      "totalDistance": -1.4210854715202004E-14,
      "clientsToVisit": [
        {
          "clientId": 0,
          "latitude": 50,
          "longitude": 50,
          "products": 0
        },
        {
          "clientId": 0,
          "latitude": 50,
          "longitude": 50,
          "products": 0
        }
      ]
    },
    {
      "truckId": 29,
      "remainingSpace": 400,
      "filledSpace": 1100,
      "totalTimeNeeded": {
        "hour": 1,
        "minute": 57,
        "second": 0,
        "nano": 0
      },
      "totalDistance": 50.60527964090478,
      "clientsToVisit": [
        {
          "clientId": 0,
          "latitude": 50,
          "longitude": 50,
          "products": 0
        },
        {
          "clientId": 78,
          "visited": true,
          "latitude": 43,
          "longitude": 71,
          "serviceTime": 0.25,
          "products": 500
        },
        {
          "clientId": 99,
          "visited": true,
          "latitude": 42,
          "longitude": 74,
          "serviceTime": 0.25,
          "products": 500
        },
        {
          "clientId": 68,
          "visited": true,
          "latitude": 45,
          "longitude": 66,
          "serviceTime": 0.25,
          "products": 100
        },
        {
          "clientId": 0,
          "latitude": 50,
          "longitude": 50,
          "products": 0
        }
      ]
    }
  ]
}
