<?xml version="1.0" standalone="no"?>
<!DOCTYPE svg PUBLIC "-//W3C//DTD SVG 20010904//EN"
 "http://www.w3.org/TR/2001/REC-SVG-20010904/DTD/svg10.dtd">
<svg version="1.0" xmlns="http://www.w3.org/2000/svg"
 width="700.000000pt" height="700.000000pt" viewBox="0 0 700.000000 700.000000"
 preserveAspectRatio="xMidYMid meet">
<g transform="translate(0.000000,700.000000) scale(0.100000,-0.100000)"
fill="#000000" stroke="none">
<path d="M3190 6709 c-1000 -59 -1788 -499 -2383 -1330 -145 -202 -262 -413
-366 -657 l-61 -142 53 -70 c158 -207 264 -461 303 -723 21 -144 14 -397 -15
-539 -46 -225 -148 -466 -282 -668 -81 -122 -81 -101 -4 -291 277 -678 791
-1248 1450 -1607 339 -185 708 -304 1140 -369 176 -26 667 -26 853 1 133 19
134 19 147 50 8 17 32 74 55 127 75 177 199 345 342 467 250 211 539 334 878
373 102 11 389 7 436 -6 17 -5 35 10 101 87 384 449 609 916 733 1523 44 213
60 373 60 591 1 346 -47 624 -166 964 -124 356 -263 621 -498 948 -81 114 -81
114 -116 108 -81 -14 -312 -18 -416 -7 -375 38 -756 233 -979 501 -131 158
-241 355 -280 504 -17 64 -27 83 -46 93 -34 16 -356 60 -529 73 -160 11 -212
11 -410 -1z m-1307 -701 c21 -29 164 -229 319 -445 l283 -391 57 29 c156 79
380 152 563 185 234 41 568 26 812 -37 666 -171 1209 -708 1388 -1372 29 -105
65 -313 65 -372 0 -90 -11 -85 195 -85 100 0 338 -3 528 -7 l347 -6 0 -76 0
-76 -532 0 -533 0 -8 -85 c-31 -356 -180 -731 -404 -1023 -25 -32 -83 -98
-131 -148 -275 -289 -617 -479 -1020 -565 -160 -35 -482 -45 -647 -20 -168 25
-368 79 -504 138 -24 10 -48 15 -51 11 -6 -7 -207 -380 -438 -814 l-46 -87
-68 37 c-37 20 -68 40 -68 45 0 4 31 65 69 135 38 69 147 270 241 446 143 267
168 321 156 330 -8 5 -48 31 -88 57 -103 66 -198 144 -307 251 -299 295 -483
656 -557 1092 -13 71 -17 157 -17 300 0 218 11 315 62 510 68 258 197 513 368
725 79 98 248 261 346 335 43 32 76 63 73 70 -4 12 -508 710 -587 813 -22 29
-39 57 -37 62 4 12 110 89 124 90 6 0 27 -24 47 -52z"/>
<path d="M3215 5264 c-348 -52 -631 -169 -885 -365 -360 -278 -604 -681 -686
-1134 -23 -125 -26 -479 -6 -595 106 -601 460 -1082 993 -1350 275 -139 630
-208 934 -182 882 76 1569 745 1664 1624 92 843 -424 1651 -1226 1918 -207 68
-289 82 -538 85 -121 2 -233 1 -250 -1z m430 -175 c328 -41 655 -196 893 -425
l97 -93 -52 -53 -53 -53 -77 77 c-169 166 -370 281 -618 353 -278 81 -618 71
-884 -26 -47 -18 -99 -32 -116 -32 -16 0 -66 16 -110 36 l-80 36 97 45 c274
128 585 175 903 135z m-1059 -231 c-80 -109 -109 -183 -109 -276 0 -41 -4 -56
-20 -67 -11 -8 -16 -18 -12 -26 5 -8 4 -10 -4 -5 -6 4 -19 2 -27 -5 -16 -13
-11 -44 12 -70 12 -14 7 -28 -46 -110 -33 -52 -81 -129 -107 -171 -32 -50 -56
-79 -71 -83 -16 -4 -22 -11 -18 -21 3 -9 1 -12 -4 -9 -22 13 -31 -7 -13 -28
l18 -22 -23 19 c-16 14 -25 17 -34 8 -11 -11 -4 -44 9 -40 4 2 9 0 11 -4 6
-20 1 -29 -15 -27 -10 1 -40 -1 -66 -6 -56 -9 -57 -11 -87 -144 -70 -317 -41
-626 85 -922 30 -69 113 -217 158 -282 10 -15 7 -22 -28 -52 -72 -63 -68 -64
-125 17 -109 155 -205 384 -252 601 -30 138 -33 483 -5 622 71 357 236 661
491 902 78 73 275 223 294 223 3 0 -3 -10 -12 -22z m167 -89 c150 -75 218
-143 203 -204 -4 -16 -34 -53 -67 -84 -166 -153 -159 -145 -159 -187 0 -28 8
-49 28 -74 16 -19 46 -66 68 -105 92 -167 165 -211 469 -286 149 -37 326 -87
333 -94 10 -9 -11 -43 -23 -39 -19 8 -27 -12 -10 -26 18 -15 49 -5 39 11 -4 7
-3 9 4 5 17 -10 25 13 11 32 -11 14 -11 15 1 5 8 -7 21 -13 30 -13 9 0 25 -6
35 -14 17 -12 13 -15 -42 -34 -41 -13 -64 -17 -71 -10 -13 13 -35 0 -26 -14 4
-6 2 -8 -4 -4 -6 3 -14 1 -19 -6 -4 -7 -28 -26 -52 -43 -122 -83 -192 -248
-170 -403 5 -35 14 -73 20 -84 6 -11 7 -24 2 -28 -4 -5 -150 -123 -323 -263
-300 -243 -316 -254 -334 -239 -34 30 -112 157 -150 248 -46 105 -70 142 -172
260 -129 151 -154 213 -119 297 8 20 65 102 126 184 112 148 148 209 149 250
0 59 -43 99 -137 126 -85 25 -96 34 -89 70 4 17 51 99 106 183 139 211 153
243 156 374 1 58 7 118 13 134 14 36 71 116 83 116 5 0 46 -18 91 -41z m1507
-894 c-7 -9 -15 -13 -17 -11 -7 7 7 26 19 26 6 0 6 -6 -2 -15z"/>
</g>
</svg>
