036-2,29,27,0	script	#k2city1e	NPC412,{
  end;
  OnInit:
    disablenpc "#k2city1e";
  end;
}
036-2,29,27,0	script	#k2city1d	NPC413,{
  end;
}

036-2,31,27,0	script	#k2city2e	NPC416,{
  end;
  OnInit:
    disablenpc "#k2city2e";
  end;
}
036-2,31,27,0	script	#k2city2d	NPC417,{
  end;
}

036-2,32,27,0	script	#k2sound	NPC127,{
  end;
  OnCommandDing:
    specialeffect 402;
    end;
}
