// This file is generated automatically. All manually added changes will be removed when running the Converter.
// Map 015-3: Cat's Cave mobs
015-3,22,25,1,2	monster	Bat	1017,2,100000,30000
015-3,29,31,1,1	monster	Maggot	1002,2,100000,30000
015-3,23,19,0,0	monster	Maggot	1002,1,100000,30000
015-3,40,19,0,0	monster	Spider	1012,1,100000,30000
