006-1,39,22,0	script	Mika	NPC114,{
    mes "[Mika]";
    mes "\"My father told me about a man living in this desert who makes clothes out of snake skin.\"";
    next;
    mes "[Mika]";
    mes "\"Maybe you can find him, but be careful you don't get lost in the tunnels!\"";
    close;
}
