// This file is generated automatically. All manually added changes will be removed when running the Converter.
// Map 046-1: Rock Plateau warps
046-1,95,124,0	warp	#046-1_95_124	1,0,034-1,94,19
046-1,29,20,0	warp	#046-1_29_20	0,0,047-1,70,178
046-1,31,20,0	warp	#046-1_31_20	0,0,047-1,70,178
046-1,78,37,0	warp	#046-1_78_37	0,0,046-3,78,29
046-1,131,55,0	warp	#046-1_131_55	0,0,046-3,131,47
046-1,131,62,0	warp	#046-1_131_62	0,0,046-3,131,54
046-1,139,26,0	warp	#046-1_139_26	0,0,046-3,139,18
046-1,83,50,0	warp	#046-1_83_50	0,0,046-3,83,42
046-1,124,116,0	warp	#046-1_124_116	0,0,046-3,124,108
046-1,62,26,0	warp	#046-1_62_26	0,0,019-4,24,123
