029-3,49,54,0	script	#FightCaveBarrier	NPC45,0,0,{
    if ($@FIGHT_CAVE_STATUS == 1) goto L_Block;
    warp "029-1", 69, 62;
    end;

L_Block:
    message strcharinfo(0), "Some force seems to be blocking you from exiting.";
    end;
}
