// This file is generated automatically. All manually added changes will be removed when running the Converter.
// Map 017-4: Hideout warps
017-4,201,25,0	warp	#017-4_201_25	0,0,017-4,173,46
017-4,91,26,0	warp	#017-4_91_26	0,0,017-3,69,51
017-4,123,26,0	warp	#017-4_123_26	0,0,017-3,32,69
017-4,166,26,0	warp	#017-4_166_26	0,0,017-3,82,76
017-4,30,47,0	warp	#017-4_30_47	0,0,017-3,29,47
017-4,52,25,0	warp	#017-4_52_25	0,0,017-3,63,27
017-4,83,41,0	warp	#017-4_83_41	0,0,017-3,58,61
