// This file is generated automatically. All manually added changes will be removed when running the Converter.
// Map 027-5: Crypt Sub-Basement Two warps
027-5,125,17,0	warp	#027-5_125_17	4,0,027-4,21,97
