// This file is generated automatically. All manually added changes will be removed when running the Converter.
// Map 005-3: Snake Pit mobs
005-3,59,63,24,28	monster	Snake	1010,50,100000,30000
005-3,56,64,26,24	monster	Black Scorpion	1009,15,100000,30000
005-3,59,68,29,21	monster	Giant Maggot	1006,20,100000,30000
005-3,95,52,5,30	monster	Troll	1054,7,100000,30000
005-3,53,26,32,6	monster	Troll	1054,5,100000,30000
