011-6,264,236,0	script	#BL_Barrier2	NPC45,0,0,{
    @state = ((QUEST_Hurnscald & NIBBLE_0_MASK) >> NIBBLE_0_SHIFT);

    if (@state >= 6) goto L_Lord_Hideout_Open;
    message strcharinfo(0), "You have a feeling that you should not enter this place now.";
    goto L_End;

L_Lord_Hideout_Open:
    warp "011-6",174,255;
    goto L_End;

L_End:
    @state = 0;
    end;
}
