// This file is generated automatically. All manually added changes will be removed when running the Converter.
// Map 013-3: Woodland Hills Cave warps
013-3,34,63,0	warp	#013-3_34_63	0,0,013-1,125,103
013-3,36,96,0	warp	#013-3_36_96	0,0,013-3,79,126
013-3,79,125,0	warp	#013-3_79_125	0,0,013-3,35,96
013-3,22,115,0	warp	#013-3_22_115	0,0,018-1,115,41
013-3,139,45,0	warp	#013-3_139_45	0,0,018-1,127,37
013-3,61,179,0	warp	#013-3_61_179	0,0,018-1,134,46
013-3,69,143,0	warp	#013-3_69_143	0,0,018-3,50,89
013-3,81,103,0	warp	#013-3_81_103	0,0,018-1,147,41
013-3,177,91,0	warp	#013-3_177_91	0,0,018-1,177,21
013-3,178,44,0	warp	#013-3_178_44	0,0,018-3,97,70
013-3,169,45,0	warp	#013-3_169_45	0,0,018-3,27,55
013-3,152,28,0	warp	#013-3_152_28	0,0,018-3,134,62
013-3,123,104,0	warp	#013-3_123_104	0,0,018-3,172,22
013-3,147,104,0	warp	#013-3_147_104	0,0,018-3,177,22
013-3,158,66,0	warp	#013-3_158_66	0,0,018-3,27,90
013-3,75,51,0	warp	#013-3_75_51	0,0,013-3,109,65
013-3,109,64,0	warp	#013-3_109_64	0,0,013-3,75,50
013-3,67,51,0	warp	#013-3_67_51	0,0,018-3,90,51
013-3,71,20,0	warp	#013-3_71_20	0,0,013-3,28,39
013-3,28,41,0	warp	#013-3_28_41	0,0,013-3,71,21
013-3,71,42,0	warp	#013-3_71_42	0,0,013-3,109,21
013-3,109,20,0	warp	#013-3_109_20	0,0,013-3,71,41
013-3,111,42,0	warp	#013-3_111_42	0,0,018-3,71,123
013-3,62,100,0	warp	#013-3_62_100	0,0,018-3,174,86
013-3,68,97,0	warp	#013-3_68_97	0,0,018-3,102,70
013-3,160,103,0	warp	#013-3_160_103	0,0,009-3,117,20
