// This file is generated automatically. All manually added changes will be removed when running the Converter.
// Map 006-2: Pachua's Village warps
006-2,67,65,0	warp	#006-2_67_65	0,0,006-1,23,101
006-2,65,73,0	warp	#006-2_65_73	0,0,006-1,21,109
006-2,48,44,0	warp	#006-2_48_44	0,0,006-1,23,86
006-2,58,44,0	warp	#006-2_58_44	0,0,006-1,33,86
