import: npc/001-1/_import.txt
import: npc/001-2-0/_import.txt
import: npc/001-2-1/_import.txt
import: npc/001-2-2/_import.txt
import: npc/001-2-3/_import.txt
import: npc/002-1/_import.txt
import: npc/002-3-0/_import.txt
import: npc/002-3-1/_import.txt
import: npc/002-3-2/_import.txt
import: npc/002-3-3/_import.txt
import: npc/002-3-4/_import.txt
