{
	"name": "breath_of_time",
	"description": "This mod adds mechanics from \"The Legend of Zelda : Breath of the Wild\" to Ocarina of Time, such as stamina, wall climbing, running, and jumping.",
	"copyright": "Copyright © 2021, The Lost Mods",
	"license": "MIT",
	"authors": [ "SpiceyWolf" ],
	
	"targetName": "BreathOfTime",
	"targetType": "dynamicLibrary",
	
	"dependencies": {
		"crossemu:sdk": "*",
		"crossemu:gdk-n64": "*"
	}
}