{
  "/words": {
    "get": {
      "x-mojo-to": "FancyWords::Controller#list",
      "operationId": "listFancyWords",
      "tags": [
        "fun"
      ],
      "produces": [
        "application/json"
      ],
      "parameters": [
        {
          "$ref": "../parameters.json#/match"
        },
        {
          "$ref": "../parameters.json#/order_by"
        },
        {
          "$ref": "../parameters.json#/page"
        },
        {
          "$ref": "../parameters.json#/per_page"
        },
        {
          "$ref": "../parameters.json#/q_param"
        },
        {
          "$ref": "../parameters.json#/q_body"
        },
        {
          "$ref": "../parameters.json#/q_header"
        }
      ],
      "responses": {
        "200": {
          "description": "A list of fancy words",
          "type": "array",
          "items":  {
            "schema": {
              "type": "object",
              "properties": {
                "fancy_word_id": {
                  "description": "Internal fancy word identifier",
                  "type": "integer"
                },
                "word": {
                  "description": "The fancy word",
                  "type": "string"
                },
                "timestamp": {
                  "description": "Latest change timestamp",
                  "type": "string",
                  "format": "date-time"
                }
              }
            }
          }
        },
        "403": {
          "description": "Access forbidden",
          "schema": {
            "$ref": "../definitions.json#/error"
          }
        },
        "500": {
          "description": "Internal error",
          "schema": {
            "$ref": "../definitions.json#/error"
          }
        },
        "503": {
          "description": "Under maintenance",
          "schema": {
            "$ref": "../definitions.json#/error"
          }
        }
      },
      "x-koha-authorization": {
        "permissions": {
          "tools": "1"
        }
      }
    },
    "post": {
      "x-mojo-to": "FancyWords::Controller#add",
      "operationId": "addFancyWord",
      "tags": [
        "fun"
      ],
      "parameters": [
        {
          "name": "body",
          "in": "body",
          "description": "A JSON object containing informations about the new hold",
          "required": true,
          "schema": {
            "type": "object",
            "properties": {
              "word": {
                "description": "The fancy word",
                "type": "string"
              }
            }
          }
        }
      ],
      "produces": [
        "application/json"
      ],
      "responses": {
        "201": {
          "description": "Fancy word added",
          "schema": {
            "type": "object",
            "properties": {
              "fancy_word_id": {
                "description": "Internal fancy word identifier",
                "type": "integer"
              },
              "word": {
                "description": "The fancy word",
                "type": "string"
              },
              "timestamp": {
                "description": "Latest change timestamp",
                "type": "string",
                "format": "date-time"
              }
            }
          }
        },
        "401": {
          "description": "Authentication required",
          "schema": {
            "$ref": "../definitions.json#/error"
          }
        },
        "403": {
          "description": "Access forbidden",
          "schema": {
            "$ref": "../definitions.json#/error"
          }
        },
        "500": {
          "description": "Internal error",
          "schema": {
            "$ref": "../definitions.json#/error"
          }
        },
        "503": {
          "description": "Under maintenance",
          "schema": {
            "$ref": "../definitions.json#/error"
          }
        }
      },
      "x-koha-authorization": {
        "permissions": {
          "tools": "1"
        }
      }
    }
  },
  "/words/{fancy_word_id}": {
    "get": {
      "x-mojo-to": "FancyWords::Controller#get",
      "operationId": "getFancyWord",
      "tags": [
        "fun"
      ],
      "parameters": [
        {
          "name": "fancy_word_id",
          "in": "path",
          "description": "Internal fancy word identifier",
          "required": true,
          "type": "string"
        }
      ],
      "produces": [
        "application/json"
      ],
      "responses": {
        "200": {
          "description": "A fancy word",
          "schema": {
            "type": "object",
            "properties": {
              "fancy_word_id": {
                "description": "Internal fancy word identifier",
                "type": "integer"
              },
              "word": {
                "description": "The fancy word",
                "type": "string"
              },
              "timestamp": {
                "description": "Latest change timestamp",
                "type": "string",
                "format":"date-time"
              }
            }
          }
        },
        "404": {
          "description": "Fancy word not found",
          "schema": {
            "$ref": "../definitions.json#/error"
          }
        },
        "500": {
          "description": "Internal error",
          "schema": {
            "$ref": "../definitions.json#/error"
          }
        },
        "503": {
          "description": "Under maintenance",
          "schema": {
            "$ref": "../definitions.json#/error"
          }
        }
      },
      "x-koha-authorization": {
        "permissions": {
          "tools": "1"
        }
      }
    },
    "put": {
      "x-mojo-to": "FancyWords::Controller#update",
      "operationId": "updateFancyWord",
      "tags": [
        "fun"
      ],
      "parameters": [
        {
          "name": "fancy_word_id",
          "in": "path",
          "description": "Internal fancy word identifier",
          "required": true,
          "type": "string"
        },
        {
          "name": "body",
          "in": "body",
          "description": "A fancy word",
          "required": true,
          "schema": {
            "type": "object",
            "properties": {
              "word": {
                "description": "The fancy word",
                "type": "string"
              }
            }
          }
        }
      ],
      "produces": [
        "application/json"
      ],
      "responses": {
        "200": {
          "description": "A Fancy word",
          "schema": {
            "$ref": "../definitions.json#/city"
          }
        },
        "401": {
          "description": "Authentication required",
          "schema": {
            "$ref": "../definitions.json#/error"
          }
        },
        "403": {
          "description": "Access forbidden",
          "schema": {
            "$ref": "../definitions.json#/error"
          }
        },
        "404": {
          "description": "Fancy word not found",
          "schema": {
            "$ref": "../definitions.json#/error"
          }
        },
        "500": {
          "description": "Internal error",
          "schema": {
            "$ref": "../definitions.json#/error"
          }
        },
        "503": {
          "description": "Under maintenance",
          "schema": {
            "$ref": "../definitions.json#/error"
          }
        }
      },
      "x-koha-authorization": {
        "permissions": {
          "tools": "1"
        }
      }
    },
    "delete": {
      "x-mojo-to": "FancyWords::Controller#delete",
      "operationId": "deleteFancyWord",
      "tags": [
        "fun"
      ],
      "parameters": [
        {
          "name": "fancy_word_id",
          "description": "Internal fancy word identifier",
          "required": true,
          "type": "string"
        }
      ],
      "produces": [
        "application/json"
      ],
      "responses": {
        "204": {
          "description": "Fancy word deleted"
        },
        "401": {
          "description": "Authentication required",
          "schema": {
            "$ref": "../definitions.json#/error"
          }
        },
        "403": {
          "description": "Access forbidden",
          "schema": {
            "$ref": "../definitions.json#/error"
          }
        },
        "404": {
          "description": "Fancy word not found",
          "schema": {
            "$ref": "../definitions.json#/error"
          }
        },
        "500": {
          "description": "Internal error",
          "schema": {
            "$ref": "../definitions.json#/error"
          }
        },
        "503": {
          "description": "Under maintenance",
          "schema": {
            "$ref": "../definitions.json#/error"
          }
        }
      },
      "x-koha-authorization": {
        "permissions": {
          "tools": "1"
        }
      }
    }
  }
}
