{
    "credentials": [
        {
            "id": "31lvhwxlbchkwvu25mh66nwu7hqi",
            "gender": "female",
            "firstName": "Mala",
            "lastName": "Borra",
            "email": "Ajit1997@yahoo.zero",
            "password": "q4@R@n3Xq2XG",
            "birthDate": "05/10/2005",
            "username": "malaBorra2005"
        },
        {
            "id": "313dq56uyr7gyfr7bmvfu5kv7qnq",
            "gender": "male",
            "firstName": "Aravind",
            "lastName": "Brahmbhatt",
            "email": "Agrawal17@express.site",
            "password": "Xv8JrgUxdP$E",
            "birthDate": "25/06/2005",
            "username": "aravindBrahmbhatt2005"
        }
    ]
}