 Assignments - Electronic Submit - Wet-2-Appeals - Second time - Gilad
 Your assignment has been successfully submitted.
 Transaction summary:
 Date:  4/7/2022, 20:58:05
 Assignment:    Wet-2-Appeals - Second time
 Course:    234218 (Data Structures 1)
 Semester:  Spring 2022
 Submitted by:  206584021, 318308244
 File name: submission.zip
 File size: 512K

 Confirmation code: 234218-202102-318308244-1326930
