{
  "root": [
    {
      "isbn": "3271897391",
      "title": "42: a life full of surprises",
      "description": "Boy! You MUST read this book!",
      "isAvailable": "true",
      "isBooked": false
    },
    {
      "isbn": "654524121",
      "title": "The Bible",
      "description": "Same old story",
      "isAvailable": "true",
      "isBooked": false
    }
  ]
}
