id,time,date,comments,message,shares,likes
471034402958762_1499980280064164,12:44:02,2017-04-18,0.0,"Spotto il ragazzo alto e moro che ha preso il treno a Mestre direzione Bologna alle 13 e 54. Sceso a Padova. Jeans larghi, vans, felpa grigia col cappuccio e giacca verde. Skateboard con la parte inferiore disegnata con colori accesi, fucsia in particolare. A presto, spero.",0,0.0
471034402958762_1499979956730863,12:43:35,2017-04-18,0.0,"Spotto il ragazzo che era seduto di fronte a me sul treno partito da Verona alle 10.20 e diretto a Venezia S. Lucia il 18/04. Avevi una giacca verde, i jeans e una maglia color panna. Stavi studiando qualcosa riguardante le equazioni mentre io stavo leggendo i miei appunti di letteratura francese e siamo scesi entrambi a Padova. Non sono riuscita a parlarti perché due turisti tedeschi si sono seduti accanto a noi, ma mi hanno tanto colpita i tuoi occhi azzurri. Mi piacerebbe rivederti e conoscerti meglio!",0,0.0
471034402958762_1499932023402323,11:42:30,2017-04-18,0.0,Spottiamo il culo di marmo e i polpacci d'acciaio del ragazzo che sfrecciava in bici alle 12:45 alla rotonda del biri... abbiamo apprezzato la scelta dei bermuda in questa giornata fredda e ventosa che hai riscaldato con la tua prepotente virilità. La lobby gay del pandino bianco (ci sono comunque anche due donne all'interno),0,9.0
471034402958762_1499789050083287,08:02:17,2017-04-18,0.0,"Spotted: ""Unipd"" - Università di Padova added a new photo.",3.0,120.0
471034402958762_1499417576787101,22:19:12,2017-04-17,0.0,"Spotto la ragazza vestita sportiva,con auricolari e fascia per smartphone,che alle 19 di Sabato ha incrociato il mio sguardo nella corsia delle bibite dell Eurospar vicino la Ceccarelli. Probabilmente è in Erasmus,aveva cappelli lisci,raccolti in una coda e andava molto di fretta..
 Quando ci facciamo una corsetta assieme?",0,0.0
471034402958762_1499276346801224,19:24:09,2017-04-17,1.0,"Cena di Pasqua (16/04)
 Spotto il cameriere magro, moro e con baffi dell’osteria “Al Peronio”. Il tuo sorriso e la tua voce mi sono rimasti impressi, sia all’esterno che all’interno del locale. Mi hai proprio rallegrato la serata. Palesati per un caffè!",0,2.0
471034402958762_1499187183476807,17:30:47,2017-04-17,7.0,"Sotto Silvia del primo anno di medicina. Ci siamo conosciuti per gioco ma nonostante tu sia arrogante, spocchiosa e saccente non riesco a dimenticarmi di te. N.",0,3.0
471034402958762_1497958930266299,15:11:54,2017-04-16,1.0,"Spotto la stupenda ragazza che lavora a 88 ristoranti, avvistata oggi (15 aprile). Ero a cenare là verso le 20 e ti ho vista per la seconda volta (la prima in università). Alta, capelli scuri. Mi hai servito un paio di volte, ma sicuramente non mi hai notato, avevo una maglia nera con una tigre bianca. La prima volta che ti ho vista hai subito rapito il mio sguardo e suscitato il mio interesse, ma ora ti dovevo spottare. Se ti va, palesati",0,4.0
471034402958762_1497958336933025,15:11:02,2017-04-16,1.0,"Spotto ragazza che studia veterinaria (mi pare di ricordare si chiamasse Giulia), scout, che all' evento della zona di Treviso venerdì 14 aprile mi ha salutato. Scusa non non sapevo chi tu fossi ma mi sei sembrata molto simpatica. Palesati che se hai piacere ti offro uno spritz.",0,5.0
471034402958762_1497724670289725,10:42:05,2017-04-16,2.0,Buona Pasqua a tutti voi <3,4.0,305.0
471034402958762_1496787240383468,14:57:09,2017-04-15,3.0,"Spottiamo il cameriere di Chaki ... Come ti metti apposto il ciuffo tu, non lo fa nessuno Le tue ammiratrici",0,16.0
471034402958762_1496635117065347,12:16:58,2017-04-15,0.0,"Spotto il mio portafoglio perso ieri sera al factory, era un iclip, se lo avete trovato vi prego di consegnarlo li all entrata. Tenetevi pure i soldi, ma avevo tutte le carte ed i tesserini di lavoro dentro..",0,3.0
471034402958762_1496561113739414,10:30:14,2017-04-15,4.0,"Buongiorno a tutti! 
 Dunque, l'altro giorno prendendo il treno da Verona a Brescia ho avuto il piacere di scambiare due parole con una ragazza di Brescia che è iscritta all'UNIPD. So che frequenta il primo anno di relazioni internazionali, è una grande viaggiatrice ed è di una simpatia e cordialità fuori dal normale. Mi ha inoltre detto che dovrebbe venire prossimamente verso Pisa/Firenze a farsi un giro con una sua amica. Purtroppo non mi ricordo come fa di cognome, motivo per cui scrivo qui. Mi piacerebbe invitare lei e la sua amica, quando passano, a prenderci un caffè e magari a indicare snche qualche luogo molto interessante da visitare per la via",0,2.0
471034402958762_1496519537076905,09:33:04,2017-04-15,40.0,"Spotto il dipartimento di ingegneria, l'aula N, i piccioni e il loro nido. #freepiccioni",7.0,796.0
471034402958762_1496509387077920,09:16:42,2017-04-15,12.0,"Spotto voi che insieme rideste, rideste, rideste.

 Spotto voi che rideste molto e molte volte insieme.

 Ho fatto log in solo per scrivere questo.

 Chiunque voi siate, non so se ancora qualche volta ridiate.",1.0,25.0
471034402958762_1496509117077947,09:16:05,2017-04-15,6.0,"Ciao! Spotto Giovanni, che giovedì 13 in portello mi ha regalato un uovo di pasqua senza conoscermi. La ""pazzia"" della lettera non la posso fare, ma il gesto e il coraggio (e il cioccolato) sono stati molto apprezzati.
 Spero troverai un'altra ragazza che ti colpisce da conquistare con i dolci! E.",0,20.0
471034402958762_1496508043744721,09:13:58,2017-04-15,0.0,"spotto il/la batterista ignoto/a che suonava oggi 14/04 nel condominio rosso di via Avanzo di fianco al prix! Cazzo è da un sacco che sto pensando a trovare un batterista in quel di pd e ho sentito un bel groove, se non sei già impegnato/a si può mettere in piedi qualcosina",0,0.0
471034402958762_1495679823827543,15:26:40,2017-04-14,2.0,"Spotto il ragazzo che avevo davanti in aula studio Jappelli, biondo cenere e occhi azzurri, che studia matematica e aveva un portatile della mac bianco. Zainetto grigio e rosso, telefono con la cover nera. Ti aspetto per un caffè amico!",0,3.0
471034402958762_1495598193835706,13:43:10,2017-04-14,1.0,Spotto la giurista avvistata ieri 13/04 tra i banchi di privato 2 con una graziosa giacchetta verde. Facci sognare ancora!,0,0.0
471034402958762_1495597890502403,13:42:45,2017-04-14,5.0,spotto il mio telefono cellulare (samsung galaxy s3) perso in zona policlinico!,0,1.0
471034402958762_1495597770502415,13:42:26,2017-04-14,1.0,"Spotto la ragazza che ieri mattina , giovedì 13 aprile, era in aula studio in ex fiat. Capelli lunghi castano chiaro e lisci, avevi un maglione blu scuro ed eri lì a studiare con una tua amica. I due ragazzi che ogni tanto ti guardavano ti stanno cercando",0,0.0
471034402958762_1495597223835803,13:41:49,2017-04-14,0.0,Spotto il ragazzo con la maglietta blu ed i jeans della Lee appena sceso a Noale dal bus Padova-Treviso delle 13:45. Rivelati,0,0.0
471034402958762_1495427920519400,10:31:26,2017-04-14,6.0,"Spotto il ragazzo che oggi ha fatto l'esame di inglese base... Avevi una camicia bianca, pantaloni scuri e converse bianche... Mi pare di aver capito ti chiamassi Luca, eri tutto agitato prima dell'esame e dicevi al tuo amico che non sapevi nulla... Poi invece se non sbaglio hai preso trenta ed eri felicissimo! Aspetto che mi offri uno spritz per questo tuo successo!",0,2.0
471034402958762_1495409487187910,10:08:33,2017-04-14,103.0,"""Ingegneri e fisici sono nemici per natura.
Come gli psicologi e gli ingegneri,
O i medici e gli ingegneri,
O i giuristi e gli ingegneri,
O gli ingegneri ed altri ingegneri!
Dannati ingegneri! Hanno distrutto l'ingegneria!"" (semi-cit.)",27.0,917.0
471034402958762_1495373917191467,09:28:56,2017-04-14,0.0,"Spotto il ragazzo che oggi, venerdì 14 aprile, stava suonando Comptine d'un autre été al pianoforte della stazione. Palesati.",0,25.0
471034402958762_1495299713865554,07:53:22,2017-04-14,3.0,"ATTENZIONE: sto cercando GIORGIA GIOVANNINI, farmacista, 29 anni di Trento, per restituirle il portafoglio che ha perso per strada in zona Portello. Non riesco a rintracciarla, se qualcuno la conosce mi faccia avere il suo recapito.",0,25.0
471034402958762_1494798437249015,20:18:14,2017-04-13,1.0,Spotto ragazza capelli rossi e dilatatori che ieri notte era in piazzetta davanti al circolò nadir! Gran bella ragazza!,0,1.0
471034402958762_1494797043915821,20:15:35,2017-04-13,0.0,"URGENTE, VALIGIE SUL TRENO
 Spotto la ragazza che questa sera GIOVEDI 13 aprile mi ha TENUTO LE VALIGIE SUL TRENO. fatti viva grazie, scrivo ai like",0,0.0
471034402958762_1494796233915902,20:14:42,2017-04-13,7.0,"Spotto Enrico C. 👖 al terzo anno di farmacia. Sei ameno.

P.S. è ora di dare una spuntatina alla chioma.",0,9.0
471034402958762_1494680460594146,18:00:33,2017-04-13,0.0,"Io e una mia amica spottiamo il ragazzo che era sul treno regionale delle 18.26 diretto a Verona Porta Nuova del 13/04. Sei stato molto gentile perché ci hai lasciato il posto per una valigia. Hai i capelli castano chiaro, barba, occhi azzurri e cappellino rosso. Stavi studiando chimica (pensiamo) e sei sceso a Lerino. Palesati che ti offriamo volentieri un caffè!",0,0.0
471034402958762_1494679030594289,17:59:12,2017-04-13,0.0,"Spotto Ilaria, la ragazza che ho conosciuto venerdì alla corte sconta. Ti ho aspettata l'altra sera ma niente. Ci ho sperato in questo appuntamento tanto bizzarro quanto fico. Speravo che una comparsata così riuscisse a colpirti, e non te ne dimenticassi nel giro di qualche giorno.
 Daje che mi devi uno sprisssss",0,2.0
471034402958762_1494677950594397,17:58:13,2017-04-13,0.0,"giorno: 13/04/2017 - ora: 17:00 (circa) - luogo: semaforo di fronte al ponte di S. Omizzolo.
 Spotto la ragazza mora vestita di bianco con una borsa nera tenuta stretta a braccio.
 Abbiamo fatto la stessa strada fino alla stazione dei treni, poi ti ho persa nel sottopassaggio. Ti ho notata perché, come me, avevi la faccia di una stanca di rosicare come i tarli nei mobili di legno guardando le coppiette che si baciano sulle panchine. Facciamoci un favore entrambi: usciamo insieme.
 P.S.
 Sono il ragazzo con la felpa blu scuro e la borsa da pc nera.",0,1.0
471034402958762_1494677673927758,17:57:46,2017-04-13,1.0,"Spotto 
 4 ragazze 
 che sono passate davanti al collegio don mazza ieri pomeriggio alle 16.30. Si stava laureando una di voi
 Siete simpatiche",0,1.0
471034402958762_1494484033947122,14:37:55,2017-04-13,1.0,"Vorrei spottare quel gran pezzo di gnocco, alto e dalla folta chioma scura come la pece (per curiosità usi lo shampoo pantene?) che credo studi filosofia. Vedo che spesso ti aggiri per il corridoio della biblioteca e più di una volta sbirciavi dalla porta e il nostro sguardo si è incrociato. Hai perso qualcosa per caso? Se si tranquillo che te la do io!!
Ti aspetto martedì alle macchinette alle 14. Una tua ammiratrice",0,10.0
471034402958762_1494438040618388,13:45:08,2017-04-13,7.0,"Spotto chiara (si evinceva il nome dalla collana) con la maglia verde acqua e jeans neri, avvistata oggi a pranzo in forcellini. Palesati che magari la prossima volta il pranzo in forcellini lo facciamo assieme",0,4.0
471034402958762_1494437727285086,13:44:39,2017-04-13,0.0,"Probabilmente non conosci questa pagina, ma chissà magari, in qualche modo il messaggio ti arriverà...... ci incontriamo spesso all'alì (guizza) perché lavori lì... sarebbe bello prendere un caffè insieme..........",0,2.0
471034402958762_1494436157285243,13:43:43,2017-04-13,0.0,"Vorrei spottare una ragazza che oggi 13/04 è salita sul treno delle 12:10 sul primo binario ed è scesa a Monselice per il cambio, aveva lo zaino rosa, mora con occhiali da vista neri e giacca in jeans (molto carina)",0,0.0
471034402958762_1494348200627372,12:06:43,2017-04-13,0.0,Spotto le simpaticone delle amiche di una certa Chiara che oggi alla San Francesco l'hanno fatta chiamare al microfono per recuperare il suo telefono #scherzoni 🙈,0,1.0
471034402958762_1494347940627398,12:06:13,2017-04-13,7.0,"Spotto.... (anche se sono certa che non leggerà mai questo post) ragazzo avvistato 10\04 e 12\04 in aula studio Galilei. Lunedì indossava una polo a righe bianche e celesti, ieri una polo grigia. Per favore, se il destino ti porta a leggere questo post, ridammi subito il mio cuore perché te lo sei portato via. Dalla ragazza che ti ha fissato tutto il lunedì pomeriggio.",0,0.0
471034402958762_1494331143962411,11:50:53,2017-04-13,15.0,Ho perso il mio trolley blu al capolinea del tram pontevigodarzere.,0,8.0
471034402958762_1494219777306881,09:26:59,2017-04-13,1.0,"Spotto la ragazza che ieri 12 aprile si è tesserata con me alla biblioteca universitaria in via San Biagio, intorno alle 11:30. Ho fatto solo in tempo a ""indovinare"" cosa studiavi (logopedia) perché dovevo andare ad un colloquio col prof., ma se ti va uno spritz te lo offro volentieri.",0,1.0
471034402958762_1494177020644490,08:10:47,2017-04-13,18.0,"In diversi ci spottano ""la mal capitata bici in Portello. Appesa alla forca come all'epoca dei pirati """,12.0,1252.0
471034402958762_1494173803978145,08:07:59,2017-04-13,0.0,"Esco di casa a fumare a 1.40... Spotto chi stava ascoltando ""One of these days"" a volumi astronomici! Chiamatemi la prossima volta se c'è vagiaina a cui piace musica del genere!",0,11.0
471034402958762_1494172970644895,08:07:22,2017-04-13,3.0,Spotto la ragazza che oggi (12/04) davanti a Mango ha pestato un sacchetto di carta e ha urlato pensando di aver pestato chissà cosa! Volevo solo dirti che mi hai rallegrato la giornata con il tuo urlo da isterica 😂😂😂,0,13.0
471034402958762_1494170977311761,08:05:58,2017-04-13,10.0,"Urgente
 Tra ottobre e mercoledì scorso ho perso la voglia di studiare. Mi aggiravo in piazza dei Signori...ma potrei averla persa anche all'università.. Chiunque la ritrovi la porti in segreteria! 
 Vi prego, mia mamma ci tiene moltissimo e mi sono resa conto che serve anche a me.",3.0,752.0
471034402958762_1494170230645169,08:05:18,2017-04-13,2.0,"Spotto colei che incrocio ogni mattina in centro a San Giorgio in bosco e che molto spesso faccio passare sulle strisce pedonali. Prendi il bus SITA verso le 7,45 circa. Capelli lunghi, Castana, media statura. Spero di rivederti ancora.
Oggi 13/04 eri in fermata in centro alle 7.40",0,1.0
471034402958762_1493661710696021,19:40:56,2017-04-12,5.0,"Cerco una ragazza che mi ha veramente rubato il cuore..
 Era nella basilica del Santo.. nella messa delle ore 18 della domenica delle palme. Bionda e con la coda.. pantaloni a 3/4 neri.. hogan colore chiaro.. occhiali da sole..e portavi una borsa rossa in pelle sulle spalle.. Eri con un amica.. e siete andate a riprendere la bicicletta di fronte la basilica..",0,4.0
471034402958762_1493649890697203,19:26:28,2017-04-12,0.0,"Spotto il corrente Michele che ha giocato al gioco ""Soliti Ignoti"" questa sera su rai 1. Sei bellissimo. Palesati",0,3.0
471034402958762_1493646657364193,19:22:28,2017-04-12,2.0,"San Gaetano: Spotto la tipa che oggi pomeriggio (12/04) è venuta a studiare con una sua amica bionda (poi scomparsa) :) tu eri castana, avevi un maglioncino grigio, una t-shirt sempre grigia e delle converse... Già la mia concentrazione era precaria, tu mi hai fatto sconcentrare del tutto!",0,2.0
471034402958762_1493626807366178,18:58:02,2017-04-12,11.0,"Spotto me stesso, che dopo essere stato oggi per la prima volta dai Sumiti, mi sono reso conto che non si tratta di un'attività gestita da medio-orientali/egiziani ahah 😂 
A quanto pare ho fatto un po' di confusione tra Sumiti e Sumeri 😂 

P.s. Fabri Fibra si è probabilmente ispirato a me per scrivere ""Fenomeno""",0,247.0
471034402958762_1493622954033230,18:55:27,2017-04-12,3.0,"Via falloppio, 17.30 
 Spotto Maria, mitica vecchietta in girello che tentava di svignarsela dall'ospedale..con tanto di infermiera che le correva dietro!! 😂",0,552.0
471034402958762_1493621580700034,18:54:38,2017-04-12,0.0,"Oggi 12/04 diritto privato con Roma, spotto il ragazzo con pantaloni beige e la camicia mimetica che si siede sempre in fondo. So che sei al 3 anno e ti ho sentito parlare in russo qualche giorno fa.. palesati",0,1.0
471034402958762_1493620294033496,18:53:50,2017-04-12,0.0,"Spotto ragazzo alto, moro, con camicia celeste, zaino north face verde e scarpe rosse etnies che ha preso il regionale da PD in direzione a Venezia delle 15,05. 
 Fatti avanti che ci prendiamo un caffè, la ragazza mora con pantaloni neri e sciarpa a fiori.",0,0.0
471034402958762_1493619237366935,18:53:25,2017-04-12,1.0,"Vorrei spottare la ragazza che oggi, 12 aprile, ha preso il treno per Bologna delle 19.10 ed è scesa o ha cambiato a Ferrara. Zaino blu tipo north face con un cuscino per il collo verde fluo legato, jeans, felpa, giubbotto verde scuro e New Balance. Sei una delle ragazze più belle che io abbia mai visto.",0,0.0
471034402958762_1493526264042899,17:10:41,2017-04-12,0.0,"Spotto la ragazza carinissima dai capelli castani che ho visto oggi mentre studiava con un (spero) amico in San Gaetano! Tu avevi una maglia grigia, pantaloni e cintura neri, scarpe nike grigie! Eri bassina, mentre invece il tuo amico era alto e con una maglia a fantasia militare (ma lui non mi interessa) :D fatti viva! :D",0,0.0
471034402958762_1493521800710012,17:05:35,2017-04-12,1.0,Vorrei spottare la ragazza con i dread che fa filosofia (credo sia al secondo anno). Oggi era in biblioteca al Liviano ma ogni volta la sua bellezza mi toglie il fiato,0,1.0
471034402958762_1493521514043374,17:05:15,2017-04-12,1.0,"Spotto Giovanni D. controllore di Trenitalia.

Sei MANZO, non voglio uscirti solo l'abbonamento.",1.0,16.0
471034402958762_1493521227376736,17:04:49,2017-04-12,2.0,"Spotto Nicola del 3º anno di Ingegneria Civile, che piuttosto di stare attento alle lezioni di Topografia gioca con il telefono e disturba. La prossima volta che ci chiedi gli appunti li vedi alla distanza massima che può misurare un teodolite. Ti perdoniamo solo perché ci dai le caramelle.",0,10.0
471034402958762_1493292624066263,13:14:49,2017-04-12,0.0,"Spotto ragazza con capelli castani, leggermente mossi vista oggi Mercoledì 12 Aprile alla mensa Murialdo, indossavi una maglia a righe orizzontali bianca e nera, avevi uno zaino fucsia e te ne sei andata alle 13.15. Palesati che uno spritz in centro te lo offro volentieri",0,0.0
471034402958762_1493292357399623,13:14:11,2017-04-12,0.0,"Spotto il vecchio pazzo strabico che stamattina sul treno per Venezia Mestre andava su e giù tenendo uno strano sacco in paglia, sbattendo le porte e sbraitando cose senza senso alla gente. Grazie per avermi fatto venire l'ansia",0,32.0
471034402958762_1493291374066388,13:12:54,2017-04-12,9.0,"Spotto ragazzo con dei bellissimi occhi che oggi a mezzogiorno e mezzo ha vinto un uovo di Pasqua in Murialdo. Palesati, la sorpresa che posso darti io potrebbe piacerti più di quella che troverai nell'uovo",0,56.0
471034402958762_1493232470738945,11:58:36,2017-04-12,3.0,Spotto tutti gli imbianchini sexy del pianeta a nome di una mia amica follemente presa dal loro portamento alquanto rozzo ma estremamente attraente.,0,10.0
471034402958762_1493173420744850,10:37:58,2017-04-12,5.0,"Ti spotto perché oggi nemmeno i musulmani durante storia medievale mi hanno tenuto concentrato.
 Ti sei seduta accanto a me sicuramente perché l'aula era piena, comunque avevi un giubbotto di pelle nero, delle scarpe alte bianche e dei capelli ricci che avrebbero fermato qualsiasi espansione islamica da quanto erano belli.
 Se ti va un caffè o un spritz non esitare a chiedere!",0,11.0
471034402958762_1493127984082727,09:34:39,2017-04-12,1.0,"Spotto la ragazza coi capelli corti rosa e la giacca di Jeans vista oggi a storia del teatro nel complesso Calfura, le decorazioni sulla tua giacca sono bellissime, mi piace un botto il gatto verde con tre occhi, le hai fatte tu?",0,1.0
471034402958762_1492690824126443,22:30:07,2017-04-11,30.0,Vorrei spottare quella gran manza da allevamento di Nicole che oggi era seduta in quarta fila in aula Ramazzini. Ogni volta che te vedo el me Cuore se sgretoea come na panocia in boca a na vaca.,4.0,402.0
471034402958762_1492626110799581,21:18:30,2017-04-11,1.0,"Io ci provo... Circa 3 mesi sa o 4 ho incontrato un ragazzo all' altezza di ponte Molino a Padova! Stavi andando in stazione e io a prendere le sigarette ... Io ero un po' agitata e tu mi hai chiesto se andava tutto bene poi mi hai accompagnata fino al tabacchi e hai proseguito per la tua strada, so solo che ti chiami Chris e che abiti lì... Se ci sei batti un like.. speravo di incontrarti sempre lì.... Ma nulla... E volevo ringraziarti ...",0,0.0
471034402958762_1492625620799630,21:17:51,2017-04-11,0.0,"Spotto la ragazza con la treccia bionda, la carnagione chiara e la maglietta bianca che oggi, 11 aprile, verso le 18:00 era in aula studio Vallisneri. Quando te ne sei andata avevi il giubbotto in pelle nero e poi ti ho rivista passeggiare con l'amica lungo il piovego. Palesati che vorrei conoscerti !",0,1.0
471034402958762_1492625067466352,21:17:27,2017-04-11,3.0,"Aula studio TITO LIVIO:
 Spotto ragazza che studiava verso le 19/19.30 al tavolo subito sotto ai 3 gradini del bagno dei maschi. Leggermente riccia e con un computerino (credo grigio della Asus)",0,4.0
471034402958762_1492624820799710,21:17:02,2017-04-11,1.0,"Spotto Alessandro, il bibliotecario dai capelli lunghi e con gli occhiali. Mi hanno riferito che ora lavori a filosofia. Spero di rivederti presto al Maldura, qui si sente la tua mancanza. Eri sempre così gentile e disponibile, riservavi sempre un saluto e un gran sorriso a tutti. Purtroppo la mia timidezza non mi ha mai permesso di venire a parlarti. Mi hanno riferito anche che ora sei fidanzato. Lasciatelo dire, il tuo ragazzo è molto fortunato!!! Spero comunque che il destino un giorno possa farci incontrare",0,1.0
471034402958762_1492624550799737,21:16:29,2017-04-11,7.0,"Spotto Rebecca, la dottoressa dai capelli lunghisssssssssssssssssssssssssssssssssssimi che studia in biblioteca Pinali. Sei uno spettacolo!",0,36.0
471034402958762_1492624377466421,21:16:07,2017-04-11,1.0,"Ciao, spotto per conto di una mia amica il ragazzo alto, moro che sabato sera era al concerto dei Zen Circus al CSO Pedro. Aveva una camicia a quadri blu e un paio di pantaloni beige. Si è trattenuto dopo il concerto con un gruppo di amici. Mi basta sapere anche solo il nome. Per favore aiutatemi",0,0.0
471034402958762_1492624177466441,21:15:44,2017-04-11,0.0,Spotto il cameriere del Box (pizzeria) in Prato.. Complimenti alla mamma! Palesati che io non abito tanto distante da lì! Un beso,0,0.0
471034402958762_1492472517481607,18:08:47,2017-04-11,0.0,"Spotto 'donna di cuori' vista all'ingresso di consulenza del lavoro oggi verso le 13 e 45, capelli rosso scuro, piccolo tatuaggio vicino alla caviglia con un cuore e una 'Q' sempre rossi, eri vestita completamente di nero a parte la maglietta bianca. 
 Devo dire che sei qualcosa di spettacolare!",0,0.0
471034402958762_1492472244148301,18:08:18,2017-04-11,0.0,"Spotto la ragazza mora con gli occhiali seduta di fianco a me stamattina in biblioteca al San Gaetano. Avevi le cuffiette e un porta ipad rosa, non volevo disturbarti perchè sembravi assorta nello studio ma mi piacerebbe conoscerti meglio davanti a un caffè!",0,0.0
471034402958762_1492460320816160,17:50:52,2017-04-11,4.0,"Spotto, probabilmente invano, la ragazza dai capelli mossi, jeans chiari, giacca nera che oggi (11/04) era seduta sul muretto delle scale verso il binario 3 in stazione a Mestre, sola. Erano più o meno le 13.45. Maledetto me, e maledetto treno, ho perso l'occasione",0,1.0
471034402958762_1492459980816194,17:50:20,2017-04-11,0.0,"Spottiamo le ragazze che hanno spottato Paolo di Scienze Politiche GAM: abbiamo già un fan club per Paolo, se volete aggiungervi ci sta bene, altrimenti state nel vostro!",0,0.0
471034402958762_1492459654149560,17:49:52,2017-04-11,1.0,"Pam in centro ore 19

 Sporto la ragazza dai capelli biondo scuro, occhi azzurri, maglia nera e giubbotto di jeans chiaro. Vista oggi, martedì 11, alla Pam in centro. Ci siamo visti e rivisti più volte tra gli scaffali del supermercato, ci siamo scambiati diversi occhiate, anche all'uscita dal supermercato. Ho tentennato fino alla fine per fermarti... ti va uno spritz?",0,0.0
471034402958762_1492459467482912,17:49:26,2017-04-11,3.0,"Con le mie due compagne di unipd spotto il bel tipo che oggi 11 aprile intorno a mezzogiorno ha rovesciato tutto il cibo al Piovego... Se potessimo tornare indietro, ti offriremmo noi il pasto",0,8.0
471034402958762_1492413027487556,16:51:52,2017-04-11,0.0,"Spotto ragazzo che questa mattina era in aula studio Tito Livio verso le ore 10.30, eri seduto nel tavolo davanti ai bagni e studiavi da un libro di biologia-citologia medica, maglioncino bianco a righe e pantaloni marroni alto capelli scuri.",0,0.0
471034402958762_1492412794154246,16:51:26,2017-04-11,2.0,"Spotto per conto di un' amica ragazzo al primo anno di farmacia , biondo occhi azzurri con cicatrice sulla testa !!!!! Palesati furbetto",0,4.0
471034402958762_1492412564154269,16:51:00,2017-04-11,0.0,"11 aprile, ore 12.30 circa bagni piano terra del Vallisneri:
 Spotto la probabile laureanda in tacchi a spillo e illegali pantaloni rossi che era in coda per il bagno. Tanta roba!",0,0.0
471034402958762_1492411784154347,16:50:09,2017-04-11,0.0,"Spotto la ragazza con i capelli neri (ed occhi neri bellissimi) che oggi 11/04 era a fare pausa caffè alle 16, alle macchinette del paolotti. Sono il tipo con la maglietta bianca che era in coda per il caffè. Scrivimi che te lo offro volentieri",0,0.0
471034402958762_1492411130821079,16:49:13,2017-04-11,0.0,"Spotto una ragazza vista in centro sabato sera, eri con un gruppo di una quindicina di persone, capelli biondi, a caschetto, avevi un paio di jeans e adidas rosse, penso le ""gazelle"", palesati che ho perso la testa.",0,0.0
471034402958762_1492410910821101,16:48:51,2017-04-11,0.0,"Spotto un mio compagno di corso... è da un po' che ci guardiamo, e sinceramente la cosa non mi da fastidio; Il maglioncino azzurro che avevi oggi ti stava molto bene!",0,1.0
471034402958762_1492410690821123,16:48:30,2017-04-11,1.0,"Spotto ragazzo che lavora a pull&bear, occhi azzurri, barbetta e capelli castano scuro! Palesati che ti offro un caffè",0,2.0
471034402958762_1492410514154474,16:48:11,2017-04-11,0.0,"Mensa S. Francesco ore 12.00

 Ciao, volevo ""spottare"" la ragazza dalla pelle nera che oggi era in mensa S. Francesco più o meno a mezzogiorno. Come dettagli aggiuntivi mi pare avessi un vestito nero. Sei molto carina, la prossima volta si può prendere il dessert/caffè assieme",0,3.0
471034402958762_1492021414193384,09:10:14,2017-04-11,0.0,"Spotto chiunque abbia trovato una scatoletta blu brillantinata ,con un unicorno dopo Pani,davanti al negozio dei cacciatori di pelle ! Il valore affettivo è enorme

Quindi si possono tenere le cose all'interno",0,4.0
471034402958762_1492020984193427,09:09:37,2017-04-11,36.0,"Spotto me che oggi mi sono messa a piangere durante la lezione per una lite con il mio ragazzo... Spotto la mia compagna che in silenzio mi ha abbracciato regalandomi un momento di felicità... Ma soprattutto spotto il mio ragazzo, spero tu legga questo post... Ti amo... E ti prego perdonami... Ho provato tutti i mezzi per chiederti scusa e nella disperazione provo anche​ questo...",1.0,81.0
471034402958762_1492012764194249,08:52:33,2017-04-11,0.0,"Spotto la ragazza che, entrata in stazione con le cuffie, si stava ascoltando a tutto volume ""One More Time"", dei Daft Punk. La tua scelta musicale mi ha rapito, e se tu avessi voglia di uno spritz, non hai altro da fare se non palesarti!",0,17.0
471034402958762_1491991134196412,08:20:53,2017-04-11,1.0,"Spotto motociclista con zaino nero North Face (?) che ieri sera, verso le 19.40, è passato davanti alla Romana di via Manzoni, impennando con il suo Ktm. 
 La prossima volta portami con te",0,2.0
471034402958762_1491990997529759,08:20:34,2017-04-11,0.0,"Ciao, vorrei spottare una ragazza che incrocio spesso la mattina.. sei riccia, oggi avevi una maglia dei Beatles e hai lasciato la bici al dipartimento di fisica ma poi te ne sei andata. Chi sei?",0,0.0
471034402958762_1491990830863109,08:20:09,2017-04-11,0.0,"AAA cercasi ragazza mora con i capelli raccolti e giacca rossa con cappuccio in stazione stamattina verso le 8 circa scesa dal treno proveniente da vicenza!
 Help me please!",0,0.0
471034402958762_1491950090867183,07:19:54,2017-04-11,0.0,"Io e due mie amiche spottiamo tre ragazzi parecchio carini, avvistati in una Peugeot nera in Monselice mare, oggi attorno alle 13.30! Avremmo voluto salutarvi e magari proporvi un caffè insieme, ma le condizioni del traffico non lo hanno permesso  :/
rivelatevi, tre giovani donne vi aspettano con ansia!",0,0.0
471034402958762_1491949474200578,07:19:06,2017-04-11,0.0,"Spotto splendida ragazza incontrata alla conferenza lie to me del 4 aprile ore 18 circa a psicologia, eri seduta sul pavimento vicino a me in fondo all’aula. Magra, capelli biondi, quel giorno avevi una giacca in jeans e uno zainetto rosso, abbiamo parlato per un momento però dopo sei andata via prima che finisse la conferenza. Mi piacerebbe molto conoscerti.",0,0.0
471034402958762_1491948867533972,07:18:27,2017-04-11,0.0,"Mensa Pio X, 10 aprile. Spotto ragazza molto carina con tatuaggio dei doni della morte. C'erano una volta tre fratelli...",0,7.0
471034402958762_1491948434200682,07:17:38,2017-04-11,0.0,"Spotto la ragazza coi capelli neri raccolti e la felpa dei Queen che stamattina studiava nei banconi centrali del Maldura con un'amica; ci siamo incrociati in biblioteca già un paio di volte ma non ho avuto mai modo di offrirti un caffè: rilevati così rimedio!

 Il ragazzo con gli occhiali",0,0.0
471034402958762_1491948227534036,07:17:01,2017-04-11,0.0,"Treno padova-venezia 18:21

 Spotto paola, la ragazza a cui non piaceva l'incontro con un tipo programmato dall'amica. Che ne diresti invece di un caffè offerto da un interessato sconosciuto?",0,0.0
471034402958762_1491503537578505,22:43:10,2017-04-10,0.0,"Aula studio Geoscienze - lunedì 10 aprile - pomeriggio.

 Spotto in maniera molto semplice: ragazza, capelli castano chiaro, gonna nera a fiori e libro giallo.

 Palesati, perché devo ringraziarti per il saluto 👋😇",0,0.0
471034402958762_1491502124245313,22:42:33,2017-04-10,0.0,"Lunedì 10 Aprile 
 Spotto la ragazza nel treno proveniente da Verona e scesa a Padova circa alle 18.15. Eri con un'amica e indossavi dei jeans ed una maglia bianca con sopra un cardigan beige",0,0.0
471034402958762_1491501197578739,22:41:52,2017-04-10,1.0,"TITO LIVIO 10/04

Spotto il ragazzo ricciolino castano che studiava storia oggi in tito livio. Aveva una maglia grigia con una felpa azzurrina!",0,0.0
