{   
    "pet":{
    "list":[
        {   
            "id": 1,
            "name": "chó",
            "gender": "male",
            "discription": "dòng chó lai",
            "img": "https://encrypted-tbn0.gstatic.com/images?q=tbn:ANd9GcShk143OEI59LxOKRoESxz__WTQJ8Jd5v0Pgw&usqp=CAU"
        },
        {
            "id": 2,
            "name": "chó",
            "gender": "male",
            "discription": "dòng chó chân ngắn",
            "img" : "https://encrypted-tbn0.gstatic.com/images?q=tbn:ANd9GcScIoPJbDAoPbT8VrRY8c5TrmW3Upr7w5wYFQ&usqp=CAU"
        },
        {
            "id": 3,
            "name": "chó",
            "gender": "male",
            "discription": "dòng chó lai",
            "img" : "https://encrypted-tbn0.gstatic.com/images?q=tbn:ANd9GcRK9Hjf7iDLKpmj8Tl8oZTTnqCsM2gyXMFXuQ&usqp=CAU"
        },
        {
            "id": 4,
            "name": "chó",
            "gender": "male",
            "discription": "dòng chó cỏ",
            "img" : "https://encrypted-tbn0.gstatic.com/images?q=tbn:ANd9GcScIoPJbDAoPbT8VrRY8c5TrmW3Upr7w5wYFQ&usqp=CAU"
        },
        {
            "id": 5,
            "name": "chó",
            "gender": "male",
            "discription": "dòng chó săn ",
            "img" : "https://encrypted-tbn0.gstatic.com/images?q=tbn:ANd9GcQxYy4mS5E0-eG5aKeoTPTtkwal628dGFsrgA&usqp=CAU"
        },
        {
            "id": 6,
            "name": "chó",
            "gender": "male",
            "discription": "dòng chó săn bắc cực",
            "img" : "https://encrypted-tbn0.gstatic.com/images?q=tbn:ANd9GcTVvWRGpvu5Yt0BD8eR7s9n-yN_Am31rioTPg&usqp=CAU"
        }
    ]
}
   
}