{
  "Montagne":{
    "constructible":false,
    "image": "case_montagne.png"
  },
  "Desert":{
    "constructible":true,
    "image": "case_desert.png"
  },
  "Prairie":{
    "constructible":true,
    "image": "case_herbe.png"
  },
  "Foret":{
    "constructible":true,
    "image": "case_foret.png"
  }
}