0-shocked=54**aa16.72.1.47.29.16.72.1.47.29_ab_ac_ba50_bb17.1_bc150.500.8.0.1.0_bd17_be180_ca64.0.30.64.35.34.34.0.0.0.60.80_da1.0.0.100_db_dd9.3.30.50.50.50_dh2.30.50.50.2_di7_qa_qb_dc0.1.1.1.1_eh8.FFE214.100_ea8.FFE214.FFE214.56.0.0_ec16.70.FFE214.FFE214.56.38.55.1_ed22.53.0.1.FFE214.56_ef3.2.0.FFE214.FFE214.56.0_eg3.2.0.FFE214.FFE214.56.0_r0019.FFE214.FFE214.56.0.2.50.50.86.588.580.0_r0219.FFE214.FFE214.56.0.2.100.100.100.582.550.0_r0342.FFE214.FFE214.56.0.2.34.37.86.541.595.0_r0419.FFE214.FFE214.FFE214.0.2.100.59.102.562.593.0_r053.FFE214.FFE214.FFE214.0.2.4.0.62.495.561.0_r062.FFE214.FFE214.FFE214.2.2.100.100.192.527.613.0_r0717.FFE214.FFE214.FFE214.0.2.47.10.88.488.615.0_r083.FFE214.FFE214.FFE214.2.2.0.0.109.474.625.0_r0919.FFE214.FFE214.FFE214.0.2.63.51.104.579.538.0_fa12.50.50.50.50.65.56_fb_fh_fc1.9ED4FF.55.1.9ED4FF.55.50.61.61.50.50.50_fj0.0.0_fd0.0.16.FFE214.56_fe50.61_ff0000000000_fg1.50.56.0.0.1.0.0_fi_pa0.0.0.0.40.50.85.85.0.0_t00_pb_pc_pd_pe_ga0_gb0_gc0.0_ge0000000000_gh_gf_gg_gd0000000_ha100.100_hb49.1.44.90_hc0.47.39.0.47.39_hd39.1.49.49_ia_if_ib_id_ic_jc_ie_ja_jb_jd2.D62929.D62929.57_je2.D62929.D62929.57_jf_jg_ka27.FE69A1.55.55.0_kb_kc_kd_ke_kf_la31.43.FE1414.59C1FF.1_lb_oa_os_ob_oc_od_oe_of_lc_m025.59C1FF.3.0.0.1.16.15.52.41.2.61_n00_s00_og_oh_oo_op_oq_or_om_on_ok_ol_oi_oj_ad0.0.0.0.0.0.0.0.0.0

0-sad=54**aa7.98.1.28.52.7.98.1.28.52_ab_ac_ba50_bb17.1_bc150.500.8.0.1.0_bd17_be180_ca64.0.30.64.35.34.34.0.0.0.60.80_da1.0.0.100_db_dd9.3.30.50.50.50_dh2.30.50.50.2_di7_qa_qb_dc0.1.1.1.1_eh8.FFE214.100_ea8.FFE214.FFE214.56.0.0_ec16.70.FFE214.FFE214.56.38.55.1_ed22.53.0.1.FFE214.56_ef3.2.0.FFE214.FFE214.56.0_eg3.2.0.FFE214.FFE214.56.0_r0019.FFE214.FFE214.56.0.2.50.50.86.588.580.0_r0219.FFE214.FFE214.56.0.2.100.100.100.582.550.0_r0342.FFE214.FFE214.56.0.2.34.37.86.541.595.0_r0419.FFE214.FFE214.FFE214.0.2.100.59.102.562.593.0_r053.FFE214.FFE214.FFE214.0.2.4.0.62.495.561.0_r062.FFE214.FFE214.FFE214.2.2.100.100.192.527.613.0_r0717.FFE214.FFE214.FFE214.0.2.47.10.88.488.615.0_r083.FFE214.FFE214.FFE214.2.2.0.0.109.474.625.0_r0919.FFE214.FFE214.FFE214.0.2.63.51.104.579.538.0_fa12.50.50.50.50.65.56_fb_fh_fc1.9ED4FF.55.1.9ED4FF.55.50.61.61.50.50.50_fj0.0.0_fd0.0.16.FFE214.56_fe50.61_ff0000000000_fg1.50.56.0.0.1.0.0_fi_pa0.0.0.0.40.50.85.85.0.0_t00_pb_pc_pd_pe_ga0_gb0_gc0.0_ge0000000000_gh_gf_gg_gd0000000_ha79.79_hb49.1.29.90_hc0.59.39.0.59.39_hd5.1.49.49_ia_if_ib_id_ic_jc_ie_ja_jb_jd2.D62929.D62929.57_je2.D62929.D62929.57_jf_jg_ka27.FE69A1.55.55.0_kb_kc_kd_ke_kf_la31.43.FE1414.59C1FF.1_lb_oa_os_ob_oc_od_oe_of_lc_m025.59C1FF.3.0.0.1.16.15.52.41.2.61_n00_s00_og_oh_oo_op_oq_or_om_on_ok_ol_oi_oj_ad0.0.0.0.0.0.0.0.0.0

0-interested=54**aa8.73.1.47.31.8.73.1.47.31_ab_ac_ba50_bb17.1_bc150.500.8.0.1.0_bd17_be180_ca64.0.30.64.35.34.34.0.0.0.60.80_da1.0.0.100_db_dd9.3.30.50.50.50_dh2.30.50.50.2_di7_qa_qb_dc0.1.1.1.1_eh8.FFE214.100_ea8.FFE214.FFE214.56.0.0_ec16.70.FFE214.FFE214.56.38.55.1_ed22.53.0.1.FFE214.56_ef3.2.0.FFE214.FFE214.56.0_eg3.2.0.FFE214.FFE214.56.0_r0019.FFE214.FFE214.56.0.2.50.50.86.588.580.0_r0219.FFE214.FFE214.56.0.2.100.100.100.582.550.0_r0342.FFE214.FFE214.56.0.2.34.37.86.541.595.0_r0419.FFE214.FFE214.FFE214.0.2.100.59.102.562.593.0_r053.FFE214.FFE214.FFE214.0.2.4.0.62.495.561.0_r062.FFE214.FFE214.FFE214.2.2.100.100.192.527.613.0_r0717.FFE214.FFE214.FFE214.0.2.47.10.88.488.615.0_r083.FFE214.FFE214.FFE214.2.2.0.0.109.474.625.0_r0919.FFE214.FFE214.FFE214.0.2.63.51.104.579.538.0_fa12.50.50.50.50.65.56_fb_fh_fc1.9ED4FF.55.1.9ED4FF.55.50.61.61.50.50.50_fj0.0.0_fd0.0.16.FFE214.56_fe50.61_ff0000000000_fg1.50.56.0.0.1.0.0_fi_pa0.0.0.0.40.50.85.85.0.0_t00_pb_pc_pd_pe_ga0_gb0_gc14.0_ge0000000000_gh_gf_gg_gd0000000_ha96.96_hb49.1.44.90_hc0.60.39.0.60.39_hd17.1.49.49_ia_if_ib_id_ic_jc_ie_ja_jb_jd2.D62929.D62929.57_je2.D62929.D62929.57_jf_jg_ka27.FE69A1.55.55.0_kb_kc_kd_ke_kf_la31.43.FE1414.59C1FF.1_lb_oa_os_ob_oc_od_oe_of_lc_m025.59C1FF.3.0.0.1.16.15.52.41.2.61_n00_s00_og_oh_oo_op_oq_or_om_on_ok_ol_oi_oj_ad0.0.0.0.0.0.0.0.0.0

0-calm=54**aa7.92.1.28.52.7.92.1.28.52_ab_ac_ba50_bb17.1_bc150.500.8.0.1.0_bd17_be180_ca64.0.30.64.35.34.34.0.0.0.60.80_da1.0.0.100_db_dd9.3.30.50.50.50_dh2.30.50.50.2_di7_qa_qb_dc0.1.1.1.1_eh8.FFE214.100_ea8.FFE214.FFE214.56.0.0_ec16.70.FFE214.FFE214.56.38.55.1_ed22.53.0.1.FFE214.56_ef3.2.0.FFE214.FFE214.56.0_eg3.2.0.FFE214.FFE214.56.0_r0019.FFE214.FFE214.56.0.2.50.50.86.588.580.0_r0219.FFE214.FFE214.56.0.2.100.100.100.582.550.0_r0342.FFE214.FFE214.56.0.2.34.37.86.541.595.0_r0419.FFE214.FFE214.FFE214.0.2.100.59.102.562.593.0_r053.FFE214.FFE214.FFE214.0.2.4.0.62.495.561.0_r062.FFE214.FFE214.FFE214.2.2.100.100.192.527.613.0_r0717.FFE214.FFE214.FFE214.0.2.47.10.88.488.615.0_r083.FFE214.FFE214.FFE214.2.2.0.0.109.474.625.0_r0919.FFE214.FFE214.FFE214.0.2.63.51.104.579.538.0_fa12.50.50.50.50.65.56_fb_fh_fc1.9ED4FF.55.1.9ED4FF.55.50.61.61.50.50.50_fj0.0.0_fd0.0.16.FFE214.56_fe50.61_ff0000000000_fg1.50.56.0.0.1.0.0_fi_pa0.0.0.0.40.50.85.85.0.0_t00_pb_pc_pd_pe_ga0_gb0_gc0.0_ge0000000000_gh_gf_gg_gd0000000_ha88.88_hb49.1.44.90_hc0.59.39.0.59.39_hd0.1.49.49_ia_if_ib_id_ic_jc_ie_ja_jb_jd2.D62929.D62929.57_je2.D62929.D62929.57_jf_jg_ka27.FE69A1.55.55.0_kb_kc_kd_ke_kf_la31.43.FE1414.59C1FF.1_lb_oa_os_ob_oc_od_oe_of_lc_m025.59C1FF.3.0.0.1.16.15.52.41.2.61_n00_s00_og_oh_oo_op_oq_or_om_on_ok_ol_oi_oj_ad0.0.0.0.0.0.0.0.0.0

0-horny=54**aa20.80.0.28.52.20.80.0.28.52_ab_ac_ba50_bb17.1_bc150.500.8.0.1.0_bd17_be180_ca64.0.30.64.35.34.34.0.0.0.60.80_da1.0.0.100_db_dd0.3.30.50.50.50_dh2.30.50.50.2_di7_qa_qb_dc0.1.1.1.1_eh8.FFE214.100_ea8.FFE214.FFE214.56.0.0_ec16.70.FFE214.FFE214.56.38.55.1_ed22.53.0.1.FFE214.56_ef3.2.0.FFE214.FFE214.56.0_eg3.2.0.FFE214.FFE214.56.0_r0019.FFE214.FFE214.56.0.2.50.50.86.588.580.0_r0219.FFE214.FFE214.56.0.2.100.100.100.582.550.0_r0342.FFE214.FFE214.56.0.2.34.37.86.541.595.0_r0419.FFE214.FFE214.FFE214.0.2.100.59.102.562.593.0_r053.FFE214.FFE214.FFE214.0.2.4.0.62.495.561.0_r062.FFE214.FFE214.FFE214.2.2.100.100.192.527.613.0_r0717.FFE214.FFE214.FFE214.0.2.47.10.88.488.615.0_r083.FFE214.FFE214.FFE214.2.2.0.0.109.474.625.0_r0919.FFE214.FFE214.FFE214.0.2.63.51.104.579.538.0_fa12.50.50.50.50.65.56_fb_fh_fc1.9ED4FF.55.1.9ED4FF.55.50.61.61.50.50.50_fj0.0.0_fd0.0.16.FFE214.56_fe50.61_ff0000000000_fg1.50.56.0.0.1.0.0_fi_pa0.0.0.0.40.50.85.85.0.0_t00_pb_pc_pd_pe_ga0_gb0_gc27.0_ge0000000000_gh_gf_gg_gd0000000_ha100.100_hb49.1.44.90_hc0.60.39.0.60.39_hd35.1.49.49_ia_if_ib_id_ic_jc_ie_ja_jb_jd2.D62929.D62929.57_je2.D62929.D62929.57_jf_jg_ka27.FE69A1.55.55.0_kb_kc_kd_ke_kf_la31.43.FE1414.59C1FF.1_lb_oa_os_ob_oc_od_oe_of_lc_m025.59C1FF.3.0.0.1.16.15.52.41.2.61_n00_s00_og_oh_oo_op_oq_or_om_on_ok_ol_oi_oj_ad0.0.0.0.0.0.0.0.0.0

0-happy=54**aa19.61.0.8.6.19.61.1.8.6_ab_ac_ba50_bb17.1_bc150.500.8.0.1.0_bd17_be180_ca64.0.30.64.35.34.34.0.0.0.60.80_da1.0.0.100_db_dd9.3.30.50.50.50_dh2.30.50.50.2_di7_qa_qb_dc0.1.1.1.1_eh8.FFE214.100_ea8.FFE214.FFE214.56.0.0_ec16.70.FFE214.FFE214.56.38.55.1_ed22.53.0.1.FFE214.56_ef3.2.0.FFE214.FFE214.56.0_eg3.2.0.FFE214.FFE214.56.0_r0019.FFE214.FFE214.56.0.2.50.50.86.588.580.0_r0219.FFE214.FFE214.56.0.2.100.100.100.582.550.0_r0342.FFE214.FFE214.56.0.2.34.37.86.541.595.0_r0419.FFE214.FFE214.FFE214.0.2.100.59.102.562.593.0_r053.FFE214.FFE214.FFE214.0.2.4.0.62.495.561.0_r062.FFE214.FFE214.FFE214.2.2.100.100.192.527.613.0_r0717.FFE214.FFE214.FFE214.0.2.47.10.88.488.615.0_r083.FFE214.FFE214.FFE214.2.2.0.0.109.474.625.0_r0919.FFE214.FFE214.FFE214.0.2.63.51.104.579.538.0_fa12.50.50.50.50.65.56_fb_fh_fc1.9ED4FF.55.1.9ED4FF.55.50.61.61.50.50.50_fj0.0.0_fd0.0.16.FFE214.56_fe50.61_ff0000000000_fg1.50.56.0.0.1.0.0_fi_pa0.0.0.0.40.50.85.85.0.0_t00_pb_pc_pd_pe_ga0_gb0_gc0.0_ge0000000000_gh_gf_gg_gd0000000_ha6.6_hb49.1.50.90_hc0.59.39.0.59.39_hd23.1.49.49_ia_if_ib_id_ic_jc_ie_ja_jb_jd2.D62929.D62929.57_je2.D62929.D62929.57_jf_jg_ka27.FE69A1.55.55.0_kb_kc_kd_ke_kf_la31.43.FE1414.59C1FF.1_lb_oa_os_ob_oc_od_oe_of_lc_m025.59C1FF.3.0.0.1.16.15.52.41.2.61_n00_s00_og_oh_oo_op_oq_or_om_on_ok_ol_oi_oj_ad0.0.0.0.0.0.0.0.0.0

1-shocked=54**aa16.72.1.47.29.16.72.1.47.29_ab_ac_ba50_bb17.1_bc150.500.8.0.1.0_bd17_be180_ca64.0.30.64.35.34.34.0.0.0.60.80_da1.0.0.100_db_dd9.3.30.50.50.50_dh2.30.50.50.2_di7_qa_qb_dc0.1.1.1.1_eh8.FFE214.100_ea8.FFE214.FFE214.56.0.0_ec16.70.FFE214.FFE214.56.38.55.1_ed22.53.0.1.FFE214.56_ef3.2.0.FFE214.FFE214.56.0_eg3.2.0.FFE214.FFE214.56.0_r0019.FFE214.FFE214.56.0.2.50.50.86.588.580.0_r0219.FFE214.FFE214.56.0.2.100.100.100.582.550.0_r0342.FFE214.FFE214.56.0.2.34.37.86.541.595.0_r0419.FFE214.FFE214.FFE214.0.2.100.59.102.562.593.0_r053.FFE214.FFE214.FFE214.0.2.4.0.62.495.561.0_r062.FFE214.FFE214.FFE214.2.2.100.100.192.527.613.0_r0717.FFE214.FFE214.FFE214.0.2.47.10.88.488.615.0_r083.FFE214.FFE214.FFE214.2.2.0.0.109.474.625.0_r0919.FFE214.FFE214.FFE214.0.2.63.51.104.579.538.0_fa12.50.50.50.50.65.56_fb_fh_fc1.9ED4FF.55.1.9ED4FF.55.50.61.61.50.50.50_fj0.0.0_fd0.0.16.FFE214.56_fe50.61_ff0000000000_fg1.50.56.0.0.1.0.0_fi_pa0.0.0.0.40.50.85.85.0.0_t00_pb_pc_pd_pe_ga0_gb0_gc0.0_ge0000000000_gh_gf_gg_gd0000000_ha100.100_hb49.1.44.90_hc0.47.39.0.47.39_hd39.1.49.49_ia_if_ib_id_ic_jc_ie_ja_jb_jd_je_jf_jg_ka27.FE69A1.55.55.0_kb_kc_kd_ke_kf_la31.43.FE1414.59C1FF.1_lb_oa_os_ob_oc_od_oe_of_lc_m025.59C1FF.3.0.0.1.16.15.52.41.2.61_n00_s00_og_oh_oo_op_oq_or_om_on_ok_ol_oi_oj_ad0.0.0.0.0.0.0.0.0.0

1-sad=54**aa7.98.1.28.52.7.98.1.28.52_ab_ac_ba50_bb17.1_bc150.500.8.0.1.0_bd17_be180_ca64.0.30.64.35.34.34.0.0.0.60.80_da1.0.0.100_db_dd9.3.30.50.50.50_dh2.30.50.50.2_di7_qa_qb_dc0.1.1.1.1_eh8.FFE214.100_ea8.FFE214.FFE214.56.0.0_ec16.70.FFE214.FFE214.56.38.55.1_ed22.53.0.1.FFE214.56_ef3.2.0.FFE214.FFE214.56.0_eg3.2.0.FFE214.FFE214.56.0_r0019.FFE214.FFE214.56.0.2.50.50.86.588.580.0_r0219.FFE214.FFE214.56.0.2.100.100.100.582.550.0_r0342.FFE214.FFE214.56.0.2.34.37.86.541.595.0_r0419.FFE214.FFE214.FFE214.0.2.100.59.102.562.593.0_r053.FFE214.FFE214.FFE214.0.2.4.0.62.495.561.0_r062.FFE214.FFE214.FFE214.2.2.100.100.192.527.613.0_r0717.FFE214.FFE214.FFE214.0.2.47.10.88.488.615.0_r083.FFE214.FFE214.FFE214.2.2.0.0.109.474.625.0_r0919.FFE214.FFE214.FFE214.0.2.63.51.104.579.538.0_fa12.50.50.50.50.65.56_fb_fh_fc1.9ED4FF.55.1.9ED4FF.55.50.61.61.50.50.50_fj0.0.0_fd0.0.16.FFE214.56_fe50.61_ff0000000000_fg1.50.56.0.0.1.0.0_fi_pa0.0.0.0.40.50.85.85.0.0_t00_pb_pc_pd_pe_ga0_gb0_gc0.0_ge0000000000_gh_gf_gg_gd0000000_ha79.79_hb49.1.29.90_hc0.59.39.0.59.39_hd5.1.49.49_ia_if_ib_id_ic_jc_ie_ja_jb_jd_je_jf_jg_ka27.FE69A1.55.55.0_kb_kc_kd_ke_kf_la31.43.FE1414.59C1FF.1_lb_oa_os_ob_oc_od_oe_of_lc_m025.59C1FF.3.0.0.1.16.15.52.41.2.61_n00_s00_og_oh_oo_op_oq_or_om_on_ok_ol_oi_oj_ad0.0.0.0.0.0.0.0.0.0

1-interested=54**aa8.73.1.47.31.8.73.1.47.31_ab_ac_ba50_bb17.1_bc150.500.8.0.1.0_bd17_be180_ca64.0.30.64.35.34.34.0.0.0.60.80_da1.0.0.100_db_dd9.3.30.50.50.50_dh2.30.50.50.2_di7_qa_qb_dc0.1.1.1.1_eh8.FFE214.100_ea8.FFE214.FFE214.56.0.0_ec16.70.FFE214.FFE214.56.38.55.1_ed22.53.0.1.FFE214.56_ef3.2.0.FFE214.FFE214.56.0_eg3.2.0.FFE214.FFE214.56.0_r0019.FFE214.FFE214.56.0.2.50.50.86.588.580.0_r0219.FFE214.FFE214.56.0.2.100.100.100.582.550.0_r0342.FFE214.FFE214.56.0.2.34.37.86.541.595.0_r0419.FFE214.FFE214.FFE214.0.2.100.59.102.562.593.0_r053.FFE214.FFE214.FFE214.0.2.4.0.62.495.561.0_r062.FFE214.FFE214.FFE214.2.2.100.100.192.527.613.0_r0717.FFE214.FFE214.FFE214.0.2.47.10.88.488.615.0_r083.FFE214.FFE214.FFE214.2.2.0.0.109.474.625.0_r0919.FFE214.FFE214.FFE214.0.2.63.51.104.579.538.0_fa12.50.50.50.50.65.56_fb_fh_fc1.9ED4FF.55.1.9ED4FF.55.50.61.61.50.50.50_fj0.0.0_fd0.0.16.FFE214.56_fe50.61_ff0000000000_fg1.50.56.0.0.1.0.0_fi_pa0.0.0.0.40.50.85.85.0.0_t00_pb_pc_pd_pe_ga0_gb0_gc14.0_ge0000000000_gh_gf_gg_gd0000000_ha96.96_hb49.1.44.90_hc0.60.39.0.60.39_hd17.1.49.49_ia_if_ib_id_ic_jc_ie_ja_jb_jd_je_jf_jg_ka27.FE69A1.55.55.0_kb_kc_kd_ke_kf_la31.43.FE1414.59C1FF.1_lb_oa_os_ob_oc_od_oe_of_lc_m025.59C1FF.3.0.0.1.16.15.52.41.2.61_n00_s00_og_oh_oo_op_oq_or_om_on_ok_ol_oi_oj_ad0.0.0.0.0.0.0.0.0.0

1-calm=54**aa7.92.1.28.52.7.92.1.28.52_ab_ac_ba50_bb17.1_bc150.500.8.0.1.0_bd17_be180_ca64.0.30.64.35.34.34.0.0.0.60.80_da1.0.0.100_db_dd9.3.30.50.50.50_dh2.30.50.50.2_di7_qa_qb_dc0.1.1.1.1_eh8.FFE214.100_ea8.FFE214.FFE214.56.0.0_ec16.70.FFE214.FFE214.56.38.55.1_ed22.53.0.1.FFE214.56_ef3.2.0.FFE214.FFE214.56.0_eg3.2.0.FFE214.FFE214.56.0_r0019.FFE214.FFE214.56.0.2.50.50.86.588.580.0_r0219.FFE214.FFE214.56.0.2.100.100.100.582.550.0_r0342.FFE214.FFE214.56.0.2.34.37.86.541.595.0_r0419.FFE214.FFE214.FFE214.0.2.100.59.102.562.593.0_r053.FFE214.FFE214.FFE214.0.2.4.0.62.495.561.0_r062.FFE214.FFE214.FFE214.2.2.100.100.192.527.613.0_r0717.FFE214.FFE214.FFE214.0.2.47.10.88.488.615.0_r083.FFE214.FFE214.FFE214.2.2.0.0.109.474.625.0_r0919.FFE214.FFE214.FFE214.0.2.63.51.104.579.538.0_fa12.50.50.50.50.65.56_fb_fh_fc1.9ED4FF.55.1.9ED4FF.55.50.61.61.50.50.50_fj0.0.0_fd0.0.16.FFE214.56_fe50.61_ff0000000000_fg1.50.56.0.0.1.0.0_fi_pa0.0.0.0.40.50.85.85.0.0_t00_pb_pc_pd_pe_ga0_gb0_gc0.0_ge0000000000_gh_gf_gg_gd0000000_ha88.88_hb49.1.44.90_hc0.59.39.0.59.39_hd0.1.49.49_ia_if_ib_id_ic_jc_ie_ja_jb_jd_je_jf_jg_ka27.FE69A1.55.55.0_kb_kc_kd_ke_kf_la31.43.FE1414.59C1FF.1_lb_oa_os_ob_oc_od_oe_of_lc_m025.59C1FF.3.0.0.1.16.15.52.41.2.61_n00_s00_og_oh_oo_op_oq_or_om_on_ok_ol_oi_oj_ad0.0.0.0.0.0.0.0.0.0

1-horny=54**aa20.80.0.28.52.20.80.0.28.52_ab_ac_ba50_bb17.1_bc150.500.8.0.1.0_bd17_be180_ca64.0.30.64.35.34.34.0.0.0.60.80_da1.0.0.100_db_dd0.3.30.50.50.50_dh2.30.50.50.2_di7_qa_qb_dc0.1.1.1.1_eh8.FFE214.100_ea8.FFE214.FFE214.56.0.0_ec16.70.FFE214.FFE214.56.38.55.1_ed22.53.0.1.FFE214.56_ef3.2.0.FFE214.FFE214.56.0_eg3.2.0.FFE214.FFE214.56.0_r0019.FFE214.FFE214.56.0.2.50.50.86.588.580.0_r0219.FFE214.FFE214.56.0.2.100.100.100.582.550.0_r0342.FFE214.FFE214.56.0.2.34.37.86.541.595.0_r0419.FFE214.FFE214.FFE214.0.2.100.59.102.562.593.0_r053.FFE214.FFE214.FFE214.0.2.4.0.62.495.561.0_r062.FFE214.FFE214.FFE214.2.2.100.100.192.527.613.0_r0717.FFE214.FFE214.FFE214.0.2.47.10.88.488.615.0_r083.FFE214.FFE214.FFE214.2.2.0.0.109.474.625.0_r0919.FFE214.FFE214.FFE214.0.2.63.51.104.579.538.0_fa12.50.50.50.50.65.56_fb_fh_fc1.9ED4FF.55.1.9ED4FF.55.50.61.61.50.50.50_fj0.0.0_fd0.0.16.FFE214.56_fe50.61_ff0000000000_fg1.50.56.0.0.1.0.0_fi_pa0.0.0.0.40.50.85.85.0.0_t00_pb_pc_pd_pe_ga0_gb0_gc27.0_ge0000000000_gh_gf_gg_gd0000000_ha100.100_hb49.1.44.90_hc0.60.39.0.60.39_hd35.1.49.49_ia_if_ib_id_ic_jc_ie_ja_jb_jd_je_jf_jg_ka27.FE69A1.55.55.0_kb_kc_kd_ke_kf_la31.43.FE1414.59C1FF.1_lb_oa_os_ob_oc_od_oe_of_lc_m025.59C1FF.3.0.0.1.16.15.52.41.2.61_n00_s00_og_oh_oo_op_oq_or_om_on_ok_ol_oi_oj_ad0.0.0.0.0.0.0.0.0.0

1-happy=54**aa19.61.0.8.6.19.61.1.8.6_ab_ac_ba50_bb17.1_bc150.500.8.0.1.0_bd17_be180_ca64.0.30.64.35.34.34.0.0.0.60.80_da1.0.0.100_db_dd9.3.30.50.50.50_dh2.30.50.50.2_di7_qa_qb_dc0.1.1.1.1_eh8.FFE214.100_ea8.FFE214.FFE214.56.0.0_ec16.70.FFE214.FFE214.56.38.55.1_ed22.53.0.1.FFE214.56_ef3.2.0.FFE214.FFE214.56.0_eg3.2.0.FFE214.FFE214.56.0_r0019.FFE214.FFE214.56.0.2.50.50.86.588.580.0_r0219.FFE214.FFE214.56.0.2.100.100.100.582.550.0_r0342.FFE214.FFE214.56.0.2.34.37.86.541.595.0_r0419.FFE214.FFE214.FFE214.0.2.100.59.102.562.593.0_r053.FFE214.FFE214.FFE214.0.2.4.0.62.495.561.0_r062.FFE214.FFE214.FFE214.2.2.100.100.192.527.613.0_r0717.FFE214.FFE214.FFE214.0.2.47.10.88.488.615.0_r083.FFE214.FFE214.FFE214.2.2.0.0.109.474.625.0_r0919.FFE214.FFE214.FFE214.0.2.63.51.104.579.538.0_fa12.50.50.50.50.65.56_fb_fh_fc1.9ED4FF.55.1.9ED4FF.55.50.61.61.50.50.50_fj0.0.0_fd0.0.16.FFE214.56_fe50.61_ff0000000000_fg1.50.56.0.0.1.0.0_fi_pa0.0.0.0.40.50.85.85.0.0_t00_pb_pc_pd_pe_ga0_gb0_gc0.0_ge0000000000_gh_gf_gg_gd0000000_ha6.6_hb49.1.50.90_hc0.59.39.0.59.39_hd23.1.49.49_ia_if_ib_id_ic_jc_ie_ja_jb_jd_je_jf_jg_ka27.FE69A1.55.55.0_kb_kc_kd_ke_kf_la31.43.FE1414.59C1FF.1_lb_oa_os_ob_oc_od_oe_of_lc_m025.59C1FF.3.0.0.1.16.15.52.41.2.61_n00_s00_og_oh_oo_op_oq_or_om_on_ok_ol_oi_oj_ad0.0.0.0.0.0.0.0.0.0

2-shocked=54**aa16.72.1.47.29.16.72.1.47.29_ab_ac_ba50_bb17.1_bc150.500.8.0.1.0_bd17_be180_ca64.0.30.64.35.34.34.0.0.0.60.80_da1.0.0.100_db_dd9.3.30.50.50.50_dh2.30.50.50.2_di7_qa_qb_dc0.1.1.1.1_eh8.FFE214.100_ea8.FFE214.FFE214.56.0.0_ec16.70.FFE214.FFE214.56.38.55.1_ed22.53.0.1.FFE214.56_ef3.2.0.FFE214.FFE214.56.0_eg3.2.0.FFE214.FFE214.56.0_r0019.FFE214.FFE214.56.0.2.50.50.86.588.580.0_r0219.FFE214.FFE214.56.0.2.100.100.100.582.550.0_r0342.FFE214.FFE214.56.0.2.34.37.86.541.595.0_r0419.FFE214.FFE214.FFE214.0.2.100.59.102.562.593.0_r053.FFE214.FFE214.FFE214.0.2.4.0.62.495.561.0_r062.FFE214.FFE214.FFE214.2.2.100.100.192.527.613.0_r0717.FFE214.FFE214.FFE214.0.2.47.10.88.488.615.0_r083.FFE214.FFE214.FFE214.2.2.0.0.109.474.625.0_r0919.FFE214.FFE214.FFE214.0.2.63.51.104.579.538.0_fa12.50.50.50.50.65.56_fb_fh_fc1.9ED4FF.55.1.9ED4FF.55.50.61.61.50.50.50_fj0.0.0_fd0.0.16.FFE214.56_fe50.61_ff0000000000_fg1.50.56.0.0.1.0.0_fi_pa0.0.0.0.40.50.85.85.0.0_t00_pb_pc_pd_pe_ga0_gb0_gc0.0_ge0000000000_gh_gf_gg_gd0000000_ha100.100_hb49.1.44.90_hc0.47.39.0.47.39_hd39.1.49.49_ia_if_ib_id_ic_jc_ie_ja_jb_jd_je_jf_jg_ka27.FE69A1.55.55.0_kb_kc_kd_ke_kf_la31.43.FE1414.59C1FF.1_lb_oa_os_ob_oc_od_oe_of_lc_m00_n00_s00_og_oh_oo_op_oq_or_om_on_ok_ol_oi_oj_ad0.0.0.0.0.0.0.0.0.0

2-sad=54**aa7.98.1.28.52.7.98.1.28.52_ab_ac_ba50_bb17.1_bc150.500.8.0.1.0_bd17_be180_ca64.0.30.64.35.34.34.0.0.0.60.80_da1.0.0.100_db_dd9.3.30.50.50.50_dh2.30.50.50.2_di7_qa_qb_dc0.1.1.1.1_eh8.FFE214.100_ea8.FFE214.FFE214.56.0.0_ec16.70.FFE214.FFE214.56.38.55.1_ed22.53.0.1.FFE214.56_ef3.2.0.FFE214.FFE214.56.0_eg3.2.0.FFE214.FFE214.56.0_r0019.FFE214.FFE214.56.0.2.50.50.86.588.580.0_r0219.FFE214.FFE214.56.0.2.100.100.100.582.550.0_r0342.FFE214.FFE214.56.0.2.34.37.86.541.595.0_r0419.FFE214.FFE214.FFE214.0.2.100.59.102.562.593.0_r053.FFE214.FFE214.FFE214.0.2.4.0.62.495.561.0_r062.FFE214.FFE214.FFE214.2.2.100.100.192.527.613.0_r0717.FFE214.FFE214.FFE214.0.2.47.10.88.488.615.0_r083.FFE214.FFE214.FFE214.2.2.0.0.109.474.625.0_r0919.FFE214.FFE214.FFE214.0.2.63.51.104.579.538.0_fa12.50.50.50.50.65.56_fb_fh_fc1.9ED4FF.55.1.9ED4FF.55.50.61.61.50.50.50_fj0.0.0_fd0.0.16.FFE214.56_fe50.61_ff0000000000_fg1.50.56.0.0.1.0.0_fi_pa0.0.0.0.40.50.85.85.0.0_t00_pb_pc_pd_pe_ga0_gb0_gc0.0_ge0000000000_gh_gf_gg_gd0000000_ha79.79_hb49.1.29.90_hc0.59.39.0.59.39_hd5.1.49.49_ia_if_ib_id_ic_jc_ie_ja_jb_jd_je_jf_jg_ka27.FE69A1.55.55.0_kb_kc_kd_ke_kf_la31.43.FE1414.59C1FF.1_lb_oa_os_ob_oc_od_oe_of_lc_m00_n00_s00_og_oh_oo_op_oq_or_om_on_ok_ol_oi_oj_ad0.0.0.0.0.0.0.0.0.0

2-interested=54**aa8.73.1.47.31.8.73.1.47.31_ab_ac_ba50_bb17.1_bc150.500.8.0.1.0_bd17_be180_ca64.0.30.64.35.34.34.0.0.0.60.80_da1.0.0.100_db_dd9.3.30.50.50.50_dh2.30.50.50.2_di7_qa_qb_dc0.1.1.1.1_eh8.FFE214.100_ea8.FFE214.FFE214.56.0.0_ec16.70.FFE214.FFE214.56.38.55.1_ed22.53.0.1.FFE214.56_ef3.2.0.FFE214.FFE214.56.0_eg3.2.0.FFE214.FFE214.56.0_r0019.FFE214.FFE214.56.0.2.50.50.86.588.580.0_r0219.FFE214.FFE214.56.0.2.100.100.100.582.550.0_r0342.FFE214.FFE214.56.0.2.34.37.86.541.595.0_r0419.FFE214.FFE214.FFE214.0.2.100.59.102.562.593.0_r053.FFE214.FFE214.FFE214.0.2.4.0.62.495.561.0_r062.FFE214.FFE214.FFE214.2.2.100.100.192.527.613.0_r0717.FFE214.FFE214.FFE214.0.2.47.10.88.488.615.0_r083.FFE214.FFE214.FFE214.2.2.0.0.109.474.625.0_r0919.FFE214.FFE214.FFE214.0.2.63.51.104.579.538.0_fa12.50.50.50.50.65.56_fb_fh_fc1.9ED4FF.55.1.9ED4FF.55.50.61.61.50.50.50_fj0.0.0_fd0.0.16.FFE214.56_fe50.61_ff0000000000_fg1.50.56.0.0.1.0.0_fi_pa0.0.0.0.40.50.85.85.0.0_t00_pb_pc_pd_pe_ga0_gb0_gc14.0_ge0000000000_gh_gf_gg_gd0000000_ha96.96_hb49.1.44.90_hc0.60.39.0.60.39_hd17.1.49.49_ia_if_ib_id_ic_jc_ie_ja_jb_jd_je_jf_jg_ka27.FE69A1.55.55.0_kb_kc_kd_ke_kf_la31.43.FE1414.59C1FF.1_lb_oa_os_ob_oc_od_oe_of_lc_m00_n00_s00_og_oh_oo_op_oq_or_om_on_ok_ol_oi_oj_ad0.0.0.0.0.0.0.0.0.0

2-calm=54**aa7.92.1.28.52.7.92.1.28.52_ab_ac_ba50_bb17.1_bc150.500.8.0.1.0_bd17_be180_ca64.0.30.64.35.34.34.0.0.0.60.80_da1.0.0.100_db_dd9.3.30.50.50.50_dh2.30.50.50.2_di7_qa_qb_dc0.1.1.1.1_eh8.FFE214.100_ea8.FFE214.FFE214.56.0.0_ec16.70.FFE214.FFE214.56.38.55.1_ed22.53.0.1.FFE214.56_ef3.2.0.FFE214.FFE214.56.0_eg3.2.0.FFE214.FFE214.56.0_r0019.FFE214.FFE214.56.0.2.50.50.86.588.580.0_r0219.FFE214.FFE214.56.0.2.100.100.100.582.550.0_r0342.FFE214.FFE214.56.0.2.34.37.86.541.595.0_r0419.FFE214.FFE214.FFE214.0.2.100.59.102.562.593.0_r053.FFE214.FFE214.FFE214.0.2.4.0.62.495.561.0_r062.FFE214.FFE214.FFE214.2.2.100.100.192.527.613.0_r0717.FFE214.FFE214.FFE214.0.2.47.10.88.488.615.0_r083.FFE214.FFE214.FFE214.2.2.0.0.109.474.625.0_r0919.FFE214.FFE214.FFE214.0.2.63.51.104.579.538.0_fa12.50.50.50.50.65.56_fb_fh_fc1.9ED4FF.55.1.9ED4FF.55.50.61.61.50.50.50_fj0.0.0_fd0.0.16.FFE214.56_fe50.61_ff0000000000_fg1.50.56.0.0.1.0.0_fi_pa0.0.0.0.40.50.85.85.0.0_t00_pb_pc_pd_pe_ga0_gb0_gc0.0_ge0000000000_gh_gf_gg_gd0000000_ha88.88_hb49.1.44.90_hc0.59.39.0.59.39_hd0.1.49.49_ia_if_ib_id_ic_jc_ie_ja_jb_jd_je_jf_jg_ka27.FE69A1.55.55.0_kb_kc_kd_ke_kf_la31.43.FE1414.59C1FF.1_lb_oa_os_ob_oc_od_oe_of_lc_m00_n00_s00_og_oh_oo_op_oq_or_om_on_ok_ol_oi_oj_ad0.0.0.0.0.0.0.0.0.0

2-horny=54**aa20.80.0.28.52.20.80.0.28.52_ab_ac_ba50_bb17.1_bc150.500.8.0.1.0_bd17_be180_ca64.0.30.64.35.34.34.0.0.0.60.80_da1.0.0.100_db_dd0.3.30.50.50.50_dh2.30.50.50.2_di7_qa_qb_dc0.1.1.1.1_eh8.FFE214.100_ea8.FFE214.FFE214.56.0.0_ec16.70.FFE214.FFE214.56.38.55.1_ed22.53.0.1.FFE214.56_ef3.2.0.FFE214.FFE214.56.0_eg3.2.0.FFE214.FFE214.56.0_r0019.FFE214.FFE214.56.0.2.50.50.86.588.580.0_r0219.FFE214.FFE214.56.0.2.100.100.100.582.550.0_r0342.FFE214.FFE214.56.0.2.34.37.86.541.595.0_r0419.FFE214.FFE214.FFE214.0.2.100.59.102.562.593.0_r053.FFE214.FFE214.FFE214.0.2.4.0.62.495.561.0_r062.FFE214.FFE214.FFE214.2.2.100.100.192.527.613.0_r0717.FFE214.FFE214.FFE214.0.2.47.10.88.488.615.0_r083.FFE214.FFE214.FFE214.2.2.0.0.109.474.625.0_r0919.FFE214.FFE214.FFE214.0.2.63.51.104.579.538.0_fa12.50.50.50.50.65.56_fb_fh_fc1.9ED4FF.55.1.9ED4FF.55.50.61.61.50.50.50_fj0.0.0_fd0.0.16.FFE214.56_fe50.61_ff0000000000_fg1.50.56.0.0.1.0.0_fi_pa0.0.0.0.40.50.85.85.0.0_t00_pb_pc_pd_pe_ga0_gb0_gc27.0_ge0000000000_gh_gf_gg_gd0000000_ha100.100_hb49.1.44.90_hc0.60.39.0.60.39_hd35.1.49.49_ia_if_ib_id_ic_jc_ie_ja_jb_jd_je_jf_jg_ka27.FE69A1.55.55.0_kb_kc_kd_ke_kf_la31.43.FE1414.59C1FF.1_lb_oa_os_ob_oc_od_oe_of_lc_m00_n00_s00_og_oh_oo_op_oq_or_om_on_ok_ol_oi_oj_ad0.0.0.0.0.0.0.0.0.0

2-happy=54**aa19.61.0.8.6.19.61.1.8.6_ab_ac_ba50_bb17.1_bc150.500.8.0.1.0_bd17_be180_ca64.0.30.64.35.34.34.0.0.0.60.80_da1.0.0.100_db_dd9.3.30.50.50.50_dh2.30.50.50.2_di7_qa_qb_dc0.1.1.1.1_eh8.FFE214.100_ea8.FFE214.FFE214.56.0.0_ec16.70.FFE214.FFE214.56.38.55.1_ed22.53.0.1.FFE214.56_ef3.2.0.FFE214.FFE214.56.0_eg3.2.0.FFE214.FFE214.56.0_r0019.FFE214.FFE214.56.0.2.50.50.86.588.580.0_r0219.FFE214.FFE214.56.0.2.100.100.100.582.550.0_r0342.FFE214.FFE214.56.0.2.34.37.86.541.595.0_r0419.FFE214.FFE214.FFE214.0.2.100.59.102.562.593.0_r053.FFE214.FFE214.FFE214.0.2.4.0.62.495.561.0_r062.FFE214.FFE214.FFE214.2.2.100.100.192.527.613.0_r0717.FFE214.FFE214.FFE214.0.2.47.10.88.488.615.0_r083.FFE214.FFE214.FFE214.2.2.0.0.109.474.625.0_r0919.FFE214.FFE214.FFE214.0.2.63.51.104.579.538.0_fa12.50.50.50.50.65.56_fb_fh_fc1.9ED4FF.55.1.9ED4FF.55.50.61.61.50.50.50_fj0.0.0_fd0.0.16.FFE214.56_fe50.61_ff0000000000_fg1.50.56.0.0.1.0.0_fi_pa0.0.0.0.40.50.85.85.0.0_t00_pb_pc_pd_pe_ga0_gb0_gc0.0_ge0000000000_gh_gf_gg_gd0000000_ha6.6_hb49.1.50.90_hc0.59.39.0.59.39_hd23.1.49.49_ia_if_ib_id_ic_jc_ie_ja_jb_jd_je_jf_jg_ka27.FE69A1.55.55.0_kb_kc_kd_ke_kf_la31.43.FE1414.59C1FF.1_lb_oa_os_ob_oc_od_oe_of_lc_m00_n00_s00_og_oh_oo_op_oq_or_om_on_ok_ol_oi_oj_ad0.0.0.0.0.0.0.0.0.0

3-shocked=54**aa16.72.1.47.29.16.72.1.47.29_ab_ac_ba50_bb17.1_bc150.500.8.0.1.0_bd17_be180_ca64.0.30.64.35.34.34.0.0.0.60.80_da1.0.0.100_db_dd9.3.30.50.50.50_dh2.30.50.50.2_di7_qa_qb_dc0.1.1.1.1_eh8.FFE214.100_ea8.FFE214.FFE214.56.0.0_ec16.70.FFE214.FFE214.56.38.55.1_ed22.53.0.1.FFE214.56_ef3.2.0.FFE214.FFE214.56.0_eg3.2.0.FFE214.FFE214.56.0_r0019.FFE214.FFE214.56.0.2.50.50.86.588.580.0_r0219.FFE214.FFE214.56.0.2.100.100.100.582.550.0_r0342.FFE214.FFE214.56.0.2.34.37.86.541.595.0_r0419.FFE214.FFE214.FFE214.0.2.100.59.102.562.593.0_r053.FFE214.FFE214.FFE214.0.2.4.0.62.495.561.0_r062.FFE214.FFE214.FFE214.2.2.100.100.192.527.613.0_r0717.FFE214.FFE214.FFE214.0.2.47.10.88.488.615.0_r083.FFE214.FFE214.FFE214.2.2.0.0.109.474.625.0_r0919.FFE214.FFE214.FFE214.0.2.63.51.104.579.538.0_fa12.50.50.50.50.65.56_fb_fh_fc1.9ED4FF.55.1.9ED4FF.55.50.61.61.50.50.50_fj0.0.0_fd0.0.16.FFE214.56_fe50.61_ff0000000000_fg1.50.56.0.0.1.0.0_fi_pa0.0.0.0.40.50.85.85.0.0_t00_pb_pc_pd_pe_ga0_gb0_gc14.0_ge0000000000_gh_gf_gg_gd0000000_ha100.100_hb49.1.44.90_hc0.47.39.0.47.39_hd39.1.49.49_ia_if_ib_id_ic_jc_ie_ja_jb_jd_je_jf_jg_ka27.FE69A1.55.55.0_kb_kc_kd_ke_kf_la_lb_oa_os_ob_oc_od_oe_of_lc_m00_n00_s00_og_oh_oo_op_oq_or_om_on_ok_ol_oi_oj_ad0.0.0.0.0.0.0.0.0.0

3-sad=54**aa7.98.1.28.52.7.98.1.28.52_ab_ac_ba50_bb17.1_bc150.500.8.0.1.0_bd17_be180_ca64.0.30.64.35.34.34.0.0.0.60.80_da1.0.0.100_db_dd9.3.30.50.50.50_dh2.30.50.50.2_di7_qa_qb_dc0.1.1.1.1_eh8.FFE214.100_ea8.FFE214.FFE214.56.0.0_ec16.70.FFE214.FFE214.56.38.55.1_ed22.53.0.1.FFE214.56_ef3.2.0.FFE214.FFE214.56.0_eg3.2.0.FFE214.FFE214.56.0_r0019.FFE214.FFE214.56.0.2.50.50.86.588.580.0_r0219.FFE214.FFE214.56.0.2.100.100.100.582.550.0_r0342.FFE214.FFE214.56.0.2.34.37.86.541.595.0_r0419.FFE214.FFE214.FFE214.0.2.100.59.102.562.593.0_r053.FFE214.FFE214.FFE214.0.2.4.0.62.495.561.0_r062.FFE214.FFE214.FFE214.2.2.100.100.192.527.613.0_r0717.FFE214.FFE214.FFE214.0.2.47.10.88.488.615.0_r083.FFE214.FFE214.FFE214.2.2.0.0.109.474.625.0_r0919.FFE214.FFE214.FFE214.0.2.63.51.104.579.538.0_fa12.50.50.50.50.65.56_fb_fh_fc1.9ED4FF.55.1.9ED4FF.55.50.61.61.50.50.50_fj0.0.0_fd0.0.16.FFE214.56_fe50.61_ff0000000000_fg1.50.56.0.0.1.0.0_fi_pa0.0.0.0.40.50.85.85.0.0_t00_pb_pc_pd_pe_ga0_gb0_gc14.0_ge0000000000_gh_gf_gg_gd0000000_ha79.79_hb49.1.29.90_hc0.59.39.0.59.39_hd5.1.49.49_ia_if_ib_id_ic_jc_ie_ja_jb_jd_je_jf_jg_ka27.FE69A1.55.55.0_kb_kc_kd_ke_kf_la_lb_oa_os_ob_oc_od_oe_of_lc_m00_n00_s00_og_oh_oo_op_oq_or_om_on_ok_ol_oi_oj_ad0.0.0.0.0.0.0.0.0.0

3-interested=54**aa8.73.1.47.31.8.73.1.47.31_ab_ac_ba50_bb17.1_bc150.500.8.0.1.0_bd17_be180_ca64.0.30.64.35.34.34.0.0.0.60.80_da1.0.0.100_db_dd0.3.30.50.50.50_dh2.30.50.50.2_di7_qa_qb_dc0.1.1.1.1_eh8.FFE214.100_ea8.FFE214.FFE214.56.0.0_ec16.70.FFE214.FFE214.56.38.55.1_ed22.53.0.1.FFE214.56_ef3.2.0.FFE214.FFE214.56.0_eg3.2.0.FFE214.FFE214.56.0_r0019.FFE214.FFE214.56.0.2.50.50.86.588.580.0_r0219.FFE214.FFE214.56.0.2.100.100.100.582.550.0_r0342.FFE214.FFE214.56.0.2.34.37.86.541.595.0_r0419.FFE214.FFE214.FFE214.0.2.100.59.102.562.593.0_r053.FFE214.FFE214.FFE214.0.2.4.0.62.495.561.0_r062.FFE214.FFE214.FFE214.2.2.100.100.192.527.613.0_r0717.FFE214.FFE214.FFE214.0.2.47.10.88.488.615.0_r083.FFE214.FFE214.FFE214.2.2.0.0.109.474.625.0_r0919.FFE214.FFE214.FFE214.0.2.63.51.104.579.538.0_fa12.50.50.50.50.65.56_fb_fh_fc1.9ED4FF.55.1.9ED4FF.55.50.61.61.50.50.50_fj0.0.0_fd0.0.16.FFE214.56_fe50.61_ff0000000000_fg1.50.56.0.0.1.0.0_fi_pa0.0.0.0.40.50.85.85.0.0_t00_pb_pc_pd_pe_ga0_gb0_gc27.0_ge0000000000_gh_gf_gg_gd0000000_ha96.96_hb49.1.44.90_hc0.60.39.0.60.39_hd17.1.49.49_ia_if_ib_id_ic_jc_ie_ja_jb_jd_je_jf_jg_ka27.FE69A1.55.55.0_kb_kc_kd_ke_kf_la_lb_oa_os_ob_oc_od_oe_of_lc_m00_n00_s00_og_oh_oo_op_oq_or_om_on_ok_ol_oi_oj_ad0.0.0.0.0.0.0.0.0.0

3-calm=54**aa7.92.1.28.52.7.92.1.28.52_ab_ac_ba50_bb17.1_bc150.500.8.0.1.0_bd17_be180_ca64.0.30.64.35.34.34.0.0.0.60.80_da1.0.0.100_db_dd9.3.30.50.50.50_dh2.30.50.50.2_di7_qa_qb_dc0.1.1.1.1_eh8.FFE214.100_ea8.FFE214.FFE214.56.0.0_ec16.70.FFE214.FFE214.56.38.55.1_ed22.53.0.1.FFE214.56_ef3.2.0.FFE214.FFE214.56.0_eg3.2.0.FFE214.FFE214.56.0_r0019.FFE214.FFE214.56.0.2.50.50.86.588.580.0_r0219.FFE214.FFE214.56.0.2.100.100.100.582.550.0_r0342.FFE214.FFE214.56.0.2.34.37.86.541.595.0_r0419.FFE214.FFE214.FFE214.0.2.100.59.102.562.593.0_r053.FFE214.FFE214.FFE214.0.2.4.0.62.495.561.0_r062.FFE214.FFE214.FFE214.2.2.100.100.192.527.613.0_r0717.FFE214.FFE214.FFE214.0.2.47.10.88.488.615.0_r083.FFE214.FFE214.FFE214.2.2.0.0.109.474.625.0_r0919.FFE214.FFE214.FFE214.0.2.63.51.104.579.538.0_fa12.50.50.50.50.65.56_fb_fh_fc1.9ED4FF.55.1.9ED4FF.55.50.61.61.50.50.50_fj0.0.0_fd0.0.16.FFE214.56_fe50.61_ff0000000000_fg1.50.56.0.0.1.0.0_fi_pa0.0.0.0.40.50.85.85.0.0_t00_pb_pc_pd_pe_ga0_gb0_gc14.0_ge0000000000_gh_gf_gg_gd0000000_ha88.88_hb49.1.44.90_hc0.59.39.0.59.39_hd0.1.49.49_ia_if_ib_id_ic_jc_ie_ja_jb_jd_je_jf_jg_ka27.FE69A1.55.55.0_kb_kc_kd_ke_kf_la_lb_oa_os_ob_oc_od_oe_of_lc_m00_n00_s00_og_oh_oo_op_oq_or_om_on_ok_ol_oi_oj_ad0.0.0.0.0.0.0.0.0.0

3-horny=54**aa20.80.0.28.52.20.80.0.28.52_ab_ac_ba50_bb17.1_bc150.500.8.0.1.0_bd17_be180_ca64.0.30.64.35.34.34.0.0.0.60.80_da1.0.0.100_db_dd1.3.30.50.50.50_dh2.30.50.50.2_di7_qa_qb_dc0.1.1.1.1_eh8.FFE214.100_ea8.FFE214.FFE214.56.0.0_ec16.70.FFE214.FFE214.56.38.55.1_ed22.53.0.1.FFE214.56_ef3.2.0.FFE214.FFE214.56.0_eg3.2.0.FFE214.FFE214.56.0_r0019.FFE214.FFE214.56.0.2.50.50.86.588.580.0_r0219.FFE214.FFE214.56.0.2.100.100.100.582.550.0_r0342.FFE214.FFE214.56.0.2.34.37.86.541.595.0_r0419.FFE214.FFE214.FFE214.0.2.100.59.102.562.593.0_r053.FFE214.FFE214.FFE214.0.2.4.0.62.495.561.0_r062.FFE214.FFE214.FFE214.2.2.100.100.192.527.613.0_r0717.FFE214.FFE214.FFE214.0.2.47.10.88.488.615.0_r083.FFE214.FFE214.FFE214.2.2.0.0.109.474.625.0_r0919.FFE214.FFE214.FFE214.0.2.63.51.104.579.538.0_fa12.50.50.50.50.65.56_fb_fh_fc1.9ED4FF.55.1.9ED4FF.55.50.61.61.50.50.50_fj0.0.0_fd0.0.16.FFE214.56_fe50.61_ff0000000000_fg1.50.56.0.0.1.0.0_fi_pa0.0.0.0.40.50.85.85.0.0_t00_pb_pc_pd_pe_ga0_gb0_gc50.0_ge0000000000_gh_gf_gg_gd0000000_ha100.100_hb49.1.44.90_hc0.60.39.0.60.39_hd35.1.49.49_ia_if_ib_id_ic_jc_ie_ja_jb_jd_je_jf_jg_ka27.FE69A1.55.55.0_kb_kc_kd_ke_kf_la_lb_oa_os_ob_oc_od_oe_of_lc_m00_n00_s00_og_oh_oo_op_oq_or_om_on_ok_ol_oi_oj_ad0.0.0.0.0.0.0.0.0.0

3-happy=54**aa19.61.0.8.6.19.61.1.8.6_ab_ac_ba50_bb17.1_bc150.500.8.0.1.0_bd17_be180_ca64.0.30.64.35.34.34.0.0.0.60.80_da1.0.0.100_db_dd9.3.30.50.50.50_dh2.30.50.50.2_di7_qa_qb_dc0.1.1.1.1_eh8.FFE214.100_ea8.FFE214.FFE214.56.0.0_ec16.70.FFE214.FFE214.56.38.55.1_ed22.53.0.1.FFE214.56_ef3.2.0.FFE214.FFE214.56.0_eg3.2.0.FFE214.FFE214.56.0_r0019.FFE214.FFE214.56.0.2.50.50.86.588.580.0_r0219.FFE214.FFE214.56.0.2.100.100.100.582.550.0_r0342.FFE214.FFE214.56.0.2.34.37.86.541.595.0_r0419.FFE214.FFE214.FFE214.0.2.100.59.102.562.593.0_r053.FFE214.FFE214.FFE214.0.2.4.0.62.495.561.0_r062.FFE214.FFE214.FFE214.2.2.100.100.192.527.613.0_r0717.FFE214.FFE214.FFE214.0.2.47.10.88.488.615.0_r083.FFE214.FFE214.FFE214.2.2.0.0.109.474.625.0_r0919.FFE214.FFE214.FFE214.0.2.63.51.104.579.538.0_fa12.50.50.50.50.65.56_fb_fh_fc1.9ED4FF.55.1.9ED4FF.55.50.61.61.50.50.50_fj0.0.0_fd0.0.16.FFE214.56_fe50.61_ff0000000000_fg1.50.56.0.0.1.0.0_fi_pa0.0.0.0.40.50.85.85.0.0_t00_pb_pc_pd_pe_ga0_gb0_gc14.0_ge0000000000_gh_gf_gg_gd0000000_ha6.6_hb49.1.50.90_hc0.59.39.0.59.39_hd23.1.49.49_ia_if_ib_id_ic_jc_ie_ja_jb_jd_je_jf_jg_ka27.FE69A1.55.55.0_kb_kc_kd_ke_kf_la_lb_oa_os_ob_oc_od_oe_of_lc_m00_n00_s00_og_oh_oo_op_oq_or_om_on_ok_ol_oi_oj_ad0.0.0.0.0.0.0.0.0.0

4-shocked=36**ia_if_ib_id_ic_jc_ie_ja_jb_jd_je_jf_jg_ka_kb_kc_kd_ke_kf_la_lb_oa_os_ob_oc_od_oe_of_lc_m0_n0_s0_og_oh_oo_op_oq_or_om_on_ok_ol_oi_oj_aa16.72.1.47.29.16.72.1.47.29_ab_ac_ba50_bb17.1_bc150.500.8.0.1_bd17_be180_ca64.0.30.64.35.34.34.0.0_cb0_da1.0.0.100_db_dd9.3.30.50.50_dh2.30.50.50.2_di7_qa_qb_dc1.1.1.1.1_ea8.FFE214.FFE214.56.0.0_ec16.100.FFE214.FFE214.56_ed22.55.0.1.FFE214.56_ef3.2.0.FFE214.FFE214.56_eg3.2.0.FFE214.FFE214.56_eh8.FFE214_r019.FFE214.FFE214.56.0.2.63.51.104.579.538.0_r23.FFE214.FFE214.FFE214.2.2.0.0.109.474.625.0_r317.FFE214.FFE214.56.0.2.47.10.88.488.615.0_r42.FFE214.FFE214.FFE214.2.2.100.100.192.527.613.0_r53.FFE214.FFE214.FFE214.0.2.4.0.62.495.561.0_r619.FFE214.FFE214.56.0.2.100.59.102.562.593.0_r742.FFE214.FFE214.56.0.2.34.37.86.541.595.0_r819.FFE214.56.56.0.2.100.100.100.582.550.0_r919.FFE214.56.56.0.2.50.50.86.588.580.0_fa12.50.50.50.50.65.56_fb00_fc1.9ED4FF.55.1.9ED4FF.55.50.61.61_fd0.0.16.FFE214.56_fe50.61_ff0000000000_fg1.50_t0_pa0.0.0.0.40.50.85.85.0.0_pb_pc_pd_pe_ga0_gb0_gc0.0_ge0000000000_gh_gf_gg_gd10000000_ha100.100_hb49.1.44.90_hc0.47.39.0.47.39_hd39.1.49.49_gc50.0_dd1.3.30.50.50_dc50.1.1.1.1_eh8.FFE214

4-sad=36**ia_if_ib_id_ic_jc_ie_ja_jb_jd_je_jf_jg_ka_kb_kc_kd_ke_kf_la_lb_oa_os_ob_oc_od_oe_of_lc_m0_n0_s0_og_oh_oo_op_oq_or_om_on_ok_ol_oi_oj_aa7.98.1.28.52.7.98.1.28.52_ab_ac_ba50_bb17.1_bc150.500.8.0.1_bd17_be180_ca64.0.30.64.35.34.34.0.0_cb0_da1.0.0.100_db_dd9.3.30.50.50_dh2.30.50.50.2_di7_qa_qb_dc1.1.1.1.1_ea8.FFE214.FFE214.56.0.0_ec16.100.FFE214.FFE214.56_ed22.55.0.1.FFE214.56_ef3.2.0.FFE214.FFE214.56_eg3.2.0.FFE214.FFE214.56_eh8.FFE214_r019.FFE214.FFE214.56.0.2.63.51.104.579.538.0_r23.FFE214.FFE214.FFE214.2.2.0.0.109.474.625.0_r317.FFE214.FFE214.56.0.2.47.10.88.488.615.0_r42.FFE214.FFE214.FFE214.2.2.100.100.192.527.613.0_r53.FFE214.FFE214.FFE214.0.2.4.0.62.495.561.0_r619.FFE214.FFE214.56.0.2.100.59.102.562.593.0_r742.FFE214.FFE214.56.0.2.34.37.86.541.595.0_r819.FFE214.56.56.0.2.100.100.100.582.550.0_r919.FFE214.56.56.0.2.50.50.86.588.580.0_fa12.50.50.50.50.65.56_fb00_fc1.9ED4FF.55.1.9ED4FF.55.50.61.61_fd0.0.16.FFE214.56_fe50.61_ff0000000000_fg1.50_t0_pa0.0.0.0.40.50.85.85.0.0_pb_pc_pd_pe_ga0_gb0_gc0.0_ge0000000000_gh_gf_gg_gd10000000_ha79.79_hb49.1.29.90_hc0.59.39.0.59.39_hd5.1.49.49_gc50.0_dd1.3.30.50.50_dc50.1.1.1.1_eh8.FFE214

4-interested=36**ia_if_ib_id_ic_jc_ie_ja_jb_jd_je_jf_jg_ka_kb_kc_kd_ke_kf_la_lb_oa_os_ob_oc_od_oe_of_lc_m0_n0_s0_og_oh_oo_op_oq_or_om_on_ok_ol_oi_oj_aa8.73.1.47.31.8.73.1.47.31_ab_ac_ba50_bb17.1_bc150.500.8.0.1_bd17_be180_ca64.0.30.64.35.34.34.0.0_cb0_da1.0.0.100_db_dd9.3.30.50.50_dh2.30.50.50.2_di7_qa_qb_dc1.1.1.1.1_ea8.FFE214.FFE214.56.0.0_ec16.100.FFE214.FFE214.56_ed22.55.0.1.FFE214.56_ef3.2.0.FFE214.FFE214.56_eg3.2.0.FFE214.FFE214.56_eh8.FFE214_r019.FFE214.FFE214.56.0.2.63.51.104.579.538.0_r23.FFE214.FFE214.FFE214.2.2.0.0.109.474.625.0_r317.FFE214.FFE214.56.0.2.47.10.88.488.615.0_r42.FFE214.FFE214.FFE214.2.2.100.100.192.527.613.0_r53.FFE214.FFE214.FFE214.0.2.4.0.62.495.561.0_r619.FFE214.FFE214.56.0.2.100.59.102.562.593.0_r742.FFE214.FFE214.56.0.2.34.37.86.541.595.0_r819.FFE214.56.56.0.2.100.100.100.582.550.0_r919.FFE214.56.56.0.2.50.50.86.588.580.0_fa12.50.50.50.50.65.56_fb00_fc1.9ED4FF.55.1.9ED4FF.55.50.61.61_fd0.0.16.FFE214.56_fe50.61_ff0000000000_fg1.50_t0_pa0.0.0.0.40.50.85.85.0.0_pb_pc_pd_pe_ga0_gb0_gc0.0_ge0000000000_gh_gf_gg_gd10000000_ha96.96_hb49.1.44.90_hc0.60.39.0.60.39_hd17.1.49.49_gc60.0_dd10.3.30.50.50_dc50.1.1.1.1_eh8.FFE214

4-calm=36**ia_if_ib_id_ic_jc_ie_ja_jb_jd_je_jf_jg_ka_kb_kc_kd_ke_kf_la_lb_oa_os_ob_oc_od_oe_of_lc_m0_n0_s0_og_oh_oo_op_oq_or_om_on_ok_ol_oi_oj_aa7.92.1.28.52.7.92.1.28.52_ab_ac_ba50_bb17.1_bc150.500.8.0.1_bd17_be180_ca64.0.30.64.35.34.34.0.0_cb0_da1.0.0.100_db_dd9.3.30.50.50_dh2.30.50.50.2_di7_qa_qb_dc1.1.1.1.1_ea8.FFE214.FFE214.56.0.0_ec16.100.FFE214.FFE214.56_ed22.55.0.1.FFE214.56_ef3.2.0.FFE214.FFE214.56_eg3.2.0.FFE214.FFE214.56_eh8.FFE214_r019.FFE214.FFE214.56.0.2.63.51.104.579.538.0_r23.FFE214.FFE214.FFE214.2.2.0.0.109.474.625.0_r317.FFE214.FFE214.56.0.2.47.10.88.488.615.0_r42.FFE214.FFE214.FFE214.2.2.100.100.192.527.613.0_r53.FFE214.FFE214.FFE214.0.2.4.0.62.495.561.0_r619.FFE214.FFE214.56.0.2.100.59.102.562.593.0_r742.FFE214.FFE214.56.0.2.34.37.86.541.595.0_r819.FFE214.56.56.0.2.100.100.100.582.550.0_r919.FFE214.56.56.0.2.50.50.86.588.580.0_fa12.50.50.50.50.65.56_fb00_fc1.9ED4FF.55.1.9ED4FF.55.50.61.61_fd0.0.16.FFE214.56_fe50.61_ff0000000000_fg1.50_t0_pa0.0.0.0.40.50.85.85.0.0_pb_pc_pd_pe_ga0_gb0_gc0.0_ge0000000000_gh_gf_gg_gd10000000_ha88.88_hb49.1.44.90_hc0.59.39.0.59.39_hd0.1.49.49_gc50.0_dd1.3.30.50.50_dc50.1.1.1.1_eh8.FFE214

4-horny=36**ia_if_ib_id_ic_jc_ie_ja_jb_jd_je_jf_jg_ka_kb_kc_kd_ke_kf_la_lb_oa_os_ob_oc_od_oe_of_lc_m0_n0_s0_og_oh_oo_op_oq_or_om_on_ok_ol_oi_oj_aa20.80.0.28.52.20.80.0.28.52_ab_ac_ba50_bb17.1_bc150.500.8.0.1_bd17_be180_ca64.0.30.64.35.34.34.0.0_cb0_da1.0.0.100_db_dd9.3.30.50.50_dh2.30.50.50.2_di7_qa_qb_dc1.1.1.1.1_ea8.FFE214.FFE214.56.0.0_ec16.100.FFE214.FFE214.56_ed22.55.0.1.FFE214.56_ef3.2.0.FFE214.FFE214.56_eg3.2.0.FFE214.FFE214.56_eh8.FFE214_r019.FFE214.FFE214.56.0.2.63.51.104.579.538.0_r23.FFE214.FFE214.FFE214.2.2.0.0.109.474.625.0_r317.FFE214.FFE214.56.0.2.47.10.88.488.615.0_r42.FFE214.FFE214.FFE214.2.2.100.100.192.527.613.0_r53.FFE214.FFE214.FFE214.0.2.4.0.62.495.561.0_r619.FFE214.FFE214.56.0.2.100.59.102.562.593.0_r742.FFE214.FFE214.56.0.2.34.37.86.541.595.0_r819.FFE214.56.56.0.2.100.100.100.582.550.0_r919.FFE214.56.56.0.2.50.50.86.588.580.0_fa12.50.50.50.50.65.56_fb00_fc1.9ED4FF.55.1.9ED4FF.55.50.61.61_fd0.0.16.FFE214.56_fe50.61_ff0000000000_fg1.50_t0_pa0.0.0.0.40.50.85.85.0.0_pb_pc_pd_pe_ga0_gb0_gc0.0_ge0000000000_gh_gf_gg_gd10000000_ha100.100_hb49.1.44.90_hc0.60.39.0.60.39_hd35.1.49.49_gc70.0_dd12.3.30.50.50_dc50.1.1.1.1_eh8.FFE214

4-happy=36**ia_if_ib_id_ic_jc_ie_ja_jb_jd_je_jf_jg_ka_kb_kc_kd_ke_kf_la_lb_oa_os_ob_oc_od_oe_of_lc_m0_n0_s0_og_oh_oo_op_oq_or_om_on_ok_ol_oi_oj_aa19.61.0.8.6.19.61.1.8.6_ab_ac_ba50_bb17.1_bc150.500.8.0.1_bd17_be180_ca64.0.30.64.35.34.34.0.0_cb0_da1.0.0.100_db_dd9.3.30.50.50_dh2.30.50.50.2_di7_qa_qb_dc1.1.1.1.1_ea8.FFE214.FFE214.56.0.0_ec16.100.FFE214.FFE214.56_ed22.55.0.1.FFE214.56_ef3.2.0.FFE214.FFE214.56_eg3.2.0.FFE214.FFE214.56_eh8.FFE214_r019.FFE214.FFE214.56.0.2.63.51.104.579.538.0_r23.FFE214.FFE214.FFE214.2.2.0.0.109.474.625.0_r317.FFE214.FFE214.56.0.2.47.10.88.488.615.0_r42.FFE214.FFE214.FFE214.2.2.100.100.192.527.613.0_r53.FFE214.FFE214.FFE214.0.2.4.0.62.495.561.0_r619.FFE214.FFE214.56.0.2.100.59.102.562.593.0_r742.FFE214.FFE214.56.0.2.34.37.86.541.595.0_r819.FFE214.56.56.0.2.100.100.100.582.550.0_r919.FFE214.56.56.0.2.50.50.86.588.580.0_fa12.50.50.50.50.65.56_fb00_fc1.9ED4FF.55.1.9ED4FF.55.50.61.61_fd0.0.16.FFE214.56_fe50.61_ff0000000000_fg1.50_t0_pa0.0.0.0.40.50.85.85.0.0_pb_pc_pd_pe_ga0_gb0_gc0.0_ge0000000000_gh_gf_gg_gd10000000_ha6.6_hb49.1.50.90_hc0.59.39.0.59.39_hd23.1.49.49_gc50.0_dd1.3.30.50.50_dc50.1.1.1.1_eh8.FFE214

6-shocked=36**ia_if_ib_id_ic_jc_ie_ja_jb_jd_je_jf_jg_ka_kb_kc_kd_ke_kf_la_lb_oa_os_ob_oc_od_oe_of_lc_m0_n0_s0_og_oh_oo_op_oq_or_om_on_ok_ol_oi_oj_aa16.72.1.47.29.16.72.1.47.29_ab_ac_ba50_bb17.1_bc150.500.8.0.1_bd17_be180_ca64.0.30.64.35.34.34.0.0_cb0_da1.0.0.100_db_dd9.3.30.50.50_dh2.30.50.50.2_di7_qa_qb_dc1.1.1.1.1_ea8.FFE214.FFE214.56.0.0_ec16.100.FFE214.FFE214.56_ed22.55.0.1.FFE214.56_ef3.2.0.FFE214.FFE214.56_eg3.2.0.FFE214.FFE214.56_eh8.FFE214_r019.FFE214.FFE214.56.0.2.63.51.104.579.538.0_r23.FFE214.FFE214.FFE214.2.2.0.0.109.474.625.0_r317.FFE214.FFE214.56.0.2.47.10.88.488.615.0_r42.FFE214.FFE214.FFE214.2.2.100.100.192.527.613.0_r53.FFE214.FFE214.FFE214.0.2.4.0.62.495.561.0_r619.FFE214.FFE214.56.0.2.100.59.102.562.593.0_r742.FFE214.FFE214.56.0.2.34.37.86.541.595.0_r819.FFE214.56.56.0.2.100.100.100.582.550.0_r919.FFE214.56.56.0.2.50.50.86.588.580.0_fa12.50.50.50.50.65.56_fb00_fc1.9ED4FF.55.1.9ED4FF.55.50.61.61_fd0.0.16.FFE214.56_fe50.61_ff0000000000_fg1.50_t0_pa0.0.0.0.40.50.85.85.0.0_pb_pc_pd_pe_ga0_gb0_gc0.0_ge0000000000_gh_gf_gg_gd10000000_ha100.100_hb49.1.44.90_hc0.47.39.0.47.39_hd39.1.49.49_gc50.0_dd1.3.30.50.50_dc150.1.1.1.1_eh8.FFE214

6-sad=36**ia_if_ib_id_ic_jc_ie_ja_jb_jd_je_jf_jg_ka_kb_kc_kd_ke_kf_la_lb_oa_os_ob_oc_od_oe_of_lc_m0_n0_s0_og_oh_oo_op_oq_or_om_on_ok_ol_oi_oj_aa7.98.1.28.52.7.98.1.28.52_ab_ac_ba50_bb17.1_bc150.500.8.0.1_bd17_be180_ca64.0.30.64.35.34.34.0.0_cb0_da1.0.0.100_db_dd9.3.30.50.50_dh2.30.50.50.2_di7_qa_qb_dc1.1.1.1.1_ea8.FFE214.FFE214.56.0.0_ec16.100.FFE214.FFE214.56_ed22.55.0.1.FFE214.56_ef3.2.0.FFE214.FFE214.56_eg3.2.0.FFE214.FFE214.56_eh8.FFE214_r019.FFE214.FFE214.56.0.2.63.51.104.579.538.0_r23.FFE214.FFE214.FFE214.2.2.0.0.109.474.625.0_r317.FFE214.FFE214.56.0.2.47.10.88.488.615.0_r42.FFE214.FFE214.FFE214.2.2.100.100.192.527.613.0_r53.FFE214.FFE214.FFE214.0.2.4.0.62.495.561.0_r619.FFE214.FFE214.56.0.2.100.59.102.562.593.0_r742.FFE214.FFE214.56.0.2.34.37.86.541.595.0_r819.FFE214.56.56.0.2.100.100.100.582.550.0_r919.FFE214.56.56.0.2.50.50.86.588.580.0_fa12.50.50.50.50.65.56_fb00_fc1.9ED4FF.55.1.9ED4FF.55.50.61.61_fd0.0.16.FFE214.56_fe50.61_ff0000000000_fg1.50_t0_pa0.0.0.0.40.50.85.85.0.0_pb_pc_pd_pe_ga0_gb0_gc0.0_ge0000000000_gh_gf_gg_gd10000000_ha79.79_hb49.1.29.90_hc0.59.39.0.59.39_hd5.1.49.49_gc50.0_dd1.3.30.50.50_dc150.1.1.1.1_eh8.FFE214

6-interested=36**ia_if_ib_id_ic_jc_ie_ja_jb_jd_je_jf_jg_ka_kb_kc_kd_ke_kf_la_lb_oa_os_ob_oc_od_oe_of_lc_m0_n0_s0_og_oh_oo_op_oq_or_om_on_ok_ol_oi_oj_aa8.73.1.47.31.8.73.1.47.31_ab_ac_ba50_bb17.1_bc150.500.8.0.1_bd17_be180_ca64.0.30.64.35.34.34.0.0_cb0_da1.0.0.100_db_dd9.3.30.50.50_dh2.30.50.50.2_di7_qa_qb_dc1.1.1.1.1_ea8.FFE214.FFE214.56.0.0_ec16.100.FFE214.FFE214.56_ed22.55.0.1.FFE214.56_ef3.2.0.FFE214.FFE214.56_eg3.2.0.FFE214.FFE214.56_eh8.FFE214_r019.FFE214.FFE214.56.0.2.63.51.104.579.538.0_r23.FFE214.FFE214.FFE214.2.2.0.0.109.474.625.0_r317.FFE214.FFE214.56.0.2.47.10.88.488.615.0_r42.FFE214.FFE214.FFE214.2.2.100.100.192.527.613.0_r53.FFE214.FFE214.FFE214.0.2.4.0.62.495.561.0_r619.FFE214.FFE214.56.0.2.100.59.102.562.593.0_r742.FFE214.FFE214.56.0.2.34.37.86.541.595.0_r819.FFE214.56.56.0.2.100.100.100.582.550.0_r919.FFE214.56.56.0.2.50.50.86.588.580.0_fa12.50.50.50.50.65.56_fb00_fc1.9ED4FF.55.1.9ED4FF.55.50.61.61_fd0.0.16.FFE214.56_fe50.61_ff0000000000_fg1.50_t0_pa0.0.0.0.40.50.85.85.0.0_pb_pc_pd_pe_ga0_gb0_gc0.0_ge0000000000_gh_gf_gg_gd10000000_ha96.96_hb49.1.44.90_hc0.60.39.0.60.39_hd17.1.49.49_gc60.0_dd10.3.30.50.50_dc150.1.1.1.1_eh8.FFE214

6-calm=36**ia_if_ib_id_ic_jc_ie_ja_jb_jd_je_jf_jg_ka_kb_kc_kd_ke_kf_la_lb_oa_os_ob_oc_od_oe_of_lc_m0_n0_s0_og_oh_oo_op_oq_or_om_on_ok_ol_oi_oj_aa7.92.1.28.52.7.92.1.28.52_ab_ac_ba50_bb17.1_bc150.500.8.0.1_bd17_be180_ca64.0.30.64.35.34.34.0.0_cb0_da1.0.0.100_db_dd9.3.30.50.50_dh2.30.50.50.2_di7_qa_qb_dc1.1.1.1.1_ea8.FFE214.FFE214.56.0.0_ec16.100.FFE214.FFE214.56_ed22.55.0.1.FFE214.56_ef3.2.0.FFE214.FFE214.56_eg3.2.0.FFE214.FFE214.56_eh8.FFE214_r019.FFE214.FFE214.56.0.2.63.51.104.579.538.0_r23.FFE214.FFE214.FFE214.2.2.0.0.109.474.625.0_r317.FFE214.FFE214.56.0.2.47.10.88.488.615.0_r42.FFE214.FFE214.FFE214.2.2.100.100.192.527.613.0_r53.FFE214.FFE214.FFE214.0.2.4.0.62.495.561.0_r619.FFE214.FFE214.56.0.2.100.59.102.562.593.0_r742.FFE214.FFE214.56.0.2.34.37.86.541.595.0_r819.FFE214.56.56.0.2.100.100.100.582.550.0_r919.FFE214.56.56.0.2.50.50.86.588.580.0_fa12.50.50.50.50.65.56_fb00_fc1.9ED4FF.55.1.9ED4FF.55.50.61.61_fd0.0.16.FFE214.56_fe50.61_ff0000000000_fg1.50_t0_pa0.0.0.0.40.50.85.85.0.0_pb_pc_pd_pe_ga0_gb0_gc0.0_ge0000000000_gh_gf_gg_gd10000000_ha88.88_hb49.1.44.90_hc0.59.39.0.59.39_hd0.1.49.49_gc50.0_dd1.3.30.50.50_dc150.1.1.1.1_eh8.FFE214

6-horny=36**ia_if_ib_id_ic_jc_ie_ja_jb_jd_je_jf_jg_ka_kb_kc_kd_ke_kf_la_lb_oa_os_ob_oc_od_oe_of_lc_m0_n0_s0_og_oh_oo_op_oq_or_om_on_ok_ol_oi_oj_aa20.80.0.28.52.20.80.0.28.52_ab_ac_ba50_bb17.1_bc150.500.8.0.1_bd17_be180_ca64.0.30.64.35.34.34.0.0_cb0_da1.0.0.100_db_dd9.3.30.50.50_dh2.30.50.50.2_di7_qa_qb_dc1.1.1.1.1_ea8.FFE214.FFE214.56.0.0_ec16.100.FFE214.FFE214.56_ed22.55.0.1.FFE214.56_ef3.2.0.FFE214.FFE214.56_eg3.2.0.FFE214.FFE214.56_eh8.FFE214_r019.FFE214.FFE214.56.0.2.63.51.104.579.538.0_r23.FFE214.FFE214.FFE214.2.2.0.0.109.474.625.0_r317.FFE214.FFE214.56.0.2.47.10.88.488.615.0_r42.FFE214.FFE214.FFE214.2.2.100.100.192.527.613.0_r53.FFE214.FFE214.FFE214.0.2.4.0.62.495.561.0_r619.FFE214.FFE214.56.0.2.100.59.102.562.593.0_r742.FFE214.FFE214.56.0.2.34.37.86.541.595.0_r819.FFE214.56.56.0.2.100.100.100.582.550.0_r919.FFE214.56.56.0.2.50.50.86.588.580.0_fa12.50.50.50.50.65.56_fb00_fc1.9ED4FF.55.1.9ED4FF.55.50.61.61_fd0.0.16.FFE214.56_fe50.61_ff0000000000_fg1.50_t0_pa0.0.0.0.40.50.85.85.0.0_pb_pc_pd_pe_ga0_gb0_gc0.0_ge0000000000_gh_gf_gg_gd10000000_ha100.100_hb49.1.44.90_hc0.60.39.0.60.39_hd35.1.49.49_gc70.0_dd12.3.30.50.50_dc150.1.1.1.1_eh8.FFE214

6-happy=36**ia_if_ib_id_ic_jc_ie_ja_jb_jd_je_jf_jg_ka_kb_kc_kd_ke_kf_la_lb_oa_os_ob_oc_od_oe_of_lc_m0_n0_s0_og_oh_oo_op_oq_or_om_on_ok_ol_oi_oj_aa19.61.0.8.6.19.61.1.8.6_ab_ac_ba50_bb17.1_bc150.500.8.0.1_bd17_be180_ca64.0.30.64.35.34.34.0.0_cb0_da1.0.0.100_db_dd9.3.30.50.50_dh2.30.50.50.2_di7_qa_qb_dc1.1.1.1.1_ea8.FFE214.FFE214.56.0.0_ec16.100.FFE214.FFE214.56_ed22.55.0.1.FFE214.56_ef3.2.0.FFE214.FFE214.56_eg3.2.0.FFE214.FFE214.56_eh8.FFE214_r019.FFE214.FFE214.56.0.2.63.51.104.579.538.0_r23.FFE214.FFE214.FFE214.2.2.0.0.109.474.625.0_r317.FFE214.FFE214.56.0.2.47.10.88.488.615.0_r42.FFE214.FFE214.FFE214.2.2.100.100.192.527.613.0_r53.FFE214.FFE214.FFE214.0.2.4.0.62.495.561.0_r619.FFE214.FFE214.56.0.2.100.59.102.562.593.0_r742.FFE214.FFE214.56.0.2.34.37.86.541.595.0_r819.FFE214.56.56.0.2.100.100.100.582.550.0_r919.FFE214.56.56.0.2.50.50.86.588.580.0_fa12.50.50.50.50.65.56_fb00_fc1.9ED4FF.55.1.9ED4FF.55.50.61.61_fd0.0.16.FFE214.56_fe50.61_ff0000000000_fg1.50_t0_pa0.0.0.0.40.50.85.85.0.0_pb_pc_pd_pe_ga0_gb0_gc0.0_ge0000000000_gh_gf_gg_gd10000000_ha6.6_hb49.1.50.90_hc0.59.39.0.59.39_hd23.1.49.49_gc50.0_dd1.3.30.50.50_dc150.1.1.1.1_eh8.FFE214

