#Fully clothed (in diguise)

0-shocked=47**aa24.32.1.39.54.9.12.1.39.54_ab_ac_ba48_bb16.1_bc237.500.8.0.1_bd16_be178_ca70.0.20.70.30.20.10.0.12_cb0_daFDA256.0.0.100_db_dd0.3.7.40.50.50_dhA66A56.55.50.50.0_di5_qa_qb_dc0.1.D98763.D98763.D98763_eh4.151515_ea22.151515.151515.56.0.0_ec6.70.151515.151515.56.28.65.0_ed16.0.1.1.151515.56_ef_eg_r0026.151515.151515.56.0.0.47.47.62.582.435.1_fa7.50.50.68.0.51.55_fb_fh1_fc0.52.55.0.52.55.47.61.61.47.50.50_fd7.0.10.151515.56_fe50.61_ff0000000000_fg3.50_pa0.0.0.0.40.50.85.85.0.0_t00_pb_pc_pd_pe_ga0_gb1_gc20.0_ge0000000000_gh_gf_gg_gd10100000_ha100.100_hb49.1.44.52_hc0.32.52.0.32.52_hd37.1.81.49_ia_if_ib_id_ic_jc_ie_ja_jb_jd2.76A9A7.76A9A7.57_je2.76A9A7.76A9A7.57_jf_jg_ka10.46AFC5.59.59.0_kb10.46AFC5.59.59_kc_kd_ke_kf_la12.46AFC5.46AFC5.0.1_lb_oa_os_ob22.43.42.0_oc22.43.42.0_od6.41.60.0.0_oe_of_lc_m0037.43.3.0.0.2.25.15.0.81.4.61_m015.27.3.0.0.2.13.15.0.81.4.61_n00_s00_og_oh_oo_op_oq_or_om_on_ok_ol_oi_oj_ad0.0.0.0.0.0.0.0.0.0
0-angry=47**aa11.99.1.47.56.11.99.1.47.56_ab_ac_ba60_bb17.1_bc237.500.8.0.1_bd17_be178_ca70.0.20.70.30.20.10.0.12_cb0_daFDA256.0.0.100_db_dd0.3.7.40.50.50_dhA66A56.55.50.50.0_di5_qa_qb_dc0.1.D98763.D98763.D98763_eh4.151515_ea22.151515.151515.56.0.0_ec6.70.151515.151515.56.28.65.0_ed16.0.1.1.151515.56_ef_eg_r0026.151515.151515.56.0.0.47.47.62.582.435.1_fa7.50.50.68.0.51.55_fb_fh1_fc0.52.55.0.52.55.47.61.61.47.50.50_fd7.0.10.151515.56_fe50.61_ff0000000000_fg3.50_pa0.0.0.0.40.50.85.85.0.0_t00_pb_pc_pd_pe_ga0_gb1_gc20.0_ge0000000000_gh_gf_gg_gd10100000_ha75.75_hb22.1.44.65_hc0.0.19.0.0.19_hd21.1.50.49_ia_if_ib_id_ic_jc_ie_ja_jb_jd2.76A9A7.76A9A7.57_je2.76A9A7.76A9A7.57_jf_jg_ka10.46AFC5.59.59.0_kb10.46AFC5.59.59_kc_kd_ke_kf_la12.46AFC5.46AFC5.0.1_lb_oa_os_ob22.43.42.0_oc22.43.42.0_od6.41.60.0.0_oe_of_lc_m0037.43.3.0.0.2.25.15.0.81.4.61_m015.27.3.0.0.2.13.15.0.81.4.61_n00_s00_og_oh_oo_op_oq_or_om_on_ok_ol_oi_oj_ad0.0.0.0.0.0.0.0.0.0
0-happy=47**aa89.0.1.39.50.89.0.1.39.50_ab_ac_ba48_bb7.1_bc237.500.8.0.1_bd7_be178_ca70.0.20.70.30.20.10.0.12_cb0_daFDA256.0.0.100_db_dd0.3.7.40.50.50_dhA66A56.55.50.50.0_di5_qa_qb_dc0.1.D98763.D98763.D98763_eh4.151515_ea22.151515.151515.56.0.0_ec6.70.151515.151515.56.28.65.0_ed16.0.1.1.151515.56_ef_eg_r0026.151515.151515.56.0.0.47.47.62.582.435.1_fa7.50.50.68.0.51.55_fb_fh1_fc0.52.55.0.52.55.47.61.61.47.50.50_fd7.0.10.151515.56_fe50.61_ff0000000000_fg3.50_pa0.0.0.0.40.50.85.85.0.0_t00_pb_pc_pd_pe_ga0_gb1_gc20.0_ge0000000000_gh_gf_gg_gd10100000_ha1.1_hb49.1.44.65_hc0.60.22.0.60.22_hd23.1.100.49_ia_if_ib_id_ic_jc_ie_ja_jb_jd2.76A9A7.76A9A7.57_je2.76A9A7.76A9A7.57_jf_jg_ka10.46AFC5.59.59.0_kb10.46AFC5.59.59_kc_kd_ke_kf_la12.46AFC5.46AFC5.0.1_lb_oa_os_ob22.43.42.0_oc22.43.42.0_od6.41.60.0.0_oe_of_lc_m0037.43.3.0.0.2.25.15.0.81.4.61_m015.27.3.0.0.2.13.15.0.81.4.61_n00_s00_og_oh_oo_op_oq_or_om_on_ok_ol_oi_oj_ad0.0.0.0.0.0.0.0.0.0
0-horny=47**aa13.96.1.26.1.12.96.1.3.40_ab_ac_ba48_bb13.1_bc237.500.8.0.1_bd43_be178_ca70.0.20.70.30.20.10.0.12_cb0_daFDA256.0.0.100_db_dd0.3.7.40.50.50_dhA66A56.55.50.50.0_di5_qa_qb_dc0.1.D98763.D98763.D98763_eh4.151515_ea22.151515.151515.56.0.0_ec6.70.151515.151515.56.28.65.0_ed16.0.1.1.151515.56_ef_eg_r0026.151515.151515.56.0.0.47.47.62.582.435.1_fa7.50.50.68.0.51.55_fb_fh1_fc0.52.55.0.52.55.47.61.61.47.50.50_fd7.0.10.151515.56_fe50.61_ff0000000000_fg3.50_pa0.0.0.0.40.50.85.85.0.0_t00_pb_pc_pd_pe_ga0_gb1_gc20.0_ge0000000000_gh_gf_gg_gd10100000_ha81.81_hb49.1.44.65_hc0.10.39.0.10.39_hd35.1.50.49_ia_if_ib_id_ic_jc_ie_ja_jb_jd2.76A9A7.76A9A7.57_je2.76A9A7.76A9A7.57_jf_jg_ka10.46AFC5.59.59.0_kb10.46AFC5.59.59_kc_kd_ke_kf_la12.46AFC5.46AFC5.0.1_lb_oa_os_ob22.43.42.0_oc22.43.42.0_od6.41.60.0.0_oe_of_lc_m0037.43.3.0.0.2.25.15.0.81.4.61_m015.27.3.0.0.2.13.15.0.81.4.61_n00_s00_og_oh_oo_op_oq_or_om_on_ok_ol_oi_oj_ad0.0.0.0.0.0.0.0.0.0
0-calm=47**aa7.70.1.49.50.7.70.1.49.50_ab_ac_ba50_bb13.1_bc237.500.8.0.1_bd13_be178_ca70.0.20.70.30.20.10.0.12_cb0_daFDA256.0.0.100_db_dd0.3.7.40.50.50_dhA66A56.55.50.50.0_di5_qa_qb_dc0.1.D98763.D98763.D98763_eh4.151515_ea22.151515.151515.56.0.0_ec6.70.151515.151515.56.28.65.0_ed16.0.1.1.151515.56_ef_eg_r0026.151515.151515.56.0.0.47.47.62.582.435.1_fa7.50.50.68.0.51.55_fb_fh1_fc0.52.55.0.52.55.47.61.61.47.50.50_fd7.0.10.151515.56_fe50.61_ff0000000000_fg3.50_pa0.0.0.0.40.50.85.85.0.0_t00_pb_pc_pd_pe_ga0_gb1_gc20.0_ge0000000000_gh_gf_gg_gd10100000_ha90.90_hb49.1.44.65_hc0.40.39.0.40.39_hd0.1.50.49_ia_if_ib_id_ic_jc_ie_ja_jb_jd2.76A9A7.76A9A7.57_je2.76A9A7.76A9A7.57_jf_jg_ka10.46AFC5.59.59.0_kb10.46AFC5.59.59_kc_kd_ke_kf_la12.46AFC5.46AFC5.0.1_lb_oa_os_ob22.43.42.0_oc22.43.42.0_od6.41.60.0.0_oe_of_lc_m0037.43.3.0.0.2.25.15.0.81.4.61_m015.27.3.0.0.2.13.15.0.81.4.61_n00_s00_og_oh_oo_op_oq_or_om_on_ok_ol_oi_oj_ad0.0.0.0.0.0.0.0.0.0
0-confused=47**aa15.62.1.9.25.8.100.1.0.50_ab_ac_ba70_bb15.1_bc237.500.8.0.1_bd8_be178_ca70.0.20.70.30.20.10.0.12_cb0_daFDA256.0.0.100_db_dd0.3.7.40.50.50_dhA66A56.55.50.50.0_di5_qa_qb_dc0.1.D98763.D98763.D98763_eh4.151515_ea22.151515.151515.56.0.0_ec6.70.151515.151515.56.28.65.0_ed16.0.1.1.151515.56_ef_eg_r0026.151515.151515.56.0.0.47.47.62.582.435.1_fa7.50.50.68.0.51.55_fb_fh1_fc0.52.55.0.52.55.47.61.61.47.50.50_fd7.0.19.151515.56_fe50.61_ff0000000000_fg3.50_pa0.0.0.0.40.50.85.85.0.0_t00_pb_pc_pd_pe_ga0_gb1_gc20.0_ge0000000000_gh_gf_gg_gd10100000_ha100.100_hb0.1.44.65_hc0.40.39.0.40.39_hd22.1.50.49_ia_if_ib_id_ic_jc_ie_ja_jb_jd2.76A9A7.76A9A7.57_je2.76A9A7.76A9A7.57_jf_jg_ka10.46AFC5.59.59.0_kb10.46AFC5.59.59_kc_kd_ke_kf_la12.46AFC5.46AFC5.0.1_lb_oa_os_ob22.43.42.0_oc22.43.42.0_od6.41.60.0.0_oe_of_lc_m0037.43.3.0.0.2.25.15.0.81.4.61_m015.27.3.0.0.2.13.15.0.81.4.61_n00_s00_og_oh_oo_op_oq_or_om_on_ok_ol_oi_oj_ad0.0.0.0.0.0.0.0.0.0
0-interested=47**aa5.95.1.25.50.5.95.1.25.50_ab_ac_ba35_bb0.1_bc237.500.8.0.1_bd0_be180_ca70.0.20.70.30.20.10.0.12_cb0_daFDA256.0.0.100_db_dd0.3.7.40.50.50_dhA66A56.55.50.50.0_di5_qa_qb_dc0.1.D98763.D98763.D98763_eh4.151515_ea22.151515.151515.56.0.0_ec6.70.151515.151515.56.28.65.0_ed16.0.1.1.151515.56_ef_eg_r0026.151515.151515.56.0.0.47.47.62.582.435.1_fa7.50.50.68.0.51.55_fb_fh1_fc0.52.55.0.52.55.47.61.61.47.50.50_fd7.0.10.151515.56_fe50.61_ff0000000000_fg3.50_pa0.0.0.0.40.50.85.85.0.0_t00_pb_pc_pd_pe_ga0_gb1_gc20.0_ge0000000000_gh_gf_gg_gd10100000_ha68.68_hb50.1.44.65_hc0.19.39.0.19.39_hd34.1.60.49_ia_if_ib_id_ic_jc_ie_ja_jb_jd2.76A9A7.76A9A7.57_je2.76A9A7.76A9A7.57_jf_jg_ka10.46AFC5.59.59.0_kb10.46AFC5.59.59_kc_kd_ke_kf_la12.46AFC5.46AFC5.0.1_lb_oa_os_ob22.43.42.0_oc22.43.42.0_od6.41.60.0.0_oe_of_lc_m0037.43.3.0.0.2.25.15.0.81.4.61_m015.27.3.0.0.2.13.15.0.81.4.61_n00_s00_og_oh_oo_op_oq_or_om_on_ok_ol_oi_oj_ad0.0.0.0.0.0.0.0.0.0
0-sad=47**aa15.97.1.27.45.9.3.1.2.45_ab_ac_ba35_bb6.1_bc237.500.8.0.1_bd17_be178_ca70.0.20.70.30.20.10.0.12_cb0_daFDA256.0.0.100_db_dd0.3.7.40.50.50_dhA66A56.55.50.50.0_di5_qa_qb_dc0.1.D98763.D98763.D98763_eh4.151515_ea22.151515.151515.56.0.0_ec6.70.151515.151515.56.28.65.0_ed16.0.1.1.151515.56_ef_eg_r0026.151515.151515.56.0.0.47.47.62.582.435.1_fa7.50.50.68.0.51.55_fb_fh1_fc0.52.55.0.52.55.47.61.61.47.50.50_fd7.0.10.151515.56_fe50.61_ff0000000000_fg3.50_pa0.0.0.0.40.50.85.85.0.0_t00_pb_pc_pd_pe_ga0_gb1_gc20.0_ge0000000000_gh_gf_gg_gd10100000_ha26.26_hb0.1.66.65_hc0.49.39.0.49.39_hd21.1.50.49_ia_if_ib_id_ic_jc_ie_ja_jb_jd2.76A9A7.76A9A7.57_je2.76A9A7.76A9A7.57_jf_jg_ka10.46AFC5.59.59.0_kb10.46AFC5.59.59_kc_kd_ke_kf_la12.46AFC5.46AFC5.0.1_lb_oa_os_ob22.43.42.0_oc22.43.42.0_od6.41.60.0.0_oe_of_lc_m0037.43.3.0.0.2.25.15.0.81.4.61_m015.27.3.0.0.2.13.15.0.81.4.61_n00_s00_og_oh_oo_op_oq_or_om_on_ok_ol_oi_oj_ad0.0.0.0.0.0.0.0.0.0
0-embarrassed=47**aa72.35.1.28.52.76.35.1.28.45_ab_ac_ba35_bb25.1_bc237.500.8.0.1_bd17_be178_ca70.0.20.70.30.20.10.0.12_cb0_daFDA256.0.0.100_db_dd0.3.7.40.50.50_dhA66A56.55.50.50.0_di5_qa_qb_dc0.1.D98763.D98763.D98763_eh4.151515_ea22.151515.151515.56.0.0_ec6.70.151515.151515.56.28.65.0_ed16.0.1.1.151515.56_ef_eg_r0026.151515.151515.56.0.0.47.47.62.582.435.1_fa7.50.50.68.0.51.55_fb_fh1_fc0.52.55.0.52.55.47.61.61.47.50.50_fd7.0.10.151515.56_fe50.61_ff0000000000_fg3.50_pa0.0.0.0.40.50.85.85.0.0_t00_pb_pc_pd_pe_ga0_gb1_gc20.0_ge0000000000_gh_gf_gg_gd10100000_ha26.26_hb0.1.66.65_hc0.49.39.0.49.39_hd8.1.50.49_ia_if_ib_id_ic_jc_ie_ja_jb_jd2.76A9A7.76A9A7.57_je2.76A9A7.76A9A7.57_jf_jg_ka10.46AFC5.59.59.0_kb10.46AFC5.59.59_kc_kd_ke_kf_la12.46AFC5.46AFC5.0.1_lb_oa_os_ob22.43.42.0_oc22.43.42.0_od6.41.60.0.0_oe_of_lc_m0037.43.3.0.0.2.25.15.0.81.4.61_m015.27.3.0.0.2.13.15.0.81.4.61_n00_s00_og_oh_oo_op_oq_or_om_on_ok_ol_oi_oj_ad0.0.0.0.0.0.0.0.0.0
0-strip=47**aa57.44.1.47.56.6.59.1.4.56_ab_ac_ba60_bb17.1_bc237.500.8.0.1_bd17_be178_ca70.0.20.70.30.20.10.0.12_cb0_daFDA256.0.0.100_db_dd0.3.7.40.50.50_dhA66A56.55.50.50.0_di5_qa_qb_dc0.1.D98763.D98763.D98763_eh4.151515_ea22.151515.151515.56.0.0_ec6.70.151515.151515.56.28.65.0_ed16.0.1.1.151515.56_ef_eg_r0026.151515.151515.56.0.0.47.47.62.582.435.1_fa7.50.50.68.0.51.55_fb_fh1_fc0.52.55.0.52.55.47.61.61.47.50.50_fd7.0.10.151515.56_fe50.61_ff0000000000_fg3.50_pa0.0.0.0.40.50.85.85.0.0_t00_pb_pc_pd_pe_ga0_gb1_gc20.0_ge0000000000_gh_gf_gg_gd10100000_ha75.75_hb22.1.44.65_hc0.0.19.0.0.19_hd21.1.50.49_ia_if_ib_id_ic_jc_ie_ja_jb_jd2.76A9A7.76A9A7.57_je2.76A9A7.76A9A7.57_jf_jg_ka10.46AFC5.59.59.0_kb10.46AFC5.59.59_kc_kd_ke_kf_la12.46AFC5.46AFC5.0.1_lb_oa_os_ob22.43.42.0_oc22.43.42.0_od6.41.60.0.0_oe_of_lc_m0037.43.3.0.0.2.25.15.0.81.4.61_m015.27.3.0.0.2.13.15.0.81.4.61_n00_s00_og_oh_oo_op_oq_or_om_on_ok_ol_oi_oj_ad0.0.0.0.0.0.0.0.0.0

#Lost earrings

1-shocked=47**aa65.43.1.41.54.9.94.0.39.54_ab_ac_ba48_bb16.1_bc237.500.8.0.1_bd16_be178_ca70.0.20.70.30.20.10.0.12_cb0_daFDA256.0.0.100_db_dd0.3.7.40.50.50_dhA66A56.55.50.50.0_di5_qa_qb_dc0.1.D98763.D98763.D98763_eh4.151515_ea22.151515.151515.56.0.0_ec6.70.151515.151515.56.28.65.0_ed16.0.1.1.151515.56_ef_eg_r0026.151515.151515.56.0.0.47.47.62.582.435.1_fa7.50.50.68.0.51.55_fb_fh1_fc0.52.55.0.52.55.47.61.61.47.50.50_fd7.0.10.151515.56_fe50.61_ff0000000000_fg3.50_pa0.0.0.0.40.50.85.85.0.0_t00_pb_pc_pd_pe_ga0_gb1_gc20.0_ge0000000000_gh_gf_gg_gd10100000_ha100.100_hb49.1.44.52_hc0.32.52.0.32.52_hd37.1.81.49_ia_if_ib_id_ic_jc_ie_ja_jb_jd2.76A9A7.76A9A7.57_je2.76A9A7.76A9A7.57_jf_jg_ka10.46AFC5.59.59.0_kb10.46AFC5.59.59_kc_kd_ke_kf_la12.46AFC5.46AFC5.0.1_lb_oa_os_ob_oc_od6.41.60.0.0_oe_of_lc_m0037.43.3.0.0.2.25.15.0.81.4.61_m015.27.3.0.0.2.13.15.0.81.4.61_n00_s00_og_oh_oo_op_oq_or_om_on_ok_ol_oi_oj_ad0.0.0.0.0.0.0.0.0.0
1-angry=47**aa17.54.1.12.31.17.39.1.1.55_ab_ac_ba60_bb13.1_bc237.500.8.0.1_bd5_be178_ca70.0.20.70.30.20.10.0.12_cb0_daFDA256.0.0.100_db_dd0.3.7.40.50.50_dhA66A56.55.50.50.0_di5_qa_qb_dc0.1.D98763.D98763.D98763_eh4.151515_ea22.151515.151515.56.0.0_ec6.70.151515.151515.56.28.65.0_ed16.0.1.1.151515.56_ef_eg_r0026.151515.151515.56.0.0.47.47.62.582.435.1_fa7.50.50.68.0.51.55_fb_fh1_fc0.52.55.0.52.55.47.61.61.47.50.50_fd7.0.10.151515.56_fe50.61_ff0000000000_fg3.50_pa0.0.0.0.40.50.85.85.0.0_t00_pb_pc_pd_pe_ga0_gb1_gc20.0_ge0000000000_gh_gf_gg_gd10100000_ha40.40_hb22.1.44.65_hc0.0.19.0.0.19_hd21.1.50.49_ia_if_ib_id_ic_jc_ie_ja_jb_jd2.76A9A7.76A9A7.57_je2.76A9A7.76A9A7.57_jf_jg_ka10.46AFC5.59.59.0_kb10.46AFC5.59.59_kc_kd_ke_kf_la12.46AFC5.46AFC5.0.1_lb_oa_os_ob_oc_od6.41.60.0.0_oe_of_lc_m0037.43.3.0.0.2.25.15.0.81.4.61_m015.27.3.0.0.2.13.15.0.81.4.61_n00_s00_og_oh_oo_op_oq_or_om_on_ok_ol_oi_oj_ad0.0.0.0.0.0.0.0.0.0
1-happy=47**aa12.4.1.3.100.14.30.1.3.83_ab_ac_ba50_bb50.1_bc237.500.8.0.1_bd13_be178_ca70.0.20.70.30.20.10.0.12_cb0_daFDA256.0.0.100_db_dd0.3.7.40.50.50_dhA66A56.55.50.50.0_di5_qa_qb_dc0.1.D98763.D98763.D98763_eh4.151515_ea22.151515.151515.56.0.0_ec6.70.151515.151515.56.28.65.0_ed16.0.1.1.151515.56_ef_eg_r0026.151515.151515.56.0.0.47.47.62.582.435.1_fa7.50.50.68.0.51.55_fb_fh1_fc0.52.55.0.52.55.47.61.61.47.50.50_fd7.0.10.151515.56_fe50.61_ff0000000000_fg3.50_pa0.0.0.0.40.50.85.85.0.0_t00_pb_pc_pd_pe_ga0_gb1_gc20.0_ge0000000000_gh_gf_gg_gd10100000_ha90.90_hb100.1.29.65_hc0.40.39.0.40.39_hd23.1.70.49_ia_if_ib_id_ic_jc_ie_ja_jb_jd2.76A9A7.76A9A7.57_je2.76A9A7.76A9A7.57_jf_jg_ka10.46AFC5.59.59.0_kb10.46AFC5.59.59_kc_kd_ke_kf_la12.46AFC5.46AFC5.0.1_lb_oa_os_ob_oc_od6.41.60.0.0_oe_of_lc_m0037.43.3.0.0.2.25.15.0.81.4.61_m015.27.3.0.0.2.13.15.0.81.4.61_n00_s00_og_oh_oo_op_oq_or_om_on_ok_ol_oi_oj_ad0.0.0.0.0.0.0.0.0.0
1-horny=47**aa61.40.1.16.53.13.96.1.3.40_ab_ac_ba48_bb13.1_bc237.500.8.0.1_bd43_be178_ca70.0.20.70.30.20.10.0.12_cb0_daFDA256.0.0.100_db_dd0.3.7.40.50.50_dhA66A56.55.50.50.0_di5_qa_qb_dc0.1.D98763.D98763.D98763_eh4.151515_ea22.151515.151515.56.0.0_ec6.70.151515.151515.56.28.65.0_ed16.0.1.1.151515.56_ef_eg_r0026.151515.151515.56.0.0.47.47.62.582.435.1_fa7.50.50.68.0.51.55_fb_fh1_fc0.52.55.0.52.55.47.61.61.47.50.50_fd7.0.10.151515.56_fe50.61_ff0000000000_fg3.50_pa0.0.0.0.40.50.85.85.0.0_t00_pb_pc_pd_pe_ga0_gb1_gc20.0_ge0000000000_gh_gf_gg_gd10100000_ha81.81_hb49.1.44.65_hc0.10.39.0.10.39_hd35.1.50.49_ia_if_ib_id_ic_jc_ie_ja_jb_jd2.76A9A7.76A9A7.57_je2.76A9A7.76A9A7.57_jf_jg_ka10.46AFC5.59.59.0_kb10.46AFC5.59.59_kc_kd_ke_kf_la12.46AFC5.46AFC5.0.1_lb_oa_os_ob_oc_od6.41.60.0.0_oe_of_lc_m0037.43.3.0.0.2.25.15.0.81.4.61_m015.27.3.0.0.2.13.15.0.81.4.61_n00_s00_og_oh_oo_op_oq_or_om_on_ok_ol_oi_oj_ad0.0.0.0.0.0.0.0.0.0
1-calm=47**aa29.83.1.47.17.29.83.1.47.17_ab_ac_ba50_bb13.1_bc237.500.8.0.1_bd13_be178_ca70.0.20.70.30.20.10.0.12_cb0_daFDA256.0.0.100_db_dd0.3.7.40.50.50_dhA66A56.55.50.50.0_di5_qa_qb_dc0.1.D98763.D98763.D98763_eh4.151515_ea22.151515.151515.56.0.0_ec6.70.151515.151515.56.28.65.0_ed16.0.1.1.151515.56_ef_eg_r0026.151515.151515.56.0.0.47.47.62.582.435.1_fa7.50.50.68.0.51.55_fb_fh1_fc0.52.55.0.52.55.47.61.61.47.50.50_fd7.0.10.151515.56_fe50.61_ff0000000000_fg3.50_pa0.0.0.0.40.50.85.85.0.0_t00_pb_pc_pd_pe_ga0_gb1_gc20.0_ge0000000000_gh_gf_gg_gd10100000_ha90.90_hb49.1.44.65_hc0.40.39.0.40.39_hd0.1.50.49_ia_if_ib_id_ic_jc_ie_ja_jb_jd2.76A9A7.76A9A7.57_je2.76A9A7.76A9A7.57_jf_jg_ka10.46AFC5.59.59.0_kb10.46AFC5.59.59_kc_kd_ke_kf_la12.46AFC5.46AFC5.0.1_lb_oa_os_ob_oc_od6.41.60.0.0_oe_of_lc_m0037.43.3.0.0.2.25.15.0.81.4.61_m015.27.3.0.0.2.13.15.0.81.4.61_n00_s00_og_oh_oo_op_oq_or_om_on_ok_ol_oi_oj_ad0.0.0.0.0.0.0.0.0.0
1-confused=47**aa31.72.1.9.20.31.72.1.9.20_ab_ac_ba70_bb15.1_bc237.500.8.0.1_bd8_be178_ca70.0.20.70.30.20.10.0.12_cb0_daFDA256.0.0.100_db_dd0.3.7.40.50.50_dhA66A56.55.50.50.0_di5_qa_qb_dc0.1.D98763.D98763.D98763_eh4.151515_ea22.151515.151515.56.0.0_ec6.70.151515.151515.56.28.65.0_ed16.0.1.1.151515.56_ef_eg_r0026.151515.151515.56.0.0.47.47.62.582.435.1_fa7.50.50.68.0.51.55_fb_fh1_fc0.52.55.0.52.55.47.61.61.47.50.50_fd7.0.19.151515.56_fe50.61_ff0000000000_fg3.50_pa0.0.0.0.40.50.85.85.0.0_t00_pb_pc_pd_pe_ga0_gb1_gc20.0_ge0000000000_gh_gf_gg_gd10100000_ha100.100_hb0.1.44.65_hc0.40.39.0.40.39_hd22.1.50.49_ia_if_ib_id_ic_jc_ie_ja_jb_jd2.76A9A7.76A9A7.57_je2.76A9A7.76A9A7.57_jf_jg_ka10.46AFC5.59.59.0_kb10.46AFC5.59.59_kc_kd_ke_kf_la12.46AFC5.46AFC5.0.1_lb_oa_os_ob_oc_od6.41.60.0.0_oe_of_lc_m0037.43.3.0.0.2.25.15.0.81.4.61_m015.27.3.0.0.2.13.15.0.81.4.61_n00_s00_og_oh_oo_op_oq_or_om_on_ok_ol_oi_oj_ad0.0.0.0.0.0.0.0.0.0
1-interested=47**aa4.95.1.25.50.18.43.1.11.25_ab_ac_ba35_bb0.1_bc237.500.8.0.1_bd0_be180_ca70.0.20.70.30.20.10.0.12_cb0_daFDA256.0.0.100_db_dd0.3.7.40.50.50_dhA66A56.55.50.50.0_di5_qa_qb_dc0.1.D98763.D98763.D98763_eh4.151515_ea22.151515.151515.56.0.0_ec6.70.151515.151515.56.28.65.0_ed16.0.1.1.151515.56_ef_eg_r0026.151515.151515.56.0.0.47.47.62.582.435.1_fa7.50.50.68.0.51.55_fb_fh1_fc0.52.55.0.52.55.47.61.61.47.50.50_fd7.0.10.151515.56_fe50.61_ff0000000000_fg3.50_pa0.0.0.0.40.50.85.85.0.0_t00_pb_pc_pd_pe_ga0_gb1_gc20.0_ge0000000000_gh_gf_gg_gd10100000_ha68.68_hb50.1.44.65_hc0.19.39.0.19.39_hd34.1.60.49_ia_if_ib_id_ic_jc_ie_ja_jb_jd2.76A9A7.76A9A7.57_je2.76A9A7.76A9A7.57_jf_jg_ka10.46AFC5.59.59.0_kb10.46AFC5.59.59_kc_kd_ke_kf_la12.46AFC5.46AFC5.0.1_lb_oa_os_ob_oc_od6.41.60.0.0_oe_of_lc_m0037.43.3.0.0.2.25.15.0.81.4.61_m015.27.3.0.0.2.13.15.0.81.4.61_n00_s00_og_oh_oo_op_oq_or_om_on_ok_ol_oi_oj_ad0.0.0.0.0.0.0.0.0.0
1-sad=47**aa13.58.1.42.45.13.58.1.42.45_ab_ac_ba35_bb6.1_bc237.500.8.0.1_bd17_be178_ca70.0.20.70.30.20.10.0.12_cb0_daFDA256.0.0.100_db_dd0.3.7.40.50.50_dhA66A56.55.50.50.0_di5_qa_qb_dc0.1.D98763.D98763.D98763_eh4.151515_ea22.151515.151515.56.0.0_ec6.70.151515.151515.56.28.65.0_ed16.0.1.1.151515.56_ef_eg_r0026.151515.151515.56.0.0.47.47.62.582.435.1_fa7.50.50.68.0.51.55_fb_fh1_fc0.52.55.0.52.55.47.61.61.47.50.50_fd7.0.10.151515.56_fe50.61_ff0000000000_fg3.50_pa0.0.0.0.40.50.85.85.0.0_t00_pb_pc_pd_pe_ga0_gb1_gc20.0_ge0000000000_gh_gf_gg_gd10100000_ha26.26_hb0.1.66.65_hc0.49.39.0.49.39_hd21.1.50.49_ia_if_ib_id_ic_jc_ie_ja_jb_jd2.76A9A7.76A9A7.57_je2.76A9A7.76A9A7.57_jf_jg_ka10.46AFC5.59.59.0_kb10.46AFC5.59.59_kc_kd_ke_kf_la12.46AFC5.46AFC5.0.1_lb_oa_os_ob_oc_od6.41.60.0.0_oe_of_lc_m0037.43.3.0.0.2.25.15.0.81.4.61_m015.27.3.0.0.2.13.15.0.81.4.61_n00_s00_og_oh_oo_op_oq_or_om_on_ok_ol_oi_oj_ad0.0.0.0.0.0.0.0.0.0
1-embarrassed=47**aa15.90.1.26.52.15.90.1.26.45_ab_ac_ba35_bb25.1_bc237.500.8.0.1_bd17_be178_ca70.0.20.70.30.20.10.0.12_cb0_daFDA256.0.0.100_db_dd0.3.7.40.50.50_dhA66A56.55.50.50.0_di5_qa_qb_dc0.1.D98763.D98763.D98763_eh4.151515_ea22.151515.151515.56.0.0_ec6.70.151515.151515.56.28.65.0_ed16.0.1.1.151515.56_ef_eg_r0026.151515.151515.56.0.0.47.47.62.582.435.1_fa7.50.50.68.0.51.55_fb_fh1_fc0.52.55.0.52.55.47.61.61.47.50.50_fd7.0.10.151515.56_fe50.61_ff0000000000_fg3.50_pa0.0.0.0.40.50.85.85.0.0_t00_pb_pc_pd_pe_ga0_gb1_gc20.0_ge0000000000_gh_gf_gg_gd10100000_ha0.0_hb0.1.66.65_hc0.49.39.0.49.39_hd8.1.50.49_ia_if_ib_id_ic_jc_ie_ja_jb_jd2.76A9A7.76A9A7.57_je2.76A9A7.76A9A7.57_jf_jg_ka10.46AFC5.59.59.0_kb10.46AFC5.59.59_kc_kd_ke_kf_la12.46AFC5.46AFC5.0.1_lb_oa_os_ob_oc_od6.41.60.0.0_oe_of_lc_m0037.43.3.0.0.2.25.15.0.81.4.61_m015.27.3.0.0.2.13.15.0.81.4.61_n00_s00_og_oh_oo_op_oq_or_om_on_ok_ol_oi_oj_ad0.0.0.0.0.0.0.0.0.0
1-strip=47**aa85.72.0.9.20.85.72.0.9.20_ab_ac_ba70_bb15.1_bc237.500.8.0.1_bd8_be178_ca70.0.20.70.30.20.10.0.12_cb0_daFDA256.0.0.100_db_dd0.3.7.40.50.50_dhA66A56.55.50.50.0_di5_qa_qb_dc0.1.D98763.D98763.D98763_eh4.151515_ea22.151515.151515.56.0.0_ec6.70.151515.151515.56.28.65.0_ed16.0.1.1.151515.56_ef_eg_r0026.151515.151515.56.0.0.47.47.62.582.435.1_fa7.50.50.68.0.51.55_fb_fh1_fc0.52.55.0.52.55.47.61.61.47.50.50_fd7.0.19.151515.56_fe50.61_ff0000000000_fg3.50_pa0.0.0.0.40.50.85.85.0.0_t00_pb_pc_pd_pe_ga0_gb1_gc20.0_ge0000000000_gh_gf_gg_gd10100000_ha100.100_hb0.1.44.65_hc0.40.39.0.40.39_hd22.1.50.49_ia_if_ib_id_ic_jc_ie_ja_jb_jd2.76A9A7.76A9A7.57_je2.76A9A7.76A9A7.57_jf_jg_ka10.46AFC5.59.59.0_kb10.46AFC5.59.59_kc_kd_ke_kf_la12.46AFC5.46AFC5.0.1_lb_oa_os_ob_oc_od6.41.60.0.0_oe_of_lc_m0037.43.3.0.0.2.25.15.0.81.4.61_m015.27.3.0.0.2.13.15.0.81.4.61_n00_s00_og_oh_oo_op_oq_or_om_on_ok_ol_oi_oj_ad0.0.0.0.0.0.0.0.0.0

#Lost necklace

2-shocked=47**aa24.32.1.39.54.9.12.1.39.54_ab_ac_ba48_bb16.1_bc237.500.8.0.1_bd16_be178_ca70.0.20.70.30.20.10.0.12_cb0_daFDA256.0.0.100_db_dd0.3.7.40.50.50_dhA66A56.55.50.50.0_di5_qa_qb_dc0.1.D98763.D98763.D98763_eh4.151515_ea22.151515.151515.56.0.0_ec6.70.151515.151515.56.28.65.0_ed16.0.1.1.151515.56_ef_eg_r0026.151515.151515.56.0.0.47.47.62.582.435.1_fa7.50.50.68.0.51.55_fb_fh1_fc0.52.55.0.52.55.47.61.61.47.50.50_fd7.0.10.151515.56_fe50.61_ff0000000000_fg3.50_pa0.0.0.0.40.50.85.85.0.0_t00_pb_pc_pd_pe_ga0_gb1_gc20.0_ge0000000000_gh_gf_gg_gd10100000_ha100.100_hb49.1.44.52_hc0.32.52.0.32.52_hd37.1.81.49_ia_if_ib_id_ic_jc_ie_ja_jb_jd2.76A9A7.76A9A7.57_je2.76A9A7.76A9A7.57_jf_jg_ka10.46AFC5.59.59.0_kb10.46AFC5.59.59_kc_kd_ke_kf_la12.46AFC5.46AFC5.0.1_lb_oa_os_ob_oc_od_oe_of_lc_m0037.43.3.0.0.2.25.15.0.81.4.61_m015.27.3.0.0.2.13.15.0.81.4.61_n00_s00_og_oh_oo_op_oq_or_om_on_ok_ol_oi_oj_ad0.0.0.0.0.0.0.0.0.0
2-angry=47**aa9.99.1.47.56.9.99.1.47.56_ab_ac_ba60_bb17.1_bc237.500.8.0.1_bd17_be178_ca70.0.20.70.30.20.10.0.12_cb0_daFDA256.0.0.100_db_dd0.3.7.40.50.50_dhA66A56.55.50.50.0_di5_qa_qb_dc0.1.D98763.D98763.D98763_eh4.151515_ea22.151515.151515.56.0.0_ec6.70.151515.151515.56.28.65.0_ed16.0.1.1.151515.56_ef_eg_r0026.151515.151515.56.0.0.47.47.62.582.435.1_fa7.50.50.68.0.51.55_fb_fh1_fc0.52.55.0.52.55.47.61.61.47.50.50_fd7.0.10.151515.56_fe50.61_ff0000000000_fg3.50_pa0.0.0.0.40.50.85.85.0.0_t00_pb_pc_pd_pe_ga0_gb1_gc20.0_ge0000000000_gh_gf_gg_gd10100000_ha75.75_hb22.1.44.65_hc0.0.19.0.0.19_hd21.1.50.49_ia_if_ib_id_ic_jc_ie_ja_jb_jd2.76A9A7.76A9A7.57_je2.76A9A7.76A9A7.57_jf_jg_ka10.46AFC5.59.59.0_kb10.46AFC5.59.59_kc_kd_ke_kf_la12.46AFC5.46AFC5.0.1_lb_oa_os_ob_oc_od_oe_of_lc_m0037.43.3.0.0.2.25.15.0.81.4.61_m015.27.3.0.0.2.13.15.0.81.4.61_n00_s00_og_oh_oo_op_oq_or_om_on_ok_ol_oi_oj_ad0.0.0.0.0.0.0.0.0.0
2-happy=47**aa89.0.1.39.50.89.0.1.39.50_ab_ac_ba48_bb7.1_bc237.500.8.0.1_bd7_be178_ca70.0.20.70.30.20.10.0.12_cb0_daFDA256.0.0.100_db_dd0.3.7.40.50.50_dhA66A56.55.50.50.0_di5_qa_qb_dc0.1.D98763.D98763.D98763_eh4.151515_ea22.151515.151515.56.0.0_ec6.70.151515.151515.56.28.65.0_ed16.0.1.1.151515.56_ef_eg_r0026.151515.151515.56.0.0.47.47.62.582.435.1_fa7.50.50.68.0.51.55_fb_fh1_fc0.52.55.0.52.55.47.61.61.47.50.50_fd7.0.10.151515.56_fe50.61_ff0000000000_fg3.50_pa0.0.0.0.40.50.85.85.0.0_t00_pb_pc_pd_pe_ga0_gb1_gc20.0_ge0000000000_gh_gf_gg_gd10100000_ha1.1_hb49.1.44.65_hc0.60.22.0.60.22_hd23.1.100.49_ia_if_ib_id_ic_jc_ie_ja_jb_jd2.76A9A7.76A9A7.57_je2.76A9A7.76A9A7.57_jf_jg_ka10.46AFC5.59.59.0_kb10.46AFC5.59.59_kc_kd_ke_kf_la12.46AFC5.46AFC5.0.1_lb_oa_os_ob_oc_od_oe_of_lc_m0037.43.3.0.0.2.25.15.0.81.4.61_m015.27.3.0.0.2.13.15.0.81.4.61_n00_s00_og_oh_oo_op_oq_or_om_on_ok_ol_oi_oj_ad0.0.0.0.0.0.0.0.0.0
2-horny=47**aa13.96.1.26.1.12.96.1.3.40_ab_ac_ba48_bb13.1_bc237.500.8.0.1_bd43_be178_ca70.0.20.70.30.20.10.0.12_cb0_daFDA256.0.0.100_db_dd0.3.7.40.50.50_dhA66A56.55.50.50.0_di5_qa_qb_dc0.1.D98763.D98763.D98763_eh4.151515_ea22.151515.151515.56.0.0_ec6.70.151515.151515.56.28.65.0_ed16.0.1.1.151515.56_ef_eg_r0026.151515.151515.56.0.0.47.47.62.582.435.1_fa7.50.50.68.0.51.55_fb_fh1_fc0.52.55.0.52.55.47.61.61.47.50.50_fd7.0.10.151515.56_fe50.61_ff0000000000_fg3.50_pa0.0.0.0.40.50.85.85.0.0_t00_pb_pc_pd_pe_ga0_gb1_gc20.0_ge0000000000_gh_gf_gg_gd10100000_ha81.81_hb49.1.44.65_hc0.10.39.0.10.39_hd35.1.50.49_ia_if_ib_id_ic_jc_ie_ja_jb_jd2.76A9A7.76A9A7.57_je2.76A9A7.76A9A7.57_jf_jg_ka10.46AFC5.59.59.0_kb10.46AFC5.59.59_kc_kd_ke_kf_la12.46AFC5.46AFC5.0.1_lb_oa_os_ob_oc_od_oe_of_lc_m0037.43.3.0.0.2.25.15.0.81.4.61_m015.27.3.0.0.2.13.15.0.81.4.61_n00_s00_og_oh_oo_op_oq_or_om_on_ok_ol_oi_oj_ad0.0.0.0.0.0.0.0.0.0
2-calm=47**aa7.70.1.49.50.7.70.1.49.50_ab_ac_ba50_bb13.1_bc237.500.8.0.1_bd13_be178_ca70.0.20.70.30.20.10.0.12_cb0_daFDA256.0.0.100_db_dd0.3.7.40.50.50_dhA66A56.55.50.50.0_di5_qa_qb_dc0.1.D98763.D98763.D98763_eh4.151515_ea22.151515.151515.56.0.0_ec6.70.151515.151515.56.28.65.0_ed16.0.1.1.151515.56_ef_eg_r0026.151515.151515.56.0.0.47.47.62.582.435.1_fa7.50.50.68.0.51.55_fb_fh1_fc0.52.55.0.52.55.47.61.61.47.50.50_fd7.0.10.151515.56_fe50.61_ff0000000000_fg3.50_pa0.0.0.0.40.50.85.85.0.0_t00_pb_pc_pd_pe_ga0_gb1_gc20.0_ge0000000000_gh_gf_gg_gd10100000_ha90.90_hb49.1.44.65_hc0.40.39.0.40.39_hd0.1.50.49_ia_if_ib_id_ic_jc_ie_ja_jb_jd2.76A9A7.76A9A7.57_je2.76A9A7.76A9A7.57_jf_jg_ka10.46AFC5.59.59.0_kb10.46AFC5.59.59_kc_kd_ke_kf_la12.46AFC5.46AFC5.0.1_lb_oa_os_ob_oc_od_oe_of_lc_m0037.43.3.0.0.2.25.15.0.81.4.61_m015.27.3.0.0.2.13.15.0.81.4.61_n00_s00_og_oh_oo_op_oq_or_om_on_ok_ol_oi_oj_ad0.0.0.0.0.0.0.0.0.0
2-confused=47**aa15.62.1.9.25.8.100.1.0.50_ab_ac_ba70_bb15.1_bc237.500.8.0.1_bd8_be178_ca70.0.20.70.30.20.10.0.12_cb0_daFDA256.0.0.100_db_dd0.3.7.40.50.50_dhA66A56.55.50.50.0_di5_qa_qb_dc0.1.D98763.D98763.D98763_eh4.151515_ea22.151515.151515.56.0.0_ec6.70.151515.151515.56.28.65.0_ed16.0.1.1.151515.56_ef_eg_r0026.151515.151515.56.0.0.47.47.62.582.435.1_fa7.50.50.68.0.51.55_fb_fh1_fc0.52.55.0.52.55.47.61.61.47.50.50_fd7.0.19.151515.56_fe50.61_ff0000000000_fg3.50_pa0.0.0.0.40.50.85.85.0.0_t00_pb_pc_pd_pe_ga0_gb1_gc20.0_ge0000000000_gh_gf_gg_gd10100000_ha100.100_hb0.1.44.65_hc0.40.39.0.40.39_hd22.1.50.49_ia_if_ib_id_ic_jc_ie_ja_jb_jd2.76A9A7.76A9A7.57_je2.76A9A7.76A9A7.57_jf_jg_ka10.46AFC5.59.59.0_kb10.46AFC5.59.59_kc_kd_ke_kf_la12.46AFC5.46AFC5.0.1_lb_oa_os_ob_oc_od_oe_of_lc_m0037.43.3.0.0.2.25.15.0.81.4.61_m015.27.3.0.0.2.13.15.0.81.4.61_n00_s00_og_oh_oo_op_oq_or_om_on_ok_ol_oi_oj_ad0.0.0.0.0.0.0.0.0.0
2-interested=47**aa5.95.1.25.50.5.95.1.25.50_ab_ac_ba35_bb0.1_bc237.500.8.0.1_bd0_be180_ca70.0.20.70.30.20.10.0.12_cb0_daFDA256.0.0.100_db_dd0.3.7.40.50.50_dhA66A56.55.50.50.0_di5_qa_qb_dc0.1.D98763.D98763.D98763_eh4.151515_ea22.151515.151515.56.0.0_ec6.70.151515.151515.56.28.65.0_ed16.0.1.1.151515.56_ef_eg_r0026.151515.151515.56.0.0.47.47.62.582.435.1_fa7.50.50.68.0.51.55_fb_fh1_fc0.52.55.0.52.55.47.61.61.47.50.50_fd7.0.10.151515.56_fe50.61_ff0000000000_fg3.50_pa0.0.0.0.40.50.85.85.0.0_t00_pb_pc_pd_pe_ga0_gb1_gc20.0_ge0000000000_gh_gf_gg_gd10100000_ha68.68_hb50.1.44.65_hc0.19.39.0.19.39_hd34.1.60.49_ia_if_ib_id_ic_jc_ie_ja_jb_jd2.76A9A7.76A9A7.57_je2.76A9A7.76A9A7.57_jf_jg_ka10.46AFC5.59.59.0_kb10.46AFC5.59.59_kc_kd_ke_kf_la12.46AFC5.46AFC5.0.1_lb_oa_os_ob_oc_od_oe_of_lc_m0037.43.3.0.0.2.25.15.0.81.4.61_m015.27.3.0.0.2.13.15.0.81.4.61_n00_s00_og_oh_oo_op_oq_or_om_on_ok_ol_oi_oj_ad0.0.0.0.0.0.0.0.0.0
2-sad=47**aa9.97.1.27.45.9.3.1.2.45_ab_ac_ba35_bb6.1_bc237.500.8.0.1_bd17_be178_ca70.0.20.70.30.20.10.0.12_cb0_daFDA256.0.0.100_db_dd0.3.7.40.50.50_dhA66A56.55.50.50.0_di5_qa_qb_dc0.1.D98763.D98763.D98763_eh4.151515_ea22.151515.151515.56.0.0_ec6.70.151515.151515.56.28.65.0_ed16.0.1.1.151515.56_ef_eg_r0026.151515.151515.56.0.0.47.47.62.582.435.1_fa7.50.50.68.0.51.55_fb_fh1_fc0.52.55.0.52.55.47.61.61.47.50.50_fd7.0.10.151515.56_fe50.61_ff0000000000_fg3.50_pa0.0.0.0.40.50.85.85.0.0_t00_pb_pc_pd_pe_ga0_gb1_gc20.0_ge0000000000_gh_gf_gg_gd10100000_ha26.26_hb0.1.66.65_hc0.49.39.0.49.39_hd21.1.50.49_ia_if_ib_id_ic_jc_ie_ja_jb_jd2.76A9A7.76A9A7.57_je2.76A9A7.76A9A7.57_jf_jg_ka10.46AFC5.59.59.0_kb10.46AFC5.59.59_kc_kd_ke_kf_la12.46AFC5.46AFC5.0.1_lb_oa_os_ob_oc_od_oe_of_lc_m0037.43.3.0.0.2.25.15.0.81.4.61_m015.27.3.0.0.2.13.15.0.81.4.61_n00_s00_og_oh_oo_op_oq_or_om_on_ok_ol_oi_oj_ad0.0.0.0.0.0.0.0.0.0
2-embarrassed=47**aa72.35.1.28.52.76.35.1.28.45_ab_ac_ba35_bb25.1_bc237.500.8.0.1_bd17_be178_ca70.0.20.70.30.20.10.0.12_cb0_daFDA256.0.0.100_db_dd0.3.7.40.50.50_dhA66A56.55.50.50.0_di5_qa_qb_dc0.1.D98763.D98763.D98763_eh4.151515_ea22.151515.151515.56.0.0_ec6.70.151515.151515.56.28.65.0_ed16.0.1.1.151515.56_ef_eg_r0026.151515.151515.56.0.0.47.47.62.582.435.1_fa7.50.50.68.0.51.55_fb_fh1_fc0.52.55.0.52.55.47.61.61.47.50.50_fd7.0.10.151515.56_fe50.61_ff0000000000_fg3.50_pa0.0.0.0.40.50.85.85.0.0_t00_pb_pc_pd_pe_ga0_gb1_gc20.0_ge0000000000_gh_gf_gg_gd10100000_ha26.26_hb0.1.66.65_hc0.49.39.0.49.39_hd8.1.50.49_ia_if_ib_id_ic_jc_ie_ja_jb_jd2.76A9A7.76A9A7.57_je2.76A9A7.76A9A7.57_jf_jg_ka10.46AFC5.59.59.0_kb10.46AFC5.59.59_kc_kd_ke_kf_la12.46AFC5.46AFC5.0.1_lb_oa_os_ob_oc_od_oe_of_lc_m0037.43.3.0.0.2.25.15.0.81.4.61_m015.27.3.0.0.2.13.15.0.81.4.61_n00_s00_og_oh_oo_op_oq_or_om_on_ok_ol_oi_oj_ad0.0.0.0.0.0.0.0.0.0


#Lost slippers

3-shocked=47**aa65.43.1.41.54.9.94.0.39.54_ab_ac_ba48_bb16.1_bc237.500.8.0.1_bd16_be178_ca70.0.20.70.30.20.10.0.12_cb0_daFDA256.0.0.100_db_dd0.3.7.40.50.50_dhA66A56.55.50.50.0_di5_qa_qb_dc0.1.D98763.D98763.D98763_eh4.151515_ea22.151515.151515.56.0.0_ec6.70.151515.151515.56.28.65.0_ed16.0.1.1.151515.56_ef_eg_r0026.151515.151515.56.0.0.47.47.62.582.435.1_fa7.50.50.68.0.51.55_fb_fh1_fc0.52.55.0.52.55.47.61.61.47.50.50_fd7.0.10.151515.56_fe50.61_ff0000000000_fg3.50_pa0.0.0.0.40.50.85.85.0.0_t00_pb_pc_pd_pe_ga0_gb1_gc20.0_ge0000000000_gh_gf_gg_gd10100000_ha100.100_hb49.1.44.52_hc0.32.52.0.32.52_hd37.1.81.49_ia_if_ib_id_ic_jc_ie_ja_jb_jd_je_jf_jg_ka10.46AFC5.59.59.0_kb10.46AFC5.59.59_kc_kd_ke_kf_la12.46AFC5.46AFC5.0.1_lb_oa_os_ob_oc_od_oe_of_lc_m0037.43.3.0.0.2.25.15.0.81.4.61_m015.27.3.0.0.2.13.15.0.81.4.61_n00_s00_og_oh_oo_op_oq_or_om_on_ok_ol_oi_oj_ad0.0.0.0.0.0.0.0.0.0
3-angry=47**aa17.54.1.12.31.17.39.1.1.55_ab_ac_ba60_bb13.1_bc237.500.8.0.1_bd5_be178_ca70.0.20.70.30.20.10.0.12_cb0_daFDA256.0.0.100_db_dd0.3.7.40.50.50_dhA66A56.55.50.50.0_di5_qa_qb_dc0.1.D98763.D98763.D98763_eh4.151515_ea22.151515.151515.56.0.0_ec6.70.151515.151515.56.28.65.0_ed16.0.1.1.151515.56_ef_eg_r0026.151515.151515.56.0.0.47.47.62.582.435.1_fa7.50.50.68.0.51.55_fb_fh1_fc0.52.55.0.52.55.47.61.61.47.50.50_fd7.0.10.151515.56_fe50.61_ff0000000000_fg3.50_pa0.0.0.0.40.50.85.85.0.0_t00_pb_pc_pd_pe_ga0_gb1_gc20.0_ge0000000000_gh_gf_gg_gd10100000_ha40.40_hb22.1.44.65_hc0.0.19.0.0.19_hd21.1.50.49_ia_if_ib_id_ic_jc_ie_ja_jb_jd_je_jf_jg_ka10.46AFC5.59.59.0_kb10.46AFC5.59.59_kc_kd_ke_kf_la12.46AFC5.46AFC5.0.1_lb_oa_os_ob_oc_od_oe_of_lc_m0037.43.3.0.0.2.25.15.0.81.4.61_m015.27.3.0.0.2.13.15.0.81.4.61_n00_s00_og_oh_oo_op_oq_or_om_on_ok_ol_oi_oj_ad0.0.0.0.0.0.0.0.0.0
3-happy=47**aa12.4.1.3.100.14.30.1.3.83_ab_ac_ba50_bb50.1_bc237.500.8.0.1_bd13_be178_ca70.0.20.70.30.20.10.0.12_cb0_daFDA256.0.0.100_db_dd0.3.7.40.50.50_dhA66A56.55.50.50.0_di5_qa_qb_dc0.1.D98763.D98763.D98763_eh4.151515_ea22.151515.151515.56.0.0_ec6.70.151515.151515.56.28.65.0_ed16.0.1.1.151515.56_ef_eg_r0026.151515.151515.56.0.0.47.47.62.582.435.1_fa7.50.50.68.0.51.55_fb_fh1_fc0.52.55.0.52.55.47.61.61.47.50.50_fd7.0.10.151515.56_fe50.61_ff0000000000_fg3.50_pa0.0.0.0.40.50.85.85.0.0_t00_pb_pc_pd_pe_ga0_gb1_gc20.0_ge0000000000_gh_gf_gg_gd10100000_ha90.90_hb100.1.29.65_hc0.40.39.0.40.39_hd23.1.70.49_ia_if_ib_id_ic_jc_ie_ja_jb_jd_je_jf_jg_ka10.46AFC5.59.59.0_kb10.46AFC5.59.59_kc_kd_ke_kf_la12.46AFC5.46AFC5.0.1_lb_oa_os_ob_oc_od_oe_of_lc_m0037.43.3.0.0.2.25.15.0.81.4.61_m015.27.3.0.0.2.13.15.0.81.4.61_n00_s00_og_oh_oo_op_oq_or_om_on_ok_ol_oi_oj_ad0.0.0.0.0.0.0.0.0.0
3-horny=47**aa61.40.1.16.53.13.96.1.3.40_ab_ac_ba48_bb13.1_bc237.500.8.0.1_bd43_be178_ca70.0.20.70.30.20.10.0.12_cb0_daFDA256.0.0.100_db_dd0.3.7.40.50.50_dhA66A56.55.50.50.0_di5_qa_qb_dc0.1.D98763.D98763.D98763_eh4.151515_ea22.151515.151515.56.0.0_ec6.70.151515.151515.56.28.65.0_ed16.0.1.1.151515.56_ef_eg_r0026.151515.151515.56.0.0.47.47.62.582.435.1_fa7.50.50.68.0.51.55_fb_fh1_fc0.52.55.0.52.55.47.61.61.47.50.50_fd7.0.10.151515.56_fe50.61_ff0000000000_fg3.50_pa0.0.0.0.40.50.85.85.0.0_t00_pb_pc_pd_pe_ga0_gb1_gc20.0_ge0000000000_gh_gf_gg_gd10100000_ha81.81_hb49.1.44.65_hc0.10.39.0.10.39_hd35.1.50.49_ia_if_ib_id_ic_jc_ie_ja_jb_jd_je_jf_jg_ka10.46AFC5.59.59.0_kb10.46AFC5.59.59_kc_kd_ke_kf_la12.46AFC5.46AFC5.0.1_lb_oa_os_ob_oc_od_oe_of_lc_m0037.43.3.0.0.2.25.15.0.81.4.61_m015.27.3.0.0.2.13.15.0.81.4.61_n00_s00_og_oh_oo_op_oq_or_om_on_ok_ol_oi_oj_ad0.0.0.0.0.0.0.0.0.0
3-calm=47**aa29.83.1.47.17.29.83.1.47.17_ab_ac_ba50_bb13.1_bc237.500.8.0.1_bd13_be178_ca70.0.20.70.30.20.10.0.12_cb0_daFDA256.0.0.100_db_dd0.3.7.40.50.50_dhA66A56.55.50.50.0_di5_qa_qb_dc0.1.D98763.D98763.D98763_eh4.151515_ea22.151515.151515.56.0.0_ec6.70.151515.151515.56.28.65.0_ed16.0.1.1.151515.56_ef_eg_r0026.151515.151515.56.0.0.47.47.62.582.435.1_fa7.50.50.68.0.51.55_fb_fh1_fc0.52.55.0.52.55.47.61.61.47.50.50_fd7.0.10.151515.56_fe50.61_ff0000000000_fg3.50_pa0.0.0.0.40.50.85.85.0.0_t00_pb_pc_pd_pe_ga0_gb1_gc20.0_ge0000000000_gh_gf_gg_gd10100000_ha90.90_hb49.1.44.65_hc0.40.39.0.40.39_hd0.1.50.49_ia_if_ib_id_ic_jc_ie_ja_jb_jd_je_jf_jg_ka10.46AFC5.59.59.0_kb10.46AFC5.59.59_kc_kd_ke_kf_la12.46AFC5.46AFC5.0.1_lb_oa_os_ob_oc_od_oe_of_lc_m0037.43.3.0.0.2.25.15.0.81.4.61_m015.27.3.0.0.2.13.15.0.81.4.61_n00_s00_og_oh_oo_op_oq_or_om_on_ok_ol_oi_oj_ad0.0.0.0.0.0.0.0.0.0
3-confused=47**aa31.72.1.9.20.31.72.1.9.20_ab_ac_ba70_bb15.1_bc237.500.8.0.1_bd8_be178_ca70.0.20.70.30.20.10.0.12_cb0_daFDA256.0.0.100_db_dd0.3.7.40.50.50_dhA66A56.55.50.50.0_di5_qa_qb_dc0.1.D98763.D98763.D98763_eh4.151515_ea22.151515.151515.56.0.0_ec6.70.151515.151515.56.28.65.0_ed16.0.1.1.151515.56_ef_eg_r0026.151515.151515.56.0.0.47.47.62.582.435.1_fa7.50.50.68.0.51.55_fb_fh1_fc0.52.55.0.52.55.47.61.61.47.50.50_fd7.0.19.151515.56_fe50.61_ff0000000000_fg3.50_pa0.0.0.0.40.50.85.85.0.0_t00_pb_pc_pd_pe_ga0_gb1_gc20.0_ge0000000000_gh_gf_gg_gd10100000_ha100.100_hb0.1.44.65_hc0.40.39.0.40.39_hd22.1.50.49_ia_if_ib_id_ic_jc_ie_ja_jb_jd_je_jf_jg_ka10.46AFC5.59.59.0_kb10.46AFC5.59.59_kc_kd_ke_kf_la12.46AFC5.46AFC5.0.1_lb_oa_os_ob_oc_od_oe_of_lc_m0037.43.3.0.0.2.25.15.0.81.4.61_m015.27.3.0.0.2.13.15.0.81.4.61_n00_s00_og_oh_oo_op_oq_or_om_on_ok_ol_oi_oj_ad0.0.0.0.0.0.0.0.0.0
3-interested=47**aa4.95.1.25.50.18.43.1.11.25_ab_ac_ba35_bb0.1_bc237.500.8.0.1_bd0_be180_ca70.0.20.70.30.20.10.0.12_cb0_daFDA256.0.0.100_db_dd0.3.7.40.50.50_dhA66A56.55.50.50.0_di5_qa_qb_dc0.1.D98763.D98763.D98763_eh4.151515_ea22.151515.151515.56.0.0_ec6.70.151515.151515.56.28.65.0_ed16.0.1.1.151515.56_ef_eg_r0026.151515.151515.56.0.0.47.47.62.582.435.1_fa7.50.50.68.0.51.55_fb_fh1_fc0.52.55.0.52.55.47.61.61.47.50.50_fd7.0.10.151515.56_fe50.61_ff0000000000_fg3.50_pa0.0.0.0.40.50.85.85.0.0_t00_pb_pc_pd_pe_ga0_gb1_gc20.0_ge0000000000_gh_gf_gg_gd10100000_ha68.68_hb50.1.44.65_hc0.19.39.0.19.39_hd34.1.60.49_ia_if_ib_id_ic_jc_ie_ja_jb_jd_je_jf_jg_ka10.46AFC5.59.59.0_kb10.46AFC5.59.59_kc_kd_ke_kf_la12.46AFC5.46AFC5.0.1_lb_oa_os_ob_oc_od_oe_of_lc_m0037.43.3.0.0.2.25.15.0.81.4.61_m015.27.3.0.0.2.13.15.0.81.4.61_n00_s00_og_oh_oo_op_oq_or_om_on_ok_ol_oi_oj_ad0.0.0.0.0.0.0.0.0.0
3-sad=47**aa13.58.1.42.45.13.58.1.42.45_ab_ac_ba35_bb6.1_bc237.500.8.0.1_bd17_be178_ca70.0.20.70.30.20.10.0.12_cb0_daFDA256.0.0.100_db_dd0.3.7.40.50.50_dhA66A56.55.50.50.0_di5_qa_qb_dc0.1.D98763.D98763.D98763_eh4.151515_ea22.151515.151515.56.0.0_ec6.70.151515.151515.56.28.65.0_ed16.0.1.1.151515.56_ef_eg_r0026.151515.151515.56.0.0.47.47.62.582.435.1_fa7.50.50.68.0.51.55_fb_fh1_fc0.52.55.0.52.55.47.61.61.47.50.50_fd7.0.10.151515.56_fe50.61_ff0000000000_fg3.50_pa0.0.0.0.40.50.85.85.0.0_t00_pb_pc_pd_pe_ga0_gb1_gc20.0_ge0000000000_gh_gf_gg_gd10100000_ha26.26_hb0.1.66.65_hc0.49.39.0.49.39_hd21.1.50.49_ia_if_ib_id_ic_jc_ie_ja_jb_jd_je_jf_jg_ka10.46AFC5.59.59.0_kb10.46AFC5.59.59_kc_kd_ke_kf_la12.46AFC5.46AFC5.0.1_lb_oa_os_ob_oc_od_oe_of_lc_m0037.43.3.0.0.2.25.15.0.81.4.61_m015.27.3.0.0.2.13.15.0.81.4.61_n00_s00_og_oh_oo_op_oq_or_om_on_ok_ol_oi_oj_ad0.0.0.0.0.0.0.0.0.0
3-embarrassed=47**aa15.90.1.26.52.15.90.1.26.45_ab_ac_ba35_bb25.1_bc237.500.8.0.1_bd17_be178_ca70.0.20.70.30.20.10.0.12_cb0_daFDA256.0.0.100_db_dd0.3.7.40.50.50_dhA66A56.55.50.50.0_di5_qa_qb_dc0.1.D98763.D98763.D98763_eh4.151515_ea22.151515.151515.56.0.0_ec6.70.151515.151515.56.28.65.0_ed16.0.1.1.151515.56_ef_eg_r0026.151515.151515.56.0.0.47.47.62.582.435.1_fa7.50.50.68.0.51.55_fb_fh1_fc0.52.55.0.52.55.47.61.61.47.50.50_fd7.0.10.151515.56_fe50.61_ff0000000000_fg3.50_pa0.0.0.0.40.50.85.85.0.0_t00_pb_pc_pd_pe_ga0_gb1_gc20.0_ge0000000000_gh_gf_gg_gd10100000_ha0.0_hb0.1.66.65_hc0.49.39.0.49.39_hd8.1.50.49_ia_if_ib_id_ic_jc_ie_ja_jb_jd_je_jf_jg_ka10.46AFC5.59.59.0_kb10.46AFC5.59.59_kc_kd_ke_kf_la12.46AFC5.46AFC5.0.1_lb_oa_os_ob_oc_od_oe_of_lc_m0037.43.3.0.0.2.25.15.0.81.4.61_m015.27.3.0.0.2.13.15.0.81.4.61_n00_s00_og_oh_oo_op_oq_or_om_on_ok_ol_oi_oj_ad0.0.0.0.0.0.0.0.0.0
3-strip=47**aa71.26.1.47.80.77.26.1.47.80_ab_ac_ba35_bb25.1_bc237.500.8.0.1_bd17_be178_ca70.0.20.70.30.20.10.0.12_cb0_daFDA256.0.0.100_db_dd0.3.7.40.50.50_dhA66A56.55.50.50.0_di5_qa_qb_dc0.1.D98763.D98763.D98763_eh4.151515_ea22.151515.151515.56.0.0_ec6.70.151515.151515.56.28.65.0_ed16.0.1.1.151515.56_ef_eg_r0026.151515.151515.56.0.0.47.47.62.582.435.1_fa7.50.50.68.0.51.55_fb_fh1_fc0.52.55.0.52.55.47.61.61.47.50.50_fd7.0.10.151515.56_fe50.61_ff0000000000_fg3.50_pa0.0.0.0.40.50.85.85.0.0_t00_pb_pc_pd_pe_ga0_gb1_gc20.0_ge0000000000_gh_gf_gg_gd10100000_ha0.0_hb0.1.66.65_hc0.49.39.0.49.39_hd8.1.50.49_ia_if_ib_id_ic_jc_ie_ja_jb_jd_je_jf_jg_ka10.46AFC5.59.59.0_kb10.46AFC5.59.59_kc_kd_ke_kf_la12.46AFC5.46AFC5.0.1_lb_oa_os_ob_oc_od_oe_of_lc_m0037.43.3.0.0.2.25.15.0.81.4.61_m015.27.3.0.0.2.13.15.0.81.4.61_n00_s00_og_oh_oo_op_oq_or_om_on_ok_ol_oi_oj_ad0.0.0.0.0.0.0.0.0.0

#Lost diadem

4-shocked=47**aa24.32.1.39.54.9.12.1.39.54_ab_ac_ba48_bb16.1_bc237.500.8.0.1_bd16_be178_ca70.0.20.70.30.20.10.0.12_cb0_daFDA256.0.0.100_db_dd0.3.7.40.50.50_dhA66A56.55.50.50.0_di5_qa_qb_dc0.1.D98763.D98763.D98763_eh4.151515_ea22.151515.151515.56.0.0_ec6.70.151515.151515.56.28.65.0_ed16.0.1.1.151515.56_ef_eg_r0026.151515.151515.56.0.0.47.47.62.582.435.1_fa7.50.50.68.0.51.55_fb_fh1_fc0.52.55.0.52.55.47.61.61.47.50.50_fd7.0.10.151515.56_fe50.61_ff0000000000_fg3.50_pa0.0.0.0.40.50.85.85.0.0_t00_pb_pc_pd_pe_ga0_gb1_gc20.0_ge0000000000_gh_gf_gg_gd10100000_ha100.100_hb49.1.44.52_hc0.32.52.0.32.52_hd37.1.81.49_ia_if_ib_id_ic_jc_ie_ja_jb_jd_je_jf_jg_ka10.46AFC5.59.59.0_kb10.46AFC5.59.59_kc_kd_ke_kf_la_lb_oa_os_ob_oc_od_oe_of_lc_m00_n00_s00_og_oh_oo_op_oq_or_om_on_ok_ol_oi_oj_ad0.0.0.0.0.0.0.0.0.0
4-angry=47**aa9.99.1.47.56.9.99.1.47.56_ab_ac_ba60_bb17.1_bc237.500.8.0.1_bd17_be178_ca70.0.20.70.30.20.10.0.12_cb0_daFDA256.0.0.100_db_dd0.3.7.40.50.50_dhA66A56.55.50.50.0_di5_qa_qb_dc0.1.D98763.D98763.D98763_eh4.151515_ea22.151515.151515.56.0.0_ec6.70.151515.151515.56.28.65.0_ed16.0.1.1.151515.56_ef_eg_r0026.151515.151515.56.0.0.47.47.62.582.435.1_fa7.50.50.68.0.51.55_fb_fh1_fc0.52.55.0.52.55.47.61.61.47.50.50_fd7.0.10.151515.56_fe50.61_ff0000000000_fg3.50_pa0.0.0.0.40.50.85.85.0.0_t00_pb_pc_pd_pe_ga0_gb1_gc20.0_ge0000000000_gh_gf_gg_gd10100000_ha75.75_hb22.1.44.65_hc0.0.19.0.0.19_hd21.1.50.49_ia_if_ib_id_ic_jc_ie_ja_jb_jd_je_jf_jg_ka10.46AFC5.59.59.0_kb10.46AFC5.59.59_kc_kd_ke_kf_la_lb_oa_os_ob_oc_od_oe_of_lc_m00_n00_s00_og_oh_oo_op_oq_or_om_on_ok_ol_oi_oj_ad0.0.0.0.0.0.0.0.0.0
4-happy=47**aa89.0.1.39.50.89.0.1.39.50_ab_ac_ba48_bb7.1_bc237.500.8.0.1_bd7_be178_ca70.0.20.70.30.20.10.0.12_cb0_daFDA256.0.0.100_db_dd0.3.7.40.50.50_dhA66A56.55.50.50.0_di5_qa_qb_dc0.1.D98763.D98763.D98763_eh4.151515_ea22.151515.151515.56.0.0_ec6.70.151515.151515.56.28.65.0_ed16.0.1.1.151515.56_ef_eg_r0026.151515.151515.56.0.0.47.47.62.582.435.1_fa7.50.50.68.0.51.55_fb_fh1_fc0.52.55.0.52.55.47.61.61.47.50.50_fd7.0.10.151515.56_fe50.61_ff0000000000_fg3.50_pa0.0.0.0.40.50.85.85.0.0_t00_pb_pc_pd_pe_ga0_gb1_gc20.0_ge0000000000_gh_gf_gg_gd10100000_ha1.1_hb49.1.44.65_hc0.60.22.0.60.22_hd23.1.100.49_ia_if_ib_id_ic_jc_ie_ja_jb_jd_je_jf_jg_ka10.46AFC5.59.59.0_kb10.46AFC5.59.59_kc_kd_ke_kf_la_lb_oa_os_ob_oc_od_oe_of_lc_m00_n00_s00_og_oh_oo_op_oq_or_om_on_ok_ol_oi_oj_ad0.0.0.0.0.0.0.0.0.0
4-horny=47**aa13.96.1.26.1.12.96.1.3.40_ab_ac_ba48_bb13.1_bc237.500.8.0.1_bd43_be178_ca70.0.20.70.30.20.10.0.12_cb0_daFDA256.0.0.100_db_dd0.3.7.40.50.50_dhA66A56.55.50.50.0_di5_qa_qb_dc0.1.D98763.D98763.D98763_eh4.151515_ea22.151515.151515.56.0.0_ec6.70.151515.151515.56.28.65.0_ed16.0.1.1.151515.56_ef_eg_r0026.151515.151515.56.0.0.47.47.62.582.435.1_fa7.50.50.68.0.51.55_fb_fh1_fc0.52.55.0.52.55.47.61.61.47.50.50_fd7.0.10.151515.56_fe50.61_ff0000000000_fg3.50_pa0.0.0.0.40.50.85.85.0.0_t00_pb_pc_pd_pe_ga0_gb1_gc20.0_ge0000000000_gh_gf_gg_gd10100000_ha81.81_hb49.1.44.65_hc0.10.39.0.10.39_hd35.1.50.49_ia_if_ib_id_ic_jc_ie_ja_jb_jd_je_jf_jg_ka10.46AFC5.59.59.0_kb10.46AFC5.59.59_kc_kd_ke_kf_la_lb_oa_os_ob_oc_od_oe_of_lc_m00_n00_s00_og_oh_oo_op_oq_or_om_on_ok_ol_oi_oj_ad0.0.0.0.0.0.0.0.0.0
4-calm=47**aa7.70.1.49.50.7.70.1.49.50_ab_ac_ba50_bb13.1_bc237.500.8.0.1_bd13_be178_ca70.0.20.70.30.20.10.0.12_cb0_daFDA256.0.0.100_db_dd0.3.7.40.50.50_dhA66A56.55.50.50.0_di5_qa_qb_dc0.1.D98763.D98763.D98763_eh4.151515_ea22.151515.151515.56.0.0_ec6.70.151515.151515.56.28.65.0_ed16.0.1.1.151515.56_ef_eg_r0026.151515.151515.56.0.0.47.47.62.582.435.1_fa7.50.50.68.0.51.55_fb_fh1_fc0.52.55.0.52.55.47.61.61.47.50.50_fd7.0.10.151515.56_fe50.61_ff0000000000_fg3.50_pa0.0.0.0.40.50.85.85.0.0_t00_pb_pc_pd_pe_ga0_gb1_gc20.0_ge0000000000_gh_gf_gg_gd10100000_ha90.90_hb49.1.44.65_hc0.40.39.0.40.39_hd0.1.50.49_ia_if_ib_id_ic_jc_ie_ja_jb_jd_je_jf_jg_ka10.46AFC5.59.59.0_kb10.46AFC5.59.59_kc_kd_ke_kf_la_lb_oa_os_ob_oc_od_oe_of_lc_m00_n00_s00_og_oh_oo_op_oq_or_om_on_ok_ol_oi_oj_ad0.0.0.0.0.0.0.0.0.0
4-confused=47**aa15.62.1.9.25.8.100.1.0.50_ab_ac_ba70_bb15.1_bc237.500.8.0.1_bd8_be178_ca70.0.20.70.30.20.10.0.12_cb0_daFDA256.0.0.100_db_dd0.3.7.40.50.50_dhA66A56.55.50.50.0_di5_qa_qb_dc0.1.D98763.D98763.D98763_eh4.151515_ea22.151515.151515.56.0.0_ec6.70.151515.151515.56.28.65.0_ed16.0.1.1.151515.56_ef_eg_r0026.151515.151515.56.0.0.47.47.62.582.435.1_fa7.50.50.68.0.51.55_fb_fh1_fc0.52.55.0.52.55.47.61.61.47.50.50_fd7.0.19.151515.56_fe50.61_ff0000000000_fg3.50_pa0.0.0.0.40.50.85.85.0.0_t00_pb_pc_pd_pe_ga0_gb1_gc20.0_ge0000000000_gh_gf_gg_gd10100000_ha100.100_hb0.1.44.65_hc0.40.39.0.40.39_hd22.1.50.49_ia_if_ib_id_ic_jc_ie_ja_jb_jd_je_jf_jg_ka10.46AFC5.59.59.0_kb10.46AFC5.59.59_kc_kd_ke_kf_la_lb_oa_os_ob_oc_od_oe_of_lc_m00_n00_s00_og_oh_oo_op_oq_or_om_on_ok_ol_oi_oj_ad0.0.0.0.0.0.0.0.0.0
4-interested=47**aa5.95.1.25.50.5.95.1.25.50_ab_ac_ba35_bb0.1_bc237.500.8.0.1_bd0_be180_ca70.0.20.70.30.20.10.0.12_cb0_daFDA256.0.0.100_db_dd0.3.7.40.50.50_dhA66A56.55.50.50.0_di5_qa_qb_dc0.1.D98763.D98763.D98763_eh4.151515_ea22.151515.151515.56.0.0_ec6.70.151515.151515.56.28.65.0_ed16.0.1.1.151515.56_ef_eg_r0026.151515.151515.56.0.0.47.47.62.582.435.1_fa7.50.50.68.0.51.55_fb_fh1_fc0.52.55.0.52.55.47.61.61.47.50.50_fd7.0.10.151515.56_fe50.61_ff0000000000_fg3.50_pa0.0.0.0.40.50.85.85.0.0_t00_pb_pc_pd_pe_ga0_gb1_gc20.0_ge0000000000_gh_gf_gg_gd10100000_ha68.68_hb50.1.44.65_hc0.19.39.0.19.39_hd34.1.60.49_ia_if_ib_id_ic_jc_ie_ja_jb_jd_je_jf_jg_ka10.46AFC5.59.59.0_kb10.46AFC5.59.59_kc_kd_ke_kf_la_lb_oa_os_ob_oc_od_oe_of_lc_m00_n00_s00_og_oh_oo_op_oq_or_om_on_ok_ol_oi_oj_ad0.0.0.0.0.0.0.0.0.0
4-sad=47**aa9.97.1.27.45.9.3.1.2.45_ab_ac_ba35_bb6.1_bc237.500.8.0.1_bd17_be178_ca70.0.20.70.30.20.10.0.12_cb0_daFDA256.0.0.100_db_dd0.3.7.40.50.50_dhA66A56.55.50.50.0_di5_qa_qb_dc0.1.D98763.D98763.D98763_eh4.151515_ea22.151515.151515.56.0.0_ec6.70.151515.151515.56.28.65.0_ed16.0.1.1.151515.56_ef_eg_r0026.151515.151515.56.0.0.47.47.62.582.435.1_fa7.50.50.68.0.51.55_fb_fh1_fc0.52.55.0.52.55.47.61.61.47.50.50_fd7.0.10.151515.56_fe50.61_ff0000000000_fg3.50_pa0.0.0.0.40.50.85.85.0.0_t00_pb_pc_pd_pe_ga0_gb1_gc20.0_ge0000000000_gh_gf_gg_gd10100000_ha26.26_hb0.1.66.65_hc0.49.39.0.49.39_hd21.1.50.49_ia_if_ib_id_ic_jc_ie_ja_jb_jd_je_jf_jg_ka10.46AFC5.59.59.0_kb10.46AFC5.59.59_kc_kd_ke_kf_la_lb_oa_os_ob_oc_od_oe_of_lc_m00_n00_s00_og_oh_oo_op_oq_or_om_on_ok_ol_oi_oj_ad0.0.0.0.0.0.0.0.0.0
4-embarrassed=47**aa72.35.1.28.52.76.35.1.28.45_ab_ac_ba35_bb25.1_bc237.500.8.0.1_bd17_be178_ca70.0.20.70.30.20.10.0.12_cb0_daFDA256.0.0.100_db_dd0.3.7.40.50.50_dhA66A56.55.50.50.0_di5_qa_qb_dc0.1.D98763.D98763.D98763_eh4.151515_ea22.151515.151515.56.0.0_ec6.70.151515.151515.56.28.65.0_ed16.0.1.1.151515.56_ef_eg_r0026.151515.151515.56.0.0.47.47.62.582.435.1_fa7.50.50.68.0.51.55_fb_fh1_fc0.52.55.0.52.55.47.61.61.47.50.50_fd7.0.10.151515.56_fe50.61_ff0000000000_fg3.50_pa0.0.0.0.40.50.85.85.0.0_t00_pb_pc_pd_pe_ga0_gb1_gc20.0_ge0000000000_gh_gf_gg_gd10100000_ha26.26_hb0.1.66.65_hc0.49.39.0.49.39_hd8.1.50.49_ia_if_ib_id_ic_jc_ie_ja_jb_jd_je_jf_jg_ka10.46AFC5.59.59.0_kb10.46AFC5.59.59_kc_kd_ke_kf_la_lb_oa_os_ob_oc_od_oe_of_lc_m00_n00_s00_og_oh_oo_op_oq_or_om_on_ok_ol_oi_oj_ad0.0.0.0.0.0.0.0.0.0
4-strip=47**aa24.70.0.27.46.26.70.1.23.60_ab_ac_ba35_bb6.1_bc237.500.8.0.1_bd17_be178_ca70.0.20.70.30.20.10.0.12_cb0_daFDA256.0.0.100_db_dd0.3.7.40.50.50_dhA66A56.55.50.50.0_di5_qa_qb_dc0.1.D98763.D98763.D98763_eh4.151515_ea22.151515.151515.56.0.0_ec6.70.151515.151515.56.28.65.0_ed16.0.1.1.151515.56_ef_eg_r0026.151515.151515.56.0.0.47.47.62.582.435.1_fa7.50.50.68.0.51.55_fb_fh1_fc0.52.55.0.52.55.47.61.61.47.50.50_fd7.0.10.151515.56_fe50.61_ff0000000000_fg3.50_pa0.0.0.0.40.50.85.85.0.0_t00_pb_pc_pd_pe_ga0_gb1_gc20.0_ge0000000000_gh_gf_gg_gd10100000_ha26.26_hb0.1.66.65_hc0.49.39.0.49.39_hd21.1.50.49_ia_if_ib_id_ic_jc_ie_ja_jb_jd_je_jf_jg_ka10.46AFC5.59.59.0_kb10.46AFC5.59.59_kc_kd_ke_kf_la_lb_oa_os_ob_oc_od_oe_of_lc_m00_n00_s00_og_oh_oo_op_oq_or_om_on_ok_ol_oi_oj_ad0.0.0.0.0.0.0.0.0.0

#Lost top (topless, covering breasts)

5-shocked=47**aa65.43.1.41.54.14.64.1.26.54_ab_ac_ba48_bb16.1_bc237.500.8.0.1_bd16_be178_ca70.0.20.70.30.20.10.0.12_cb0_daFDA256.0.0.100_db_dd0.3.7.40.50.50_dhA66A56.55.50.50.0_di5_qa_qb_dc0.1.D98763.D98763.D98763_eh4.151515_ea22.151515.151515.56.0.0_ec6.70.151515.151515.56.28.65.0_ed16.0.1.1.151515.56_ef_eg_r0026.151515.151515.56.0.0.47.47.62.582.435.1_fa7.50.50.68.0.51.55_fb_fh1_fc0.52.55.0.52.55.47.61.61.47.50.50_fd7.0.10.151515.56_fe50.61_ff0000000000_fg3.50_pa0.0.0.0.40.50.85.85.0.0_t00_pb_pc_pd_pe_ga0_gb1_gc20.0_ge0000000000_gh_gf_gg_gd10100000_ha100.100_hb49.1.44.52_hc0.32.52.0.32.52_hd37.1.81.49_ia_if_ib_id_ic_jc_ie_ja_jb_jd_je_jf_jg_ka_kb10.46AFC5.59.59_kc_kd_ke_kf_la_lb_oa_os_ob_oc_od_oe_of_lc_m00_n00_s00_og_oh_oo_op_oq_or_om_on_ok_ol_oi_oj_ad0.0.0.0.0.0.0.0.0.0
5-angry=47**aa9.66.1.42.31.17.39.1.1.55_ab_ac_ba60_bb13.1_bc237.500.8.0.1_bd5_be178_ca70.0.20.70.30.20.10.0.12_cb0_daFDA256.0.0.100_db_dd0.3.7.40.50.50_dhA66A56.55.50.50.0_di5_qa_qb_dc0.1.D98763.D98763.D98763_eh4.151515_ea22.151515.151515.56.0.0_ec6.70.151515.151515.56.28.65.0_ed16.0.1.1.151515.56_ef_eg_r0026.151515.151515.56.0.0.47.47.62.582.435.1_fa7.50.50.68.0.51.55_fb_fh1_fc0.52.55.0.52.55.47.61.61.47.50.50_fd7.0.10.151515.56_fe50.61_ff0000000000_fg3.50_pa0.0.0.0.40.50.85.85.0.0_t00_pb_pc_pd_pe_ga0_gb1_gc20.0_ge0000000000_gh_gf_gg_gd10100000_ha40.40_hb22.1.44.65_hc0.0.19.0.0.19_hd21.1.50.49_ia_if_ib_id_ic_jc_ie_ja_jb_jd_je_jf_jg_ka_kb10.46AFC5.59.59_kc_kd_ke_kf_la_lb_oa_os_ob_oc_od_oe_of_lc_m00_n00_s00_og_oh_oo_op_oq_or_om_on_ok_ol_oi_oj_ad0.0.0.0.0.0.0.0.0.0
5-happy=47**aa11.66.1.49.49.14.30.1.3.83_ab_ac_ba50_bb50.1_bc237.500.8.0.1_bd13_be178_ca70.0.20.70.30.20.10.0.12_cb0_daFDA256.0.0.100_db_dd0.3.7.40.50.50_dhA66A56.55.50.50.0_di5_qa_qb_dc0.1.D98763.D98763.D98763_eh4.151515_ea22.151515.151515.56.0.0_ec6.70.151515.151515.56.28.65.0_ed16.0.1.1.151515.56_ef_eg_r0026.151515.151515.56.0.0.47.47.62.582.435.1_fa7.50.50.68.0.51.55_fb_fh1_fc0.52.55.0.52.55.47.61.61.47.50.50_fd7.0.10.151515.56_fe50.61_ff0000000000_fg3.50_pa0.0.0.0.40.50.85.85.0.0_t00_pb_pc_pd_pe_ga0_gb1_gc20.0_ge0000000000_gh_gf_gg_gd10100000_ha90.90_hb100.1.29.65_hc0.40.39.0.40.39_hd23.1.70.49_ia_if_ib_id_ic_jc_ie_ja_jb_jd_je_jf_jg_ka_kb10.46AFC5.59.59_kc_kd_ke_kf_la_lb_oa_os_ob_oc_od_oe_of_lc_m00_n00_s00_og_oh_oo_op_oq_or_om_on_ok_ol_oi_oj_ad0.0.0.0.0.0.0.0.0.0
5-horny=47**aa61.40.1.16.53.13.96.1.3.40_ab_ac_ba48_bb13.1_bc237.500.8.0.1_bd43_be178_ca70.0.20.70.30.20.10.0.12_cb0_daFDA256.0.0.100_db_dd0.3.7.40.50.50_dhA66A56.55.50.50.0_di5_qa_qb_dc0.1.D98763.D98763.D98763_eh4.151515_ea22.151515.151515.56.0.0_ec6.70.151515.151515.56.28.65.0_ed16.0.1.1.151515.56_ef_eg_r0026.151515.151515.56.0.0.47.47.62.582.435.1_fa7.50.50.68.0.51.55_fb_fh1_fc0.52.55.0.52.55.47.61.61.47.50.50_fd7.0.10.151515.56_fe50.61_ff0000000000_fg3.50_pa0.0.0.0.40.50.85.85.0.0_t00_pb_pc_pd_pe_ga0_gb1_gc20.0_ge0000000000_gh_gf_gg_gd10100000_ha81.81_hb49.1.44.65_hc0.10.39.0.10.39_hd35.1.50.49_ia_if_ib_id_ic_jc_ie_ja_jb_jd_je_jf_jg_ka_kb10.46AFC5.59.59_kc_kd_ke_kf_la_lb_oa_os_ob_oc_od_oe_of_lc_m00_n00_s00_og_oh_oo_op_oq_or_om_on_ok_ol_oi_oj_ad0.0.0.0.0.0.0.0.0.0
5-calm=47**aa44.59.1.16.52.44.59.1.16.52_ab_ac_ba50_bb13.1_bc237.500.8.0.1_bd13_be178_ca70.0.20.70.30.20.10.0.12_cb0_daFDA256.0.0.100_db_dd0.3.7.40.50.50_dhA66A56.55.50.50.0_di5_qa_qb_dc0.1.D98763.D98763.D98763_eh4.151515_ea22.151515.151515.56.0.0_ec6.70.151515.151515.56.28.65.0_ed16.0.1.1.151515.56_ef_eg_r0026.151515.151515.56.0.0.47.47.62.582.435.1_fa7.50.50.68.0.51.55_fb_fh1_fc0.52.55.0.52.55.47.61.61.47.50.50_fd7.0.10.151515.56_fe50.61_ff0000000000_fg3.50_pa0.0.0.0.40.50.85.85.0.0_t00_pb_pc_pd_pe_ga0_gb1_gc20.0_ge0000000000_gh_gf_gg_gd10100000_ha90.90_hb49.1.44.65_hc0.40.39.0.40.39_hd0.1.50.49_ia_if_ib_id_ic_jc_ie_ja_jb_jd_je_jf_jg_ka_kb10.46AFC5.59.59_kc_kd_ke_kf_la_lb_oa_os_ob_oc_od_oe_of_lc_m00_n00_s00_og_oh_oo_op_oq_or_om_on_ok_ol_oi_oj_ad0.0.0.0.0.0.0.0.0.0
5-confused=47**aa31.72.1.9.20.31.72.1.9.20_ab_ac_ba70_bb15.1_bc237.500.8.0.1_bd8_be178_ca70.0.20.70.30.20.10.0.12_cb0_daFDA256.0.0.100_db_dd0.3.7.40.50.50_dhA66A56.55.50.50.0_di5_qa_qb_dc0.1.D98763.D98763.D98763_eh4.151515_ea22.151515.151515.56.0.0_ec6.70.151515.151515.56.28.65.0_ed16.0.1.1.151515.56_ef_eg_r0026.151515.151515.56.0.0.47.47.62.582.435.1_fa7.50.50.68.0.51.55_fb_fh1_fc0.52.55.0.52.55.47.61.61.47.50.50_fd7.0.19.151515.56_fe50.61_ff0000000000_fg3.50_pa0.0.0.0.40.50.85.85.0.0_t00_pb_pc_pd_pe_ga0_gb1_gc20.0_ge0000000000_gh_gf_gg_gd10100000_ha100.100_hb0.1.44.65_hc0.40.39.0.40.39_hd22.1.50.49_ia_if_ib_id_ic_jc_ie_ja_jb_jd_je_jf_jg_ka_kb10.46AFC5.59.59_kc_kd_ke_kf_la_lb_oa_os_ob_oc_od_oe_of_lc_m00_n00_s00_og_oh_oo_op_oq_or_om_on_ok_ol_oi_oj_ad0.0.0.0.0.0.0.0.0.0
5-interested=47**aa4.95.1.25.50.18.43.1.11.25_ab_ac_ba35_bb0.1_bc237.500.8.0.1_bd0_be180_ca70.0.20.70.30.20.10.0.12_cb0_daFDA256.0.0.100_db_dd0.3.7.40.50.50_dhA66A56.55.50.50.0_di5_qa_qb_dc0.1.D98763.D98763.D98763_eh4.151515_ea22.151515.151515.56.0.0_ec6.70.151515.151515.56.28.65.0_ed16.0.1.1.151515.56_ef_eg_r0026.151515.151515.56.0.0.47.47.62.582.435.1_fa7.50.50.68.0.51.55_fb_fh1_fc0.52.55.0.52.55.47.61.61.47.50.50_fd7.0.10.151515.56_fe50.61_ff0000000000_fg3.50_pa0.0.0.0.40.50.85.85.0.0_t00_pb_pc_pd_pe_ga0_gb1_gc20.0_ge0000000000_gh_gf_gg_gd10100000_ha68.68_hb50.1.44.65_hc0.19.39.0.19.39_hd34.1.60.49_ia_if_ib_id_ic_jc_ie_ja_jb_jd_je_jf_jg_ka_kb10.46AFC5.59.59_kc_kd_ke_kf_la_lb_oa_os_ob_oc_od_oe_of_lc_m00_n00_s00_og_oh_oo_op_oq_or_om_on_ok_ol_oi_oj_ad0.0.0.0.0.0.0.0.0.0
5-sad=47**aa13.58.1.42.45.13.58.1.42.45_ab_ac_ba35_bb6.1_bc237.500.8.0.1_bd17_be178_ca70.0.20.70.30.20.10.0.12_cb0_daFDA256.0.0.100_db_dd0.3.7.40.50.50_dhA66A56.55.50.50.0_di5_qa_qb_dc0.1.D98763.D98763.D98763_eh4.151515_ea22.151515.151515.56.0.0_ec6.70.151515.151515.56.28.65.0_ed16.0.1.1.151515.56_ef_eg_r0026.151515.151515.56.0.0.47.47.62.582.435.1_fa7.50.50.68.0.51.55_fb_fh1_fc0.52.55.0.52.55.47.61.61.47.50.50_fd7.0.10.151515.56_fe50.61_ff0000000000_fg3.50_pa0.0.0.0.40.50.85.85.0.0_t00_pb_pc_pd_pe_ga0_gb1_gc20.0_ge0000000000_gh_gf_gg_gd10100000_ha26.26_hb0.1.66.65_hc0.49.39.0.49.39_hd21.1.50.49_ia_if_ib_id_ic_jc_ie_ja_jb_jd_je_jf_jg_ka_kb10.46AFC5.59.59_kc_kd_ke_kf_la_lb_oa_os_ob_oc_od_oe_of_lc_m00_n00_s00_og_oh_oo_op_oq_or_om_on_ok_ol_oi_oj_ad0.0.0.0.0.0.0.0.0.0
5-embarrassed=47**aa17.60.1.26.52.17.60.1.26.45_ab_ac_ba35_bb25.1_bc237.500.8.0.1_bd17_be178_ca70.0.20.70.30.20.10.0.12_cb0_daFDA256.0.0.100_db_dd0.3.7.40.50.50_dhA66A56.55.50.50.0_di5_qa_qb_dc0.1.D98763.D98763.D98763_eh4.151515_ea22.151515.151515.56.0.0_ec6.70.151515.151515.56.28.65.0_ed16.0.1.1.151515.56_ef_eg_r0026.151515.151515.56.0.0.47.47.62.582.435.1_fa7.50.50.68.0.51.55_fb_fh1_fc0.52.55.0.52.55.47.61.61.47.50.50_fd7.0.10.151515.56_fe50.61_ff0000000000_fg3.50_pa0.0.0.0.40.50.85.85.0.0_t00_pb_pc_pd_pe_ga0_gb1_gc20.0_ge0000000000_gh_gf_gg_gd10100000_ha0.0_hb0.1.66.65_hc0.49.39.0.49.39_hd8.1.50.49_ia_if_ib_id_ic_jc_ie_ja_jb_jd_je_jf_jg_ka_kb10.46AFC5.59.59_kc_kd_ke_kf_la_lb_oa_os_ob_oc_od_oe_of_lc_m00_n00_s00_og_oh_oo_op_oq_or_om_on_ok_ol_oi_oj_ad0.0.0.0.0.0.0.0.0.0
5-strip=47**aa18.83.1.16.31.18.83.1.16.31_ab_ac_ba48_bb16.1_bc237.500.8.0.1_bd16_be178_ca70.0.20.70.30.20.10.0.12_cb0_daFDA256.0.0.100_db_dd0.3.7.40.50.50_dhA66A56.55.50.50.0_di5_qa_qb_dc0.1.D98763.D98763.D98763_eh4.151515_ea22.151515.151515.56.0.0_ec6.70.151515.151515.56.28.65.0_ed16.0.1.1.151515.56_ef_eg_r0026.151515.151515.56.0.0.47.47.62.582.435.1_fa7.50.50.68.0.51.55_fb_fh1_fc0.52.55.0.52.55.47.61.61.47.50.50_fd7.0.10.151515.56_fe50.61_ff0000000000_fg3.50_pa0.0.0.0.40.50.85.85.0.0_t00_pb_pc_pd_pe_ga0_gb1_gc20.0_ge0000000000_gh_gf_gg_gd10100000_ha100.100_hb49.1.44.52_hc0.32.52.0.32.52_hd37.1.81.49_ia_if_ib_id_ic_jc_ie_ja_jb_jd_je_jf_jg_ka_kb10.46AFC5.59.59_kc_kd_ke_kf_la_lb_oa_os_ob_oc_od_oe_of_lc_m00_n00_s00_og_oh_oo_op_oq_or_om_on_ok_ol_oi_oj_ad0.0.0.0.0.0.0.0.0.0

#Lost pants (nude)

6-shocked=40**aa92.32.1.39.54.14.82.1.28.54_ab_ac_ba48_bb16.1_bc150.500.8.0.1_bd16_be178_ca70.0.20.70.30.20.10.0.12_cb0_daFDA256.0.0.100_db_dd0.3.7.40.50_dhA66A56.55.50.50.0_di5_qa_qb_dc0.1.D98763.D98763.D98763_eh4.151515_ea22.151515.151515.56.0.0_ec6.70.151515.151515.56.28.65.0_ed16.0.1.1.151515.56_ef_eg_r026.151515.151515.56.0.0.47.47.62.582.435.1_fa7.50.50.68.0.51.55_fb_fh1_fc0.52.55.0.52.55.47.61.61.47.50.50_fd7.0.10.151515.56_fe50.61_ff0000000000_fg3.50_pa0.0.0.0.40.50.85.85.0.0_t0_pb_pc_pd_pe_ga0_gb1_gc20.0_ge0000000000_gh_gf_gg_gd10100000_ha100.100_hb49.1.44.52_hc0.32.52.0.32.52_hd37.1.81.49_ia_if_ib_id_ic_jc_ie_ja_jb_jd_je_jf_jg_ka_kb_kc_kd_ke_kf_la_lb_oa_os_ob_oc_od_oe_of_lc_m0_n0_s0_og_oh_oo_op_oq_or_om_on_ok_ol_oi_oj_ad0.0.0.0.0.0.0.0.0.0
6-angry=40**aa9.66.1.42.31.7.100.1.16.55_ab_ac_ba60_bb17.1_bc237.500.8.0.1_bd17_be178_ca70.0.20.70.30.20.10.0.12_cb0_daFDA256.0.0.100_db_dd0.3.7.40.50_dhA66A56.55.50.50.0_di5_qa_qb_dc0.1.D98763.D98763.D98763_eh4.151515_ea22.151515.151515.56.0.0_ec6.70.151515.151515.56.28.65.0_ed16.0.1.1.151515.56_ef_eg_r026.151515.151515.56.0.0.47.47.62.582.435.1_fa7.50.50.68.0.51.55_fb_fh1_fc0.52.55.0.52.55.47.61.61.47.50.50_fd7.0.10.151515.56_fe50.61_ff0000000000_fg3.50_pa0.0.0.0.40.50.85.85.0.0_t0_pb_pc_pd_pe_ga0_gb1_gc20.0_ge0000000000_gh_gf_gg_gd10100000_ha75.75_hb22.1.44.65_hc0.0.19.0.0.19_hd21.1.50.49_ia_if_ib_id_ic_jc_ie_ja_jb_jd_je_jf_jg_ka_kb_kc_kd_ke_kf_la_lb_oa_os_ob_oc_od_oe_of_lc_m0_n0_s0_og_oh_oo_op_oq_or_om_on_ok_ol_oi_oj_ad0.0.0.0.0.0.0.0.0.0
6-happy=40**aa89.0.1.39.50.89.0.1.39.50_ab_ac_ba48_bb7.1_bc325.500.8.0.1_bd7_be178_ca70.0.20.70.30.20.10.0.12_cb0_daFDA256.0.0.100_db_dd0.3.7.40.50_dhA66A56.55.50.50.0_di5_qa_qb_dc0.1.D98763.D98763.D98763_eh4.151515_ea22.151515.151515.56.0.0_ec6.70.151515.151515.56.28.65.0_ed16.0.1.1.151515.56_ef_eg_r026.151515.151515.56.0.0.47.47.62.582.435.1_fa7.50.50.68.0.51.55_fb_fh1_fc0.52.55.0.52.55.47.61.61.47.50.50_fd7.0.10.151515.56_fe50.61_ff0000000000_fg3.50_pa0.0.0.0.40.50.85.85.0.0_t0_pb_pc_pd_pe_ga0_gb1_gc20.0_ge0000000000_gh_gf_gg_gd10100000_ha1.1_hb49.1.44.65_hc0.60.22.0.60.22_hd23.1.100.49_ia_if_ib_id_ic_jc_ie_ja_jb_jd_je_jf_jg_ka_kb_kc_kd_ke_kf_la_lb_oa_os_ob_oc_od_oe_of_lc_m0_n0_s0_og_oh_oo_op_oq_or_om_on_ok_ol_oi_oj_ad0.0.0.0.0.0.0.0.0.0
6-horny=40**aa13.96.1.26.1.12.96.1.3.40_ab_ac_ba48_bb13.1_bc412.500.8.0.1_bd43_be178_ca70.0.20.70.30.20.10.0.12_cb0_daFDA256.0.0.100_db_dd0.3.7.40.50_dhA66A56.55.50.50.0_di5_qa_qb_dc0.1.D98763.D98763.D98763_eh4.151515_ea22.151515.151515.56.0.0_ec6.70.151515.151515.56.28.65.0_ed16.0.1.1.151515.56_ef_eg_r026.151515.151515.56.0.0.47.47.62.582.435.1_fa7.50.50.68.0.51.55_fb_fh1_fc0.52.55.0.52.55.47.61.61.47.50.50_fd7.0.10.151515.56_fe50.61_ff0000000000_fg3.50_pa0.0.0.0.40.50.85.85.0.0_t0_pb_pc_pd_pe_ga0_gb1_gc20.0_ge0000000000_gh_gf_gg_gd10100000_ha81.81_hb49.1.44.65_hc0.10.39.0.10.39_hd35.1.50.49_ia_if_ib_id_ic_jc_ie_ja_jb_jd_je_jf_jg_ka_kb_kc_kd_ke_kf_la_lb_oa_os_ob_oc_od_oe_of_lc_m0_n0_s0_og_oh_oo_op_oq_or_om_on_ok_ol_oi_oj_ad0.0.0.0.0.0.0.0.0.0
6-calm=40**aa7.68.1.49.50.16.82.1.28.50_ab_ac_ba50_bb13.1_bc500.500.8.0.1_bd13_be178_ca70.0.20.70.30.20.10.0.12_cb0_daFDA256.0.0.100_db_dd0.3.7.40.50_dhA66A56.55.50.50.0_di5_qa_qb_dc0.1.D98763.D98763.D98763_eh4.151515_ea22.151515.151515.56.0.0_ec6.70.151515.151515.56.28.65.0_ed16.0.1.1.151515.56_ef_eg_r026.151515.151515.56.0.0.47.47.62.582.435.1_fa7.50.50.68.0.51.55_fb_fh1_fc0.52.55.0.52.55.47.61.61.47.50.50_fd7.0.10.151515.56_fe50.61_ff0000000000_fg3.50_pa0.0.0.0.40.50.85.85.0.0_t0_pb_pc_pd_pe_ga0_gb1_gc20.0_ge0000000000_gh_gf_gg_gd10100000_ha90.90_hb49.1.44.65_hc0.40.39.0.40.39_hd0.1.50.49_ia_if_ib_id_ic_jc_ie_ja_jb_jd_je_jf_jg_ka_kb_kc_kd_ke_kf_la_lb_oa_os_ob_oc_od_oe_of_lc_m0_n0_s0_og_oh_oo_op_oq_or_om_on_ok_ol_oi_oj_ad0.0.0.0.0.0.0.0.0.0
6-confused=40**aa15.62.1.9.25.8.90.1.26.50_ab_ac_ba70_bb15.1_bc587.500.8.0.1_bd8_be178_ca70.0.20.70.30.20.10.0.12_cb0_daFDA256.0.0.100_db_dd0.3.7.40.50_dhA66A56.55.50.50.0_di5_qa_qb_dc0.1.D98763.D98763.D98763_eh4.151515_ea22.151515.151515.56.0.0_ec6.70.151515.151515.56.28.65.0_ed16.0.1.1.151515.56_ef_eg_r026.151515.151515.56.0.0.47.47.62.582.435.1_fa7.50.50.68.0.51.55_fb_fh1_fc0.52.55.0.52.55.47.61.61.47.50.50_fd7.0.19.151515.56_fe50.61_ff0000000000_fg3.50_pa0.0.0.0.40.50.85.85.0.0_t0_pb_pc_pd_pe_ga0_gb1_gc20.0_ge0000000000_gh_gf_gg_gd10100000_ha100.100_hb0.1.44.65_hc0.40.39.0.40.39_hd22.1.50.49_ia_if_ib_id_ic_jc_ie_ja_jb_jd_je_jf_jg_ka_kb_kc_kd_ke_kf_la_lb_oa_os_ob_oc_od_oe_of_lc_m0_n0_s0_og_oh_oo_op_oq_or_om_on_ok_ol_oi_oj_ad0.0.0.0.0.0.0.0.0.0
6-interested=40**aa5.95.1.25.50.5.95.1.25.50_ab_ac_ba35_bb0.1_bc675.500.8.0.1_bd0_be180_ca70.0.20.70.30.20.10.0.12_cb0_daFDA256.0.0.100_db_dd0.3.7.40.50_dhA66A56.55.50.50.0_di5_qa_qb_dc0.1.D98763.D98763.D98763_eh4.151515_ea22.151515.151515.56.0.0_ec6.70.151515.151515.56.28.65.0_ed16.0.1.1.151515.56_ef_eg_r026.151515.151515.56.0.0.47.47.62.582.435.1_fa7.50.50.68.0.51.55_fb_fh1_fc0.52.55.0.52.55.47.61.61.47.50.50_fd7.0.10.151515.56_fe50.61_ff0000000000_fg3.50_pa0.0.0.0.40.50.85.85.0.0_t0_pb_pc_pd_pe_ga0_gb1_gc20.0_ge0000000000_gh_gf_gg_gd10100000_ha68.68_hb50.1.44.65_hc0.19.39.0.19.39_hd34.1.60.49_ia_if_ib_id_ic_jc_ie_ja_jb_jd_je_jf_jg_ka_kb_kc_kd_ke_kf_la_lb_oa_os_ob_oc_od_oe_of_lc_m0_n0_s0_og_oh_oo_op_oq_or_om_on_ok_ol_oi_oj_ad0.0.0.0.0.0.0.0.0.0
6-sad=40**aa9.68.1.27.45.14.84.1.27.45_ab_ac_ba35_bb6.1_bc762.500.8.0.1_bd17_be178_ca70.0.20.70.30.20.10.0.12_cb0_daFDA256.0.0.100_db_dd0.3.7.40.50_dhA66A56.55.50.50.0_di5_qa_qb_dc0.1.D98763.D98763.D98763_eh4.151515_ea22.151515.151515.56.0.0_ec6.70.151515.151515.56.28.65.0_ed16.0.1.1.151515.56_ef_eg_r026.151515.151515.56.0.0.47.47.62.582.435.1_fa7.50.50.68.0.51.55_fb_fh1_fc0.52.55.0.52.55.47.61.61.47.50.50_fd7.0.10.151515.56_fe50.61_ff0000000000_fg3.50_pa0.0.0.0.40.50.85.85.0.0_t0_pb_pc_pd_pe_ga0_gb1_gc20.0_ge0000000000_gh_gf_gg_gd10100000_ha26.26_hb0.1.66.65_hc0.49.39.0.49.39_hd21.1.50.49_ia_if_ib_id_ic_jc_ie_ja_jb_jd_je_jf_jg_ka_kb_kc_kd_ke_kf_la_lb_oa_os_ob_oc_od_oe_of_lc_m0_n0_s0_og_oh_oo_op_oq_or_om_on_ok_ol_oi_oj_ad0.0.0.0.0.0.0.0.0.0
6-embarrassed=40**aa72.35.1.28.52.76.35.1.28.45_ab_ac_ba35_bb25.1_bc850.500.8.0.1_bd17_be178_ca70.0.20.70.30.20.10.0.12_cb0_daFDA256.0.0.100_db_dd0.3.7.40.50_dhA66A56.55.50.50.0_di5_qa_qb_dc0.1.D98763.D98763.D98763_eh4.151515_ea22.151515.151515.56.0.0_ec6.70.151515.151515.56.28.65.0_ed16.0.1.1.151515.56_ef_eg_r026.151515.151515.56.0.0.47.47.62.582.435.1_fa7.50.50.68.0.51.55_fb_fh1_fc0.52.55.0.52.55.47.61.61.47.50.50_fd7.0.10.151515.56_fe50.61_ff0000000000_fg3.50_pa0.0.0.0.40.50.85.85.0.0_t0_pb_pc_pd_pe_ga0_gb1_gc20.0_ge0000000000_gh_gf_gg_gd10100000_ha26.26_hb0.1.66.65_hc0.49.39.0.49.39_hd8.1.50.49_ia_if_ib_id_ic_jc_ie_ja_jb_jd_je_jf_jg_ka_kb_kc_kd_ke_kf_la_lb_oa_os_ob_oc_od_oe_of_lc_m0_n0_s0_og_oh_oo_op_oq_or_om_on_ok_ol_oi_oj_ad0.0.0.0.0.0.0.0.0.0

#Masturbating (sitting)


#Finished

8-shocked=40**aa92.32.1.39.54.14.82.1.28.54_ab_ac_ba48_bb16.1_bc150.500.8.0.1_bd16_be178_ca70.0.20.70.30.20.10.0.12_cb0_daFDA256.0.0.100_db_dd0.3.7.40.50_dhA66A56.55.50.50.0_di5_qa_qb_dc53.1.D98763.D98763.D98763_eh4.151515_ea22.151515.151515.56.0.0_ec6.70.151515.151515.56.28.65.0_ed16.0.1.1.151515.56_ef_eg_r026.151515.151515.56.0.0.47.47.62.582.435.1_fa7.50.50.68.0.51.55_fb_fh1_fc0.52.55.0.52.55.47.61.61.47.50.50_fd7.0.10.151515.56_fe50.61_ff0000000000_fg3.50_pa0.0.0.0.40.50.85.85.0.0_t0_pb_pc_pd_pe_ga0_gb1_gc20.0_ge0000000000_gh_gf_gg_gd10100000_ha100.100_hb49.1.44.52_hc0.32.52.0.32.52_hd37.1.81.49_ia_if_ib_id_ic_jc_ie_ja_jb_jd_je_jf_jg_ka_kb_kc_kd_ke_kf_la_lb_oa_os_ob_oc_od_oe_of_lc_m0_n0_s0_og_oh_oo_op_oq_or_om_on_ok_ol_oi_oj_ad0.0.0.0.0.0.0.0.0.0
8-angry=40**aa9.66.1.42.31.7.100.1.16.55_ab_ac_ba60_bb17.1_bc237.500.8.0.1_bd17_be178_ca70.0.20.70.30.20.10.0.12_cb0_daFDA256.0.0.100_db_dd0.3.7.40.50_dhA66A56.55.50.50.0_di5_qa_qb_dc53.1.D98763.D98763.D98763_eh4.151515_ea22.151515.151515.56.0.0_ec6.70.151515.151515.56.28.65.0_ed16.0.1.1.151515.56_ef_eg_r026.151515.151515.56.0.0.47.47.62.582.435.1_fa7.50.50.68.0.51.55_fb_fh1_fc0.52.55.0.52.55.47.61.61.47.50.50_fd7.0.10.151515.56_fe50.61_ff0000000000_fg3.50_pa0.0.0.0.40.50.85.85.0.0_t0_pb_pc_pd_pe_ga0_gb1_gc20.0_ge0000000000_gh_gf_gg_gd10100000_ha75.75_hb22.1.44.65_hc0.0.19.0.0.19_hd21.1.50.49_ia_if_ib_id_ic_jc_ie_ja_jb_jd_je_jf_jg_ka_kb_kc_kd_ke_kf_la_lb_oa_os_ob_oc_od_oe_of_lc_m0_n0_s0_og_oh_oo_op_oq_or_om_on_ok_ol_oi_oj_ad0.0.0.0.0.0.0.0.0.0
8-happy=40**aa89.0.1.39.50.89.0.1.39.50_ab_ac_ba48_bb7.1_bc325.500.8.0.1_bd7_be178_ca70.0.20.70.30.20.10.0.12_cb0_daFDA256.0.0.100_db_dd0.3.7.40.50_dhA66A56.55.50.50.0_di5_qa_qb_dc53.1.D98763.D98763.D98763_eh4.151515_ea22.151515.151515.56.0.0_ec6.70.151515.151515.56.28.65.0_ed16.0.1.1.151515.56_ef_eg_r026.151515.151515.56.0.0.47.47.62.582.435.1_fa7.50.50.68.0.51.55_fb_fh1_fc0.52.55.0.52.55.47.61.61.47.50.50_fd7.0.10.151515.56_fe50.61_ff0000000000_fg3.50_pa0.0.0.0.40.50.85.85.0.0_t0_pb_pc_pd_pe_ga0_gb1_gc20.0_ge0000000000_gh_gf_gg_gd10100000_ha1.1_hb49.1.44.65_hc0.60.22.0.60.22_hd23.1.100.49_ia_if_ib_id_ic_jc_ie_ja_jb_jd_je_jf_jg_ka_kb_kc_kd_ke_kf_la_lb_oa_os_ob_oc_od_oe_of_lc_m0_n0_s0_og_oh_oo_op_oq_or_om_on_ok_ol_oi_oj_ad0.0.0.0.0.0.0.0.0.0
8-horny=40**aa13.96.1.26.1.12.96.1.3.40_ab_ac_ba48_bb13.1_bc412.500.8.0.1_bd43_be178_ca70.0.20.70.30.20.10.0.12_cb0_daFDA256.0.0.100_db_dd0.3.7.40.50_dhA66A56.55.50.50.0_di5_qa_qb_dc53.1.D98763.D98763.D98763_eh4.151515_ea22.151515.151515.56.0.0_ec6.70.151515.151515.56.28.65.0_ed16.0.1.1.151515.56_ef_eg_r026.151515.151515.56.0.0.47.47.62.582.435.1_fa7.50.50.68.0.51.55_fb_fh1_fc0.52.55.0.52.55.47.61.61.47.50.50_fd7.0.10.151515.56_fe50.61_ff0000000000_fg3.50_pa0.0.0.0.40.50.85.85.0.0_t0_pb_pc_pd_pe_ga0_gb1_gc20.0_ge0000000000_gh_gf_gg_gd10100000_ha81.81_hb49.1.44.65_hc0.10.39.0.10.39_hd35.1.50.49_ia_if_ib_id_ic_jc_ie_ja_jb_jd_je_jf_jg_ka_kb_kc_kd_ke_kf_la_lb_oa_os_ob_oc_od_oe_of_lc_m0_n0_s0_og_oh_oo_op_oq_or_om_on_ok_ol_oi_oj_ad0.0.0.0.0.0.0.0.0.0
8-calm=40**aa7.68.1.49.50.16.82.1.28.50_ab_ac_ba50_bb13.1_bc500.500.8.0.1_bd13_be178_ca70.0.20.70.30.20.10.0.12_cb0_daFDA256.0.0.100_db_dd0.3.7.40.50_dhA66A56.55.50.50.0_di5_qa_qb_dc53.1.D98763.D98763.D98763_eh4.151515_ea22.151515.151515.56.0.0_ec6.70.151515.151515.56.28.65.0_ed16.0.1.1.151515.56_ef_eg_r026.151515.151515.56.0.0.47.47.62.582.435.1_fa7.50.50.68.0.51.55_fb_fh1_fc0.52.55.0.52.55.47.61.61.47.50.50_fd7.0.10.151515.56_fe50.61_ff0000000000_fg3.50_pa0.0.0.0.40.50.85.85.0.0_t0_pb_pc_pd_pe_ga0_gb1_gc20.0_ge0000000000_gh_gf_gg_gd10100000_ha90.90_hb49.1.44.65_hc0.40.39.0.40.39_hd0.1.50.49_ia_if_ib_id_ic_jc_ie_ja_jb_jd_je_jf_jg_ka_kb_kc_kd_ke_kf_la_lb_oa_os_ob_oc_od_oe_of_lc_m0_n0_s0_og_oh_oo_op_oq_or_om_on_ok_ol_oi_oj_ad0.0.0.0.0.0.0.0.0.0
8-confused=40**aa15.62.1.9.25.8.90.1.26.50_ab_ac_ba70_bb15.1_bc587.500.8.0.1_bd8_be178_ca70.0.20.70.30.20.10.0.12_cb0_daFDA256.0.0.100_db_dd0.3.7.40.50_dhA66A56.55.50.50.0_di5_qa_qb_dc53.1.D98763.D98763.D98763_eh4.151515_ea22.151515.151515.56.0.0_ec6.70.151515.151515.56.28.65.0_ed16.0.1.1.151515.56_ef_eg_r026.151515.151515.56.0.0.47.47.62.582.435.1_fa7.50.50.68.0.51.55_fb_fh1_fc0.52.55.0.52.55.47.61.61.47.50.50_fd7.0.19.151515.56_fe50.61_ff0000000000_fg3.50_pa0.0.0.0.40.50.85.85.0.0_t0_pb_pc_pd_pe_ga0_gb1_gc20.0_ge0000000000_gh_gf_gg_gd10100000_ha100.100_hb0.1.44.65_hc0.40.39.0.40.39_hd22.1.50.49_ia_if_ib_id_ic_jc_ie_ja_jb_jd_je_jf_jg_ka_kb_kc_kd_ke_kf_la_lb_oa_os_ob_oc_od_oe_of_lc_m0_n0_s0_og_oh_oo_op_oq_or_om_on_ok_ol_oi_oj_ad0.0.0.0.0.0.0.0.0.0
8-interested=40**aa5.95.1.25.50.5.95.1.25.50_ab_ac_ba35_bb0.1_bc675.500.8.0.1_bd0_be180_ca70.0.20.70.30.20.10.0.12_cb0_daFDA256.0.0.100_db_dd0.3.7.40.50_dhA66A56.55.50.50.0_di5_qa_qb_dc53.1.D98763.D98763.D98763_eh4.151515_ea22.151515.151515.56.0.0_ec6.70.151515.151515.56.28.65.0_ed16.0.1.1.151515.56_ef_eg_r026.151515.151515.56.0.0.47.47.62.582.435.1_fa7.50.50.68.0.51.55_fb_fh1_fc0.52.55.0.52.55.47.61.61.47.50.50_fd7.0.10.151515.56_fe50.61_ff0000000000_fg3.50_pa0.0.0.0.40.50.85.85.0.0_t0_pb_pc_pd_pe_ga0_gb1_gc20.0_ge0000000000_gh_gf_gg_gd10100000_ha68.68_hb50.1.44.65_hc0.19.39.0.19.39_hd34.1.60.49_ia_if_ib_id_ic_jc_ie_ja_jb_jd_je_jf_jg_ka_kb_kc_kd_ke_kf_la_lb_oa_os_ob_oc_od_oe_of_lc_m0_n0_s0_og_oh_oo_op_oq_or_om_on_ok_ol_oi_oj_ad0.0.0.0.0.0.0.0.0.0
8-sad=40**aa9.68.1.27.45.14.84.1.27.45_ab_ac_ba35_bb6.1_bc762.500.8.0.1_bd17_be178_ca70.0.20.70.30.20.10.0.12_cb0_daFDA256.0.0.100_db_dd0.3.7.40.50_dhA66A56.55.50.50.0_di5_qa_qb_dc53.1.D98763.D98763.D98763_eh4.151515_ea22.151515.151515.56.0.0_ec6.70.151515.151515.56.28.65.0_ed16.0.1.1.151515.56_ef_eg_r026.151515.151515.56.0.0.47.47.62.582.435.1_fa7.50.50.68.0.51.55_fb_fh1_fc0.52.55.0.52.55.47.61.61.47.50.50_fd7.0.10.151515.56_fe50.61_ff0000000000_fg3.50_pa0.0.0.0.40.50.85.85.0.0_t0_pb_pc_pd_pe_ga0_gb1_gc20.0_ge0000000000_gh_gf_gg_gd10100000_ha26.26_hb0.1.66.65_hc0.49.39.0.49.39_hd21.1.50.49_ia_if_ib_id_ic_jc_ie_ja_jb_jd_je_jf_jg_ka_kb_kc_kd_ke_kf_la_lb_oa_os_ob_oc_od_oe_of_lc_m0_n0_s0_og_oh_oo_op_oq_or_om_on_ok_ol_oi_oj_ad0.0.0.0.0.0.0.0.0.0
8-embarrassed=40**aa72.35.1.28.52.76.35.1.28.45_ab_ac_ba35_bb25.1_bc850.500.8.0.1_bd17_be178_ca70.0.20.70.30.20.10.0.12_cb0_daFDA256.0.0.100_db_dd0.3.7.40.50_dhA66A56.55.50.50.0_di5_qa_qb_dc53.1.D98763.D98763.D98763_eh4.151515_ea22.151515.151515.56.0.0_ec6.70.151515.151515.56.28.65.0_ed16.0.1.1.151515.56_ef_eg_r026.151515.151515.56.0.0.47.47.62.582.435.1_fa7.50.50.68.0.51.55_fb_fh1_fc0.52.55.0.52.55.47.61.61.47.50.50_fd7.0.10.151515.56_fe50.61_ff0000000000_fg3.50_pa0.0.0.0.40.50.85.85.0.0_t0_pb_pc_pd_pe_ga0_gb1_gc20.0_ge0000000000_gh_gf_gg_gd10100000_ha26.26_hb0.1.66.65_hc0.49.39.0.49.39_hd8.1.50.49_ia_if_ib_id_ic_jc_ie_ja_jb_jd_je_jf_jg_ka_kb_kc_kd_ke_kf_la_lb_oa_os_ob_oc_od_oe_of_lc_m0_n0_s0_og_oh_oo_op_oq_or_om_on_ok_ol_oi_oj_ad0.0.0.0.0.0.0.0.0.0

2-strip=47***aa11.61.1.47.34.11.61.1.47.35_ab_ac_ba50_bb62.1_bc185.200.0.0.1_bd62_be180_ca56.0.36.75.15.34.34.0.10_cb0_da1.0.0.100_db_dd0.3.0.9.17.50_dh1.30.50.50.0_di7_qa_qb_dc2735.3.1.1.1_eh_ea27.55.55.55.1.0_ec7.11.55.55.55.47.64.0_ed0.37.1.1.55.56_ef_eg_r00_fa4.76.87.73.32.65.56_fb7_fh1_fc0.FFDA00.55.0.FFDA00.55.37.61.61.37.48.50_fd1.0.36.55.56_fe50.73_ff0000000000_fg0.52_pa0.0.0.0.40.50.85.85.0.0_t00_pb0.54.54.0_pc_pd_pe_ga0_gb1_gc68.0_ge0000000000_gh_gf_gg_gd11000000_ha72.72_hb50.1.50.99_hc1.43.3.1.43.3_hd38.1.60.38_ia_if_ib_id_ic_jc_ie_ja_jb_jd_je_jf_jg_ka_kb_kc_kd_ke_kf_la_lb_oa_os_ob_oc_od_oe_of_lc_m00_n00_s00_og_oh_oo_op_oq_or_om_on_ok_ol_oi_oj_ad1.1.1.1.1.1.1.1.1.1*0*0*0*0*0*0*0*0#/]a00_b00_c00_d00_w00_x00_e00_y00_z00_ua1.55.0.0.100_uf0.3.0.0_ue_ub_u0_v0_uc7.0.30_ud7.8
2-strip=47**aa17.100.1.0.100.17.100.1.0.100_ab_ac_ba35_bb74.1_bc237.500.8.0.1_bd64_be178_ca70.0.20.70.30.20.10.0.12_cb0_daFDA256.0.0.100_db_dd0.3.7.40.50.50_dhA66A56.55.50.50.0_di5_qa_qb_dc0.1.D98763.D98763.D98763_eh_ea22.151515.151515.56.0.0_ec6.44.151515.151515.56.28.65.0_ed16.0.1.1.151515.56_ef_eg_r0026.151515.151515.56.0.0.47.47.62.582.435.1_fa7.50.50.68.0.51.55_fb_fh1_fc0.52.55.0.52.55.47.61.61.47.50.50_fd7.0.10.151515.56_fe50.61_ff0000000000_fg3.50_pa0.0.0.0.40.50.85.85.0.0_t00_pb_pc_pd_pe_ga0_gb1_gc20.0_ge0000000000_gh_gf_gg_gd10100000_ha26.26_hb0.1.66.65_hc0.49.39.0.49.39_hd21.1.50.49_ia_if_ib_id_ic_jc_ie_ja_jb_jd2.76A9A7.76A9A7.57_je_jf_jg_ka10.46AFC5.59.59.0_kb10.46AFC5.59.59_kc_kd_ke_kf_la12.46AFC5.46AFC5.0.1_lb_oa_os_ob_oc_od_oe_of_lc_m0037.43.3.0.0.2.25.15.0.81.4.61_m015.27.3.0.0.2.13.15.0.81.4.61_n00_s00_og_oh_oo_op_oq_or_om_on_ok_ol_oi_oj_ad0.0.0.0.0.0.0.0.0.0

7-shocked=40**aa70.32.1.39.54.21.78.1.25.43_ab_ac_ba48_bb63.1_bc150.500.8.0.1_bd63_be178_ca70.0.20.70.30.20.10.0.12_cb0_daFDA256.0.0.100_db_dd0.3.7.40.50_dhA66A56.55.50.50.0_di5_qa_qb_dc24.1.D98763.D98763.D98763_eh4.151515_ea22.151515.151515.56.0.0_ec6.34.151515.151515.56.28.65.0_ed16.0.1.1.151515.56_ef_eg_r026.151515.151515.56.0.0.47.47.62.582.435.1_fa7.50.50.68.0.51.55_fb_fh1_fc0.52.55.0.52.55.47.61.61.47.50.50_fd7.0.10.151515.56_fe50.61_ff0000000000_fg3.50_pa0.0.0.0.40.50.85.85.0.0_t0_pb_pc_pd_pe_ga0_gb0_gc76.0_ge0000000000_gh_gf_gg_gd10100000_ha100.100_hb49.1.44.52_hc0.32.52.0.32.52_hd37.1.81.49_ia_if_ib_id_ic_jc_ie_ja_jb_jd_je_jf_jg_ka_kb_kc_kd_ke_kf_la_lb_oa_os_ob_oc_od_oe_of_lc_m0_n0_s0_og_oh_oo_op_oq_or_om_on_ok_ol_oi_oj_ad0.0.0.0.0.0.0.0.0.0
7-angry=40**aa18.58.1.16.56.20.79.1.13.56_ab_ac_ba60_bb60.1_bc237.500.8.0.1_bd60_be178_ca70.0.20.70.30.20.10.0.12_cb0_daFDA256.0.0.100_db_dd0.3.7.40.50_dhA66A56.55.50.50.0_di5_qa_qb_dc24.1.D98763.D98763.D98763_eh4.151515_ea22.151515.151515.56.0.0_ec6.34.151515.151515.56.28.65.0_ed16.0.1.1.151515.56_ef_eg_r026.151515.151515.56.0.0.47.47.62.582.435.1_fa7.50.50.68.0.51.55_fb_fh1_fc0.52.55.0.52.55.47.61.61.47.50.50_fd7.0.10.151515.56_fe50.61_ff0000000000_fg3.50_pa0.0.0.0.40.50.85.85.0.0_t0_pb_pc_pd_pe_ga0_gb0_gc76.0_ge0000000000_gh_gf_gg_gd10100000_ha75.75_hb22.1.44.65_hc0.0.19.0.0.19_hd21.1.50.49_ia_if_ib_id_ic_jc_ie_ja_jb_jd_je_jf_jg_ka_kb_kc_kd_ke_kf_la_lb_oa_os_ob_oc_od_oe_of_lc_m0_n0_s0_og_oh_oo_op_oq_or_om_on_ok_ol_oi_oj_ad0.0.0.0.0.0.0.0.0.0
7-happy=40**aa84.11.1.39.50.20.77.1.25.50_ab_ac_ba48_bb62.1_bc325.500.8.0.1_bd62_be178_ca70.0.20.70.30.20.10.0.12_cb0_daFDA256.0.0.100_db_dd0.3.7.40.50_dhA66A56.55.50.50.0_di5_qa_qb_dc24.1.D98763.D98763.D98763_eh4.151515_ea22.151515.151515.56.0.0_ec6.34.151515.151515.56.28.65.0_ed16.0.1.1.151515.56_ef_eg_r026.151515.151515.56.0.0.47.47.62.582.435.1_fa7.50.50.68.0.51.55_fb_fh1_fc0.52.55.0.52.55.47.61.61.47.50.50_fd7.0.10.151515.56_fe50.61_ff0000000000_fg3.50_pa0.0.0.0.40.50.85.85.0.0_t0_pb_pc_pd_pe_ga0_gb0_gc76.0_ge0000000000_gh_gf_gg_gd10100000_ha1.1_hb49.1.44.65_hc0.60.22.0.60.22_hd23.1.100.49_ia_if_ib_id_ic_jc_ie_ja_jb_jd_je_jf_jg_ka_kb_kc_kd_ke_kf_la_lb_oa_os_ob_oc_od_oe_of_lc_m0_n0_s0_og_oh_oo_op_oq_or_om_on_ok_ol_oi_oj_ad0.0.0.0.0.0.0.0.0.0
7-horny=40**aa18.77.1.25.52.14.67.1.4.40_ab_ac_ba48_bb62.1_bc412.500.8.0.1_bd62_be178_ca70.0.20.70.30.20.10.0.12_cb0_daFDA256.0.0.100_db_dd0.3.7.40.50_dhA66A56.55.50.50.0_di5_qa_qb_dc24.1.D98763.D98763.D98763_eh4.151515_ea22.151515.151515.56.0.0_ec6.34.151515.151515.56.28.65.0_ed16.0.1.1.151515.56_ef_eg_r026.151515.151515.56.0.0.47.47.62.582.435.1_fa7.50.50.68.0.51.55_fb_fh1_fc0.52.55.0.52.55.47.61.61.47.50.50_fd7.0.10.151515.56_fe50.61_ff0000000000_fg3.50_pa0.0.0.0.40.50.85.85.0.0_t0_pb_pc_pd_pe_ga0_gb0_gc76.0_ge0000000000_gh_gf_gg_gd10100000_ha81.81_hb49.1.44.65_hc0.10.39.0.10.39_hd35.1.50.49_ia_if_ib_id_ic_jc_ie_ja_jb_jd_je_jf_jg_ka_kb_kc_kd_ke_kf_la_lb_oa_os_ob_oc_od_oe_of_lc_m0_n0_s0_og_oh_oo_op_oq_or_om_on_ok_ol_oi_oj_ad0.0.0.0.0.0.0.0.0.0
7-calm=40**aa21.80.1.2.50.21.80.1.45.50_ab_ac_ba50_bb61.1_bc500.500.8.0.1_bd61_be178_ca70.0.20.70.30.20.10.0.12_cb0_daFDA256.0.0.100_db_dd0.3.7.40.50_dhA66A56.55.50.50.0_di5_qa_qb_dc24.1.D98763.D98763.D98763_eh4.151515_ea22.151515.151515.56.0.0_ec6.34.151515.151515.56.28.65.0_ed16.0.1.1.151515.56_ef_eg_r026.151515.151515.56.0.0.47.47.62.582.435.1_fa7.50.50.68.0.51.55_fb_fh1_fc0.52.55.0.52.55.47.61.61.47.50.50_fd7.0.10.151515.56_fe50.61_ff0000000000_fg3.50_pa0.0.0.0.40.50.85.85.0.0_t0_pb_pc_pd_pe_ga0_gb0_gc76.0_ge0000000000_gh_gf_gg_gd10100000_ha90.90_hb49.1.44.65_hc0.40.39.0.40.39_hd0.1.50.49_ia_if_ib_id_ic_jc_ie_ja_jb_jd_je_jf_jg_ka_kb_kc_kd_ke_kf_la_lb_oa_os_ob_oc_od_oe_of_lc_m0_n0_s0_og_oh_oo_op_oq_or_om_on_ok_ol_oi_oj_ad0.0.0.0.0.0.0.0.0.0
7-confused=40**aa15.62.1.9.25.8.100.1.0.50_ab_ac_ba70_bb61.1_bc587.500.8.0.1_bd61_be178_ca70.0.20.70.30.20.10.0.12_cb0_daFDA256.0.0.100_db_dd0.3.7.40.50_dhA66A56.55.50.50.0_di5_qa_qb_dc24.1.D98763.D98763.D98763_eh4.151515_ea22.151515.151515.56.0.0_ec6.34.151515.151515.56.28.65.0_ed16.0.1.1.151515.56_ef_eg_r026.151515.151515.56.0.0.47.47.62.582.435.1_fa7.50.50.68.0.51.55_fb_fh1_fc0.52.55.0.52.55.47.61.61.47.50.50_fd7.0.19.151515.56_fe50.61_ff0000000000_fg3.50_pa0.0.0.0.40.50.85.85.0.0_t0_pb_pc_pd_pe_ga0_gb0_gc76.0_ge0000000000_gh_gf_gg_gd10100000_ha100.100_hb0.1.44.65_hc0.40.39.0.40.39_hd22.1.50.49_ia_if_ib_id_ic_jc_ie_ja_jb_jd_je_jf_jg_ka_kb_kc_kd_ke_kf_la_lb_oa_os_ob_oc_od_oe_of_lc_m0_n0_s0_og_oh_oo_op_oq_or_om_on_ok_ol_oi_oj_ad0.0.0.0.0.0.0.0.0.0
7-interested=40**aa49.58.1.16.50.49.58.1.16.50_ab_ac_ba35_bb63.1_bc675.500.8.0.1_bd63_be180_ca70.0.20.70.30.20.10.0.12_cb0_daFDA256.0.0.100_db_dd0.3.7.40.50_dhA66A56.55.50.50.0_di5_qa_qb_dc24.1.D98763.D98763.D98763_eh4.151515_ea22.151515.151515.56.0.0_ec6.34.151515.151515.56.28.65.0_ed16.0.1.1.151515.56_ef_eg_r026.151515.151515.56.0.0.47.47.62.582.435.1_fa7.50.50.68.0.51.55_fb_fh1_fc0.52.55.0.52.55.47.61.61.47.50.50_fd7.0.10.151515.56_fe50.61_ff0000000000_fg3.50_pa0.0.0.0.40.50.85.85.0.0_t0_pb_pc_pd_pe_ga0_gb0_gc76.0_ge0000000000_gh_gf_gg_gd10100000_ha68.68_hb50.1.44.65_hc0.19.39.0.19.39_hd34.1.60.49_ia_if_ib_id_ic_jc_ie_ja_jb_jd_je_jf_jg_ka_kb_kc_kd_ke_kf_la_lb_oa_os_ob_oc_od_oe_of_lc_m0_n0_s0_og_oh_oo_op_oq_or_om_on_ok_ol_oi_oj_ad0.0.0.0.0.0.0.0.0.0
7-sad=40**aa17.82.1.27.34.11.4.1.49.45_ab_ac_ba35_bb61.1_bc762.500.8.0.1_bd61_be178_ca70.0.20.70.30.20.10.0.12_cb0_daFDA256.0.0.100_db_dd0.3.7.40.50_dhA66A56.55.50.50.0_di5_qa_qb_dc24.1.D98763.D98763.D98763_eh4.151515_ea22.151515.151515.56.0.0_ec6.34.151515.151515.56.28.65.0_ed16.0.1.1.151515.56_ef_eg_r026.151515.151515.56.0.0.47.47.62.582.435.1_fa7.50.50.68.0.51.55_fb_fh1_fc0.52.55.0.52.55.47.61.61.47.50.50_fd7.0.10.151515.56_fe50.61_ff0000000000_fg3.50_pa0.0.0.0.40.50.85.85.0.0_t0_pb_pc_pd_pe_ga0_gb0_gc76.0_ge0000000000_gh_gf_gg_gd10100000_ha26.26_hb0.1.66.65_hc0.49.39.0.49.39_hd21.1.50.49_ia_if_ib_id_ic_jc_ie_ja_jb_jd_je_jf_jg_ka_kb_kc_kd_ke_kf_la_lb_oa_os_ob_oc_od_oe_of_lc_m0_n0_s0_og_oh_oo_op_oq_or_om_on_ok_ol_oi_oj_ad0.0.0.0.0.0.0.0.0.0
7-embarrassed=40**aa22.78.1.28.52.91.34.1.28.45_ab_ac_ba35_bb60.1_bc850.500.8.0.1_bd60_be178_ca70.0.20.70.30.20.10.0.12_cb0_daFDA256.0.0.100_db_dd0.3.7.40.50_dhA66A56.55.50.50.0_di5_qa_qb_dc24.1.D98763.D98763.D98763_eh4.151515_ea22.151515.151515.56.0.0_ec6.34.151515.151515.56.28.65.0_ed16.0.1.1.151515.56_ef_eg_r026.151515.151515.56.0.0.47.47.62.582.435.1_fa7.50.50.68.0.51.55_fb_fh1_fc0.52.55.0.52.55.47.61.61.47.50.50_fd7.0.10.151515.56_fe50.61_ff0000000000_fg3.50_pa0.0.0.0.40.50.85.85.0.0_t0_pb_pc_pd_pe_ga0_gb0_gc76.0_ge0000000000_gh_gf_gg_gd10100000_ha26.26_hb0.1.66.65_hc0.49.39.0.49.39_hd8.1.50.49_ia_if_ib_id_ic_jc_ie_ja_jb_jd_je_jf_jg_ka_kb_kc_kd_ke_kf_la_lb_oa_os_ob_oc_od_oe_of_lc_m0_n0_s0_og_oh_oo_op_oq_or_om_on_ok_ol_oi_oj_ad0.0.0.0.0.0.0.0.0.0
