#Sitting
4-loss=47***aa11.61.1.47.34.11.61.1.47.35_ab_ac_ba50_bb62.1_bc185.200.0.0.1_bd62_be180_ca56.0.36.75.15.34.34.0.10_cb0_da1.0.0.100_db_dd0.3.0.9.17.50_dh1.30.50.50.0_di7_qa_qb_dc2735.3.1.1.1_eh_ea27.55.55.55.1.0_ec7.11.55.55.55.47.64.0_ed0.37.1.1.55.56_ef_eg_r00_fa4.76.87.73.32.65.56_fb7_fh1_fc0.FFDA00.55.0.FFDA00.55.37.61.61.37.48.50_fd1.0.36.55.56_fe50.73_ff0000000000_fg0.52_pa0.0.0.0.40.50.85.85.0.0_t00_pb0.54.54.0_pc_pd_pe_ga0_gb1_gc68.0_ge0000000000_gh_gf_gg_gd11000000_ha72.72_hb50.1.50.99_hc1.43.3.1.43.3_hd38.1.60.38_ia_if_ib_id_ic_jc_ie_ja_jb_jd_je_jf_jg_ka_kb_kc_kd_ke_kf_la_lb_oa_os_ob_oc_od_oe_of_lc_m00_n00_s00_og_oh_oo_op_oq_or_om_on_ok_ol_oi_oj_ad1.1.1.1.1.1.1.1.1.1*0*0*0*0*0*0*0*0#/]a00_b00_c00_d00_w00_x00_e00_y00_z00_ua1.55.0.0.100_uf0.3.0.0_ue_ub_u0_v0_uc7.0.30_ud7.8

4-loss=47**aa11.65.1.16.61.11.65.1.42.61_ab_ac_ba50_bb98.1_bc185.200.0.0.1_bd98_be180_ca56.0.36.75.15.34.34.0.10_cb0_da1.0.0.100_db_dd9.3.0.9.17.50_dh1.30.50.50.0_di7_qa_qb_dc2.4.1.1.1_eh_ea27.121216.121216.121216.1.0_ec_ed0.50.1.1.121216.56_ef_eg_r0048.121216.121216.56.0.0.77.61.39.574.494.1_r0335.121216.121216.56.0.0.68.0.322.447.329.1_r0448.121216.121216.56.0.0.68.18.0.588.282.0_r0548.121216.121216.121216.0.0.32.29.359.596.306.0_r0657.121216.121216.121216.0.0.27.90.350.572.360.0_r0751.121216.121216.121216.0.0.3.11.360.526.321.0_r0949.121216.121216.56.0.0.48.49.0.604.541.1_r1045.121216.121216.56.0.0.52.50.132.636.494.0_fa4.76.87.73.32.65.56_fb7_fh1_fc0.FFDA00.55.0.FFDA00.55.37.61.61.37.48.50_fd1.0.34.121216.56_fe50.73_ff0000000000_fg0.52_pa0.0.0.0.40.50.85.85.0.0_t00_pb0.121216.352A4A.0_pc_pd_pe_ga0_gb1_gc44.0_ge0000000000_gh_gf_gg_gd10000000_ha89.89_hb100.1.0.99_hc3.73.36.3.73.36_hd37.1.60.38_ia_if_ib_id_ic_jc_ie_ja_jb_jd_je_jf_jg_ka_kb12.121216.16.42_kc_kd_ke_kf_la_lb_oa_os_ob_oc_od_oe_of_lc_m00_n00_s00_og_oh_oo_op_oq_or_om_on_ok_ol_oi_oj_ad0.0.0.0.0.0.0.0.0.0

4-strip=47**aa28.80.1.16.33.28.80.1.16.45_ab_ac_ba50_bb76.1_bc185.200.0.0.1_bd76_be180_ca56.0.36.75.15.34.34.0.10_cb0_da1.0.0.100_db_dd10.3.0.9.17.50_dh1.30.50.50.0_di7_qa_qb_dc2.4.1.1.1_eh_ea27.121216.121216.121216.1.0_ec_ed0.50.1.1.121216.56_ef_eg_r0048.121216.121216.56.0.0.77.61.39.574.494.1_r0335.121216.121216.56.0.0.68.0.322.447.329.1_r0448.121216.121216.56.0.0.68.18.0.588.282.0_r0548.121216.121216.121216.0.0.32.29.359.596.306.0_r0657.121216.121216.121216.0.0.27.90.350.572.360.0_r0751.121216.121216.121216.0.0.3.11.360.526.321.0_r0949.121216.121216.56.0.0.48.49.0.604.541.1_r1045.121216.121216.56.0.0.52.50.132.636.494.0_fa4.76.87.73.32.65.56_fb7_fh1_fc0.FFDA00.55.0.FFDA00.55.37.61.61.37.48.50_fd1.0.34.121216.56_fe50.73_ff0000000000_fg0.52_pa0.0.0.0.40.50.85.85.0.0_t00_pb0.121216.352A4A.0_pc_pd_pe_ga0_gb1_gc44.0_ge0000000000_gh_gf_gg_gd10000000_ha89.89_hb50.1.50.99_hc1.24.0.1.24.0_hd38.1.60.38_ia_if_ib_id_ic_jc_ie_ja_jb_jd_je_jf_jg_ka_kb12.121216.16.42_kc_kd_ke_kf_la_lb_oa_os_ob_oc_od_oe_of_lc_m00_n00_s00_og_oh_oo_op_oq_or_om_on_ok_ol_oi_oj_ad0.0.0.0.0.0.0.0.0.0

5-stripped=47**aa19.81.1.28.60.19.80.1.28.61_ab_ac_ba50_bb62.1_bc738.500.8.0.1_bd62_be180_ca56.0.36.75.15.34.34.0.10_cb0_da1.0.0.100_db_dd10.3.0.9.17.50_dh1.30.50.50.0_di7_qa_qb_dc2.4.1.1.1_eh_ea27.121216.121216.121216.1.0_ec_ed0.50.1.1.121216.56_ef_eg_r0048.121216.121216.56.0.0.77.61.39.574.494.1_r0335.121216.121216.56.0.0.68.0.322.447.329.1_r0448.121216.121216.56.0.0.68.18.0.588.282.0_r0548.121216.121216.121216.0.0.32.29.359.596.306.0_r0657.121216.121216.121216.0.0.27.90.350.572.360.0_r0751.121216.121216.121216.0.0.3.11.360.526.321.0_r0949.121216.121216.56.0.0.48.49.0.604.541.1_r1045.121216.121216.56.0.0.52.50.132.636.494.0_fa4.76.87.73.32.65.56_fb7_fh1_fc0.FFDA00.55.0.FFDA00.55.37.61.61.37.48.50_fd1.0.34.121216.56_fe50.73_ff0000000000_fg0.52_pa0.0.0.0.40.50.85.85.0.0_t00_pb0.121216.352A4A.0_pc_pd_pe_ga0_gb1_gc44.0_ge0000000000_gh_gf_gg_gd10000000_ha89.89_hb50.1.7.99_hc3.80.34.3.80.34_hd39.1.80.70_ia_if_ib_id_ic_jc_ie_ja_jb_jd_je_jf_jg_ka_kb_kc_kd_ke_kf_la_lb_oa_os_ob_oc_od_oe_of_lc_m00_n00_s00_og_oh_oo_op_oq_or_om_on_ok_ol_oi_oj_ad0.0.0.0.0.0.0.0.0.0

7-finished=47**aa17.100.1.4.88.17.100.1.4.88_ab_ac_ba50_bb62.1_bc730.500.8.0.1_bd62_be180_ca56.0.36.75.15.34.34.0.10_cb0_da1.0.0.100_db_dd10.3.0.9.17.50_dh1.30.50.50.0_di7_qa_qb_dc889.3.1.1.1_eh_ea27.121216.121216.121216.1.0_ec_ed0.50.1.1.121216.56_ef_eg_r0048.121216.121216.56.0.0.77.61.39.574.494.1_r0335.121216.121216.56.0.0.68.0.322.447.329.1_r0448.121216.121216.56.0.0.68.18.0.588.282.0_r0548.121216.121216.121216.0.0.32.29.359.596.306.0_r0657.121216.121216.121216.0.0.27.90.350.572.360.0_r0751.121216.121216.121216.0.0.3.11.360.526.321.0_r0949.121216.121216.56.0.0.48.49.0.604.541.1_r1045.121216.121216.56.0.0.52.50.132.636.494.0_fa4.76.87.73.32.65.56_fb7_fh1_fc0.FFDA00.55.0.FFDA00.55.37.61.61.37.48.50_fd1.0.34.121216.56_fe50.73_ff0000000000_fg0.52_pa0.0.0.0.40.50.85.85.0.0_t00_pb0.121216.352A4A.0_pc_pd_pe_ga0_gb1_gc50.0_ge0000000000_gh_gf_gg_gd11110000_ha72.72_hb50.1.50.99_hc3.80.18.3.80.18_hd38.1.60.38_ia_if_ib_id_ic_jc_ie_ja_jb_jd_je_jf_jg_ka_kb_kc_kd_ke_kf_la_lb_oa_os_ob_oc_od_oe_of_lc_m00_n00_s00_og_oh_oo_op_oq_or_om_on_ok_ol_oi_oj_ad0.0.0.0.0.0.0.0.1.0
