
3-starting=47***aa11.61.1.47.34.11.61.1.47.35_ab_ac_ba50_bb62.1_bc185.200.0.0.1_bd62_be180_ca56.0.36.75.15.34.34.0.10_cb0_da1.0.0.100_db_dd0.3.0.9.17.50_dh1.30.50.50.0_di7_qa_qb_dc2735.3.1.1.1_eh_ea27.55.55.55.1.0_ec7.11.55.55.55.47.64.0_ed0.37.1.1.55.56_ef_eg_r00_fa4.76.87.73.32.65.56_fb7_fh1_fc0.FFDA00.55.0.FFDA00.55.37.61.61.37.48.50_fd1.0.36.55.56_fe50.73_ff0000000000_fg0.52_pa0.0.0.0.40.50.85.85.0.0_t00_pb0.54.54.0_pc_pd_pe_ga0_gb1_gc68.0_ge0000000000_gh_gf_gg_gd11000000_ha72.72_hb50.1.50.99_hc1.43.3.1.43.3_hd38.1.60.38_ia_if_ib_id_ic_jc_ie_ja_jb_jd_je_jf_jg_ka_kb_kc_kd_ke_kf_la_lb_oa_os_ob_oc_od_oe_of_lc_m00_n00_s00_og_oh_oo_op_oq_or_om_on_ok_ol_oi_oj_ad1.1.1.1.1.1.1.1.1.1*0*0*0*0*0*0*0*0#/]a00_b00_c00_d00_w00_x00_e00_y00_z00_ua1.55.0.0.100_uf0.3.0.0_ue_ub_u0_v0_uc7.0.30_ud7.8

3-starting=40**aa21.33.1.15.15.11.84.1.45.70_ab_ac_ba50_bb98.1_bc500.500.8.0.1_bd98_be180_ca66.0.17.63.18.48.47.28.98_cb0_daD4CBC2.0.0.100_db_dd9.1.74.3.0_dh9A938C.30.50.50.0_di6_qa_qb_dc0.1.D4CBC2.D4CBC2.D4CBC2_eh4.482B75_ea20.482B75.482B75.482B75.0.1_ec_ed_ef4.2.22.482B75.482B75.172343_eg4.2.22.482B75.482B75.172343_r0_fa6.40.100.71.22.49.56_fb_fh_fc1.482b75.55.1.482b75.55.36.61.61.36.50.50_fd1.0.10.482B75.56_fe60.79_ff0000000000_fg3.64_pa0.0.0.0.40.50.87.79.0.0_t014.58.61.0.10.12.180.500.364.0_t12.d4cbc2.D4CBC2.0.8.0.0.500.341.0_t22.58.58.0.5.0.180.500.336.0_t313.61.61.0.9.2.357.373.470.0_t413.61.61.0.9.2.3.626.470.0_t91.C60000.24.0.2.11.0.500.620.0_pb_pc_pd_pe_ga0_gb1_gc18.46_ge0000000000_gh_gf_gg_gd11000000_ha29.29_hb50.1.55.44_hc4.29.35.4.29.35_hd6.1.100.19_ia_if_ib_id_ic_jc_ie_ja_jb_jd_je_jf_jg_ka_kb_kc_kd_ke_kf_la_lb_oa_os_ob_oc_od_oe_of_lc_m0_n0_s0_og_oh_oo_op_oq_or_om_on_ok_ol_oi_oj_ad0.0.0.0.0.0.0.0.0.0
 
#Masturbating
 
4-heavy=40**aa21.33.1.14.15.11.84.1.45.70_ab_ac_ba50_bb98.1_bc500.500.8.0.1_bd98_be180_ca66.0.17.63.18.48.47.28.98_cb0_daD4CBC2.0.0.100_db_dd9.1.74.3.0_dh9A938C.30.50.50.0_di6_qa_qb_dc0.1.D4CBC2.D4CBC2.D4CBC2_eh4.482B75_ea20.482B75.482B75.482B75.0.1_ec_ed_ef4.2.22.482B75.482B75.172343_eg4.2.22.482B75.482B75.172343_r0_fa6.40.100.71.22.49.56_fb_fh_fc1.482b75.55.1.482b75.55.36.61.61.36.50.50_fd1.0.10.482B75.56_fe60.79_ff0000000000_fg3.64_pa0.0.0.0.40.50.87.79.0.0_t014.58.61.0.10.12.180.500.364.0_t12.d4cbc2.D4CBC2.0.8.0.0.500.341.0_t22.58.58.0.5.0.180.500.336.0_t313.61.61.0.9.2.357.373.470.0_t413.61.61.0.9.2.3.626.470.0_t91.C60000.24.0.2.11.0.500.620.0_pb_pc_pd_pe_ga0_gb1_gc94.0_ge0000000000_gh_gf_gg_gd11000000_ha0.0_hb50.1.55.44_hc2.31.35.2.31.35_hd8.1.100.19_ia_if_ib_id_ic_jc_ie_ja_jb_jd_je_jf_jg_ka_kb_kc_kd_ke_kf_la_lb_oa_os_ob_oc_od_oe_of_lc_m0_n0_s0_og_oh_oo_op_oq_or_om_on_ok_ol_oi_oj_ad0.0.0.0.0.0.0.0.0.0
4-finishing=40**aa21.0.1.0.100.11.84.1.45.70_ab_ac_ba50_bb98.1_bc500.500.8.0.1_bd98_be180_ca66.0.17.63.18.48.47.28.98_cb0_daD4CBC2.0.0.100_db_dd9.1.74.3.0_dh9A938C.30.50.50.0_di6_qa_qb_dc0.1.D4CBC2.D4CBC2.D4CBC2_eh4.482B75_ea20.482B75.482B75.482B75.0.1_ec_ed_ef4.2.22.482B75.482B75.172343_eg4.2.22.482B75.482B75.172343_r0_fa6.40.100.71.22.49.56_fb_fh_fc1.482b75.55.1.482b75.55.36.61.61.36.50.50_fd1.0.10.482B75.56_fe60.79_ff0000000000_fg3.64_pa0.0.0.0.40.50.87.79.0.0_t014.58.61.0.10.12.180.500.364.0_t12.d4cbc2.D4CBC2.0.8.0.0.500.341.0_t22.58.58.0.5.0.180.500.336.0_t313.61.61.0.9.2.357.373.470.0_t413.61.61.0.9.2.3.626.470.0_t91.C60000.24.0.2.11.0.500.620.0_pb_pc_pd_pe_ga0_gb1_gc80.0_ge0000000000_gh_gf_gg_gd11000000_ha0.0_hb50.1.55.44_hc0.3.35.0.3.35_hd22.1.100.40_ia_if_ib_id_ic_jc_ie_ja_jb_jd_je_jf_jg_ka_kb_kc_kd_ke_kf_la_lb_oa_os_ob_oc_od_oe_of_lc_m0_n0_s0_og_oh_oo_op_oq_or_om_on_ok_ol_oi_oj_ad0.0.0.0.0.0.0.0.0.0
4-calm=40**aa21.33.1.14.14.11.84.1.45.70_ab_ac_ba50_bb98.1_bc500.500.8.0.1_bd98_be180_ca66.0.17.63.18.48.47.28.98_cb0_daD4CBC2.0.0.100_db_dd9.1.74.3.0_dh9A938C.30.50.50.0_di6_qa_qb_dc0.1.D4CBC2.D4CBC2.D4CBC2_eh4.482B75_ea20.482B75.482B75.482B75.0.1_ec_ed_ef4.2.22.482B75.482B75.172343_eg4.2.22.482B75.482B75.172343_r0_fa6.40.100.71.22.49.56_fb_fh_fc1.482b75.55.1.482b75.55.36.61.61.36.50.50_fd1.0.10.482B75.56_fe60.79_ff0000000000_fg3.64_pa0.0.0.0.40.50.87.79.0.0_t014.58.61.0.10.12.180.500.364.0_t12.d4cbc2.D4CBC2.0.8.0.0.500.341.0_t22.58.58.0.5.0.180.500.336.0_t313.61.61.0.9.2.357.373.470.0_t413.61.61.0.9.2.3.626.470.0_t91.C60000.24.0.2.11.0.500.620.0_pb_pc_pd_pe_ga0_gb1_gc88.0_ge0000000000_gh_gf_gg_gd11000000_ha23.23_hb50.1.55.44_hc0.31.35.0.31.35_hd21.1.100.19_ia_if_ib_id_ic_jc_ie_ja_jb_jd_je_jf_jg_ka_kb_kc_kd_ke_kf_la_lb_oa_os_ob_oc_od_oe_of_lc_m0_n0_s0_og_oh_oo_op_oq_or_om_on_ok_ol_oi_oj_ad0.0.0.0.0.0.0.0.0.0
4-horny=40**aa21.80.1.14.14.11.84.1.45.70_ab_ac_ba50_bb98.1_bc500.500.8.0.1_bd98_be180_ca66.0.17.63.18.48.47.28.98_cb0_daD4CBC2.0.0.100_db_dd9.1.74.3.0_dh9A938C.30.50.50.0_di6_qa_qb_dc0.1.D4CBC2.D4CBC2.D4CBC2_eh4.482B75_ea20.482B75.482B75.482B75.0.1_ec_ed_ef4.2.22.482B75.482B75.172343_eg4.2.22.482B75.482B75.172343_r0_fa6.40.100.71.22.49.56_fb_fh_fc1.482b75.55.1.482b75.55.36.61.61.36.50.50_fd1.0.10.482B75.56_fe60.79_ff0000000000_fg3.64_pa0.0.0.0.40.50.87.79.0.0_t014.58.61.0.10.12.180.500.364.0_t12.d4cbc2.D4CBC2.0.8.0.0.500.341.0_t22.58.58.0.5.0.180.500.336.0_t313.61.61.0.9.2.357.373.470.0_t413.61.61.0.9.2.3.626.470.0_t91.C60000.24.0.2.11.0.500.620.0_pb_pc_pd_pe_ga0_gb1_gc88.0_ge0000000000_gh_gf_gg_gd11000000_ha71.71_hb50.1.55.44_hc0.31.35.0.31.35_hd24.1.78.19_ia_if_ib_id_ic_jc_ie_ja_jb_jd_je_jf_jg_ka_kb_kc_kd_ke_kf_la_lb_oa_os_ob_oc_od_oe_of_lc_m0_n0_s0_og_oh_oo_op_oq_or_om_on_ok_ol_oi_oj_ad0.0.0.0.0.0.0.0.0.0
4-interested=40**aa21.39.1.14.4.11.84.1.45.70_ab_ac_ba70_bb98.1_bc500.500.8.0.1_bd98_be180_ca66.0.17.63.18.48.47.28.98_cb0_daD4CBC2.0.0.100_db_dd9.1.74.3.0_dh9A938C.30.50.50.0_di6_qa_qb_dc0.1.D4CBC2.D4CBC2.D4CBC2_eh4.482B75_ea20.482B75.482B75.482B75.0.1_ec_ed_ef4.2.22.482B75.482B75.172343_eg4.2.22.482B75.482B75.172343_r0_fa6.40.100.71.22.49.56_fb_fh_fc1.482b75.55.1.482b75.55.36.61.61.36.50.50_fd1.0.10.482B75.56_fe60.79_ff0000000000_fg3.64_pa0.0.0.0.40.50.87.79.0.0_t014.58.61.0.10.12.180.500.364.0_t12.d4cbc2.D4CBC2.0.8.0.0.500.341.0_t22.58.58.0.5.0.180.500.336.0_t313.61.61.0.9.2.357.373.470.0_t413.61.61.0.9.2.3.626.470.0_t91.C60000.24.0.2.11.0.500.620.0_pb_pc_pd_pe_ga0_gb1_gc63.0_ge0000000000_gh_gf_gg_gd11000000_ha28.82_hb50.1.55.44_hc1.50.49.1.50.49_hd8.1.100.19_ia_if_ib_id_ic_jc_ie_ja_jb_jd_je_jf_jg_ka_kb_kc_kd_ke_kf_la_lb_oa_os_ob_oc_od_oe_of_lc_m0_n0_s0_og_oh_oo_op_oq_or_om_on_ok_ol_oi_oj_ad0.0.0.0.0.0.0.0.0.0
4-angry=40**aa6.7.1.0.80.6.7.1.0.80_ab_ac_ba50_bb98.1_bc500.500.8.0.1_bd98_be180_ca66.0.17.63.18.48.47.28.98_cb0_daD4CBC2.0.0.100_db_dd9.1.74.3.0_dh9A938C.30.50.50.0_di6_qa_qb_dc0.1.D4CBC2.D4CBC2.D4CBC2_eh4.482B75_ea20.482B75.482B75.482B75.0.1_ec_ed_ef4.2.22.482B75.482B75.172343_eg4.2.22.482B75.482B75.172343_r0_fa6.40.100.71.22.49.56_fb_fh_fc1.482b75.55.1.482b75.55.36.61.61.36.50.50_fd1.0.10.482B75.56_fe60.79_ff0000000000_fg3.64_pa0.0.0.0.40.50.87.79.0.0_t014.58.61.0.10.12.180.500.364.0_t12.d4cbc2.D4CBC2.0.8.0.0.500.341.0_t22.58.58.0.5.0.180.500.336.0_t313.61.61.0.9.2.357.373.470.0_t413.61.61.0.9.2.3.626.470.0_t91.C60000.24.0.2.11.0.500.620.0_pb_pc_pd_pe_ga0_gb1_gc62.40_ge0000000000_gh_gf_gg_gd11000000_ha56.56_hb50.1.55.44_hc3.19.49.3.19.49_hd26.1.80.19_ia_if_ib_id_ic_jc_ie_ja_jb_jd_je_jf_jg_ka_kb_kc_kd_ke_kf_la_lb_oa_os_ob_oc_od_oe_of_lc_m0_n0_s0_og_oh_oo_op_oq_or_om_on_ok_ol_oi_oj_ad0.0.0.0.0.0.0.0.0.0
4-happy=40**aa21.39.1.30.31.6.86.1.45.70_ab_ac_ba70_bb98.1_bc500.500.8.0.1_bd98_be180_ca66.0.17.63.18.48.47.28.98_cb0_daD4CBC2.0.0.100_db_dd9.1.74.3.0_dh9A938C.30.50.50.0_di6_qa_qb_dc0.1.D4CBC2.D4CBC2.D4CBC2_eh4.482B75_ea20.482B75.482B75.482B75.0.1_ec_ed_ef4.2.22.482B75.482B75.172343_eg4.2.22.482B75.482B75.172343_r0_fa6.40.100.71.22.49.56_fb_fh_fc1.482b75.55.1.482b75.55.36.61.61.36.50.50_fd1.0.10.482B75.56_fe60.79_ff0000000000_fg3.64_pa0.0.0.0.40.50.87.79.0.0_t014.58.61.0.10.12.180.500.364.0_t12.d4cbc2.D4CBC2.0.8.0.0.500.341.0_t22.58.58.0.5.0.180.500.336.0_t313.61.61.0.9.2.357.373.470.0_t413.61.61.0.9.2.3.626.470.0_t91.C60000.24.0.2.11.0.500.620.0_pb_pc_pd_pe_ga0_gb1_gc63.0_ge0000000000_gh_gf_gg_gd11000000_ha28.82_hb50.1.55.44_hc1.50.49.1.50.49_hd3.1.100.19_ia_if_ib_id_ic_jc_ie_ja_jb_jd_je_jf_jg_ka_kb_kc_kd_ke_kf_la_lb_oa_os_ob_oc_od_oe_of_lc_m0_n0_s0_og_oh_oo_op_oq_or_om_on_ok_ol_oi_oj_ad0.0.0.0.0.0.0.0.0.0
4-awkward=40**aa7.78.1.16.46.8.83.1.0.1008.1.16.46.8.83.1.0.100_ab_ac_ba49_bb98.1_bc500.500.8.0.1_bd98_be180_ca66.0.17.63.18.48.47.28.98_cb0_daD4CBC2.0.0.100_db_dd9.1.74.3.0_dh9A938C.30.50.50.0_di6_qa_qb_dc0.1.D4CBC2.D4CBC2.D4CBC2_eh4.482B75_ea20.482B75.482B75.482B75.0.1_ec_ed_ef4.2.22.482B75.482B75.172343_eg4.2.22.482B75.482B75.172343_r0_fa6.40.100.71.22.49.56_fb_fh_fc1.482b75.55.1.482b75.55.20.61.61.20.50.50_fd1.0.10.482B75.56_fe60.79_ff0000000000_fg3.64_pa0.0.0.0.40.50.87.79.0.0_t014.58.61.0.10.12.180.500.364.0_t12.d4cbc2.D4CBC2.0.8.0.0.500.341.0_t22.58.58.0.5.0.180.500.336.0_t313.61.61.0.9.2.357.373.470.0_t413.61.61.0.9.2.3.626.470.0_t91.C60000.24.0.2.11.0.500.620.0_pb_pc_pd_pe_ga0_gb1_gc60.0_ge0000000000_gh_gf_gg_gd11000000_ha53.53_hb100.1.17.44_hc0.39.26.0.39.26_hd8.1.80.19_ia_if_ib_id_ic_jc_ie_ja_jb_jd_je_jf_jg_ka_kb_kc_kd_ke_kf_la_lb_oa_os_ob_oc_od_oe_of_lc_m0_n0_s0_og_oh_oo_op_oq_or_om_on_ok_ol_oi_oj_ad0.0.0.0.0.0.0.0.0.0
4-shocked=40**aa30.82.1.27.37.30.82.1.27.37_ab_ac_ba26_bb98.1_bc500.500.8.0.1_bd98_be180_ca66.0.17.63.18.48.47.28.98_cb0_daD4CBC2.0.0.100_db_dd9.1.74.3.0_dh9A938C.30.50.50.0_di6_qa_qb_dc0.1.D4CBC2.D4CBC2.D4CBC2_eh4.482B75_ea20.482B75.482B75.482B75.0.1_ec_ed_ef4.2.22.482B75.482B75.172343_eg4.2.22.482B75.482B75.172343_r0_fa6.40.100.71.22.49.56_fb_fh_fc1.482b75.55.1.482b75.55.36.61.61.36.50.50_fd1.0.10.482B75.56_fe60.79_ff0000000000_fg3.64_pa0.0.0.0.40.50.87.79.0.0_t014.58.61.0.10.12.180.500.364.0_t12.d4cbc2.D4CBC2.0.8.0.0.500.341.0_t22.58.58.0.5.0.180.500.336.0_t313.61.61.0.9.2.357.373.470.0_t413.61.61.0.9.2.3.626.470.0_t91.C60000.24.0.2.11.0.500.620.0_pb_pc_pd_pe_ga0_gb1_gc28.0_ge0000000000_gh_gf_gg_gd11000000_ha60.84_hb50.1.55.44_hc0.49.15.2.46.50_hd33.1.90.38_ia_if_ib_id_ic_jc_ie_ja_jb_jd_je_jf_jg_ka_kb_kc_kd_ke_kf_la_lb_oa_os_ob_oc_od_oe_of_lc_m0_n0_s0_og_oh_oo_op_oq_or_om_on_ok_ol_oi_oj_ad0.0.0.0.0.0.0.0.0.0
4-sad=40**aa6.79.1.16.46.6.79.1.16.46_ab_ac_ba49_bb98.1_bc500.500.8.0.1_bd98_be180_ca66.0.17.63.18.48.47.28.98_cb0_daD4CBC2.0.0.100_db_dd9.1.74.3.0_dh9A938C.30.50.50.0_di6_qa_qb_dc0.1.D4CBC2.D4CBC2.D4CBC2_eh4.482B75_ea20.482B75.482B75.482B75.0.1_ec_ed_ef4.2.22.482B75.482B75.172343_eg4.2.22.482B75.482B75.172343_r0_fa6.40.100.71.22.49.56_fb_fh_fc1.482b75.55.1.482b75.55.36.61.61.36.50.50_fd1.0.10.482B75.56_fe60.79_ff0000000000_fg3.64_pa0.0.0.0.40.50.87.79.0.0_t014.58.61.0.10.12.180.500.364.0_t12.d4cbc2.D4CBC2.0.8.0.0.500.341.0_t22.58.58.0.5.0.180.500.336.0_t313.61.61.0.9.2.357.373.470.0_t413.61.61.0.9.2.3.626.470.0_t91.C60000.24.0.2.11.0.500.620.0_pb_pc_pd_pe_ga0_gb1_gc46.60_ge0000000000_gh_gf_gg_gd11000000_ha22.22_hb50.1.55.44_hc4.39.26.4.39.26_hd5.1.80.19_ia_if_ib_id_ic_jc_ie_ja_jb_jd_je_jf_jg_ka_kb_kc_kd_ke_kf_la_lb_oa_os_ob_oc_od_oe_of_lc_m0_n0_s0_og_oh_oo_op_oq_or_om_on_ok_ol_oi_oj_ad0.0.0.0.0.0.0.0.0.0
 
#Finished
 
5-sad=40**aa8.71.1.49.21.8.71.1.49.47_ab_ac_ba49_bb98.1_bc500.500.8.0.1_bd98_be180_ca66.0.17.63.18.48.47.28.98_cb0_daD4CBC2.0.0.100_db_dd9.1.74.3.0_dh9A938C.30.50.50.0_di6_qa_qb_dc0.1.D4CBC2.D4CBC2.D4CBC2_eh4.482B75_ea20.482B75.482B75.482B75.0.1_ec_ed_ef4.2.22.482B75.482B75.172343_eg4.2.22.482B75.482B75.172343_r0_fa6.40.100.71.22.49.56_fb_fh_fc1.482b75.55.1.482b75.55.36.61.61.36.50.50_fd1.0.10.482B75.56_fe60.79_ff0000000000_fg3.64_pa0.0.0.0.40.50.87.79.0.0_t014.58.61.0.10.12.180.500.364.0_t12.d4cbc2.D4CBC2.0.8.0.0.500.341.0_t22.58.58.0.5.0.180.500.336.0_t313.61.61.0.9.2.357.373.470.0_t413.61.61.0.9.2.3.626.470.0_t91.C60000.24.0.2.11.0.500.620.0_pb_pc_pd_pe_ga0_gb1_gc0.30_ge0000000000_gh_gf_gg_gd11000000_ha57.57_hb50.1.55.44_hc4.38.55.4.38.55_hd11.1.78.19_ia_if_ib_id_ic_jc_ie_ja_jb_jd_je_jf_jg_ka_kb_kc_kd_ke_kf_la_lb_oa_os_ob_oc_od_oe_of_lc_m0_n0_s0_og_oh_oo_op_oq_or_om_on_ok_ol_oi_oj_ad0.0.0.0.0.0.0.0.0.0
5-calm=40**aa8.71.1.49.21.8.71.1.49.47_ab_ac_ba49_bb98.1_bc500.500.8.0.1_bd98_be180_ca66.0.17.63.18.48.47.28.98_cb0_daD4CBC2.0.0.100_db_dd9.1.74.3.0_dh9A938C.30.50.50.0_di6_qa_qb_dc0.1.D4CBC2.D4CBC2.D4CBC2_eh4.482B75_ea20.482B75.482B75.482B75.0.1_ec_ed_ef4.2.22.482B75.482B75.172343_eg4.2.22.482B75.482B75.172343_r0_fa6.40.100.71.22.49.56_fb_fh_fc1.482b75.55.1.482b75.55.36.61.61.36.50.50_fd1.0.10.482B75.56_fe60.79_ff0000000000_fg3.64_pa0.0.0.0.40.50.87.79.0.0_t014.58.61.0.10.12.180.500.364.0_t12.d4cbc2.D4CBC2.0.8.0.0.500.341.0_t22.58.58.0.5.0.180.500.336.0_t313.61.61.0.9.2.357.373.470.0_t413.61.61.0.9.2.3.626.470.0_t91.C60000.24.0.2.11.0.500.620.0_pb_pc_pd_pe_ga0_gb1_gc0.0_ge0000000000_gh_gf_gg_gd11000000_ha57.57_hb100.1.80.44_hc0.38.27.0.38.27_hd26.1.78.10_ia_if_ib_id_ic_jc_ie_ja_jb_jd_je_jf_jg_ka_kb_kc_kd_ke_kf_la_lb_oa_os_ob_oc_od_oe_of_lc_m0_n0_s0_og_oh_oo_op_oq_or_om_on_ok_ol_oi_oj_ad0.0.0.0.0.0.0.0.0.0
5-horny=40**aa21.80.1.14.14.11.84.1.45.70_ab_ac_ba50_bb98.1_bc500.500.8.0.1_bd98_be180_ca66.0.17.63.18.48.47.28.98_cb0_daD4CBC2.0.0.100_db_dd9.1.74.3.0_dh9A938C.30.50.50.0_di6_qa_qb_dc0.1.D4CBC2.D4CBC2.D4CBC2_eh4.482B75_ea20.482B75.482B75.482B75.0.1_ec_ed_ef4.2.22.482B75.482B75.172343_eg4.2.22.482B75.482B75.172343_r0_fa6.40.100.71.22.49.56_fb_fh_fc1.482b75.55.1.482b75.55.36.61.61.36.50.50_fd1.0.10.482B75.56_fe60.79_ff0000000000_fg3.64_pa0.0.0.0.40.50.87.79.0.0_t014.58.61.0.10.12.180.500.364.0_t12.d4cbc2.D4CBC2.0.8.0.0.500.341.0_t22.58.58.0.5.0.180.500.336.0_t313.61.61.0.9.2.357.373.470.0_t413.61.61.0.9.2.3.626.470.0_t91.C60000.24.0.2.11.0.500.620.0_pb_pc_pd_pe_ga0_gb1_gc88.0_ge0000000000_gh_gf_gg_gd11000000_ha71.71_hb50.1.55.44_hc0.31.35.0.31.35_hd24.1.78.19_ia_if_ib_id_ic_jc_ie_ja_jb_jd_je_jf_jg_ka_kb_kc_kd_ke_kf_la_lb_oa_os_ob_oc_od_oe_of_lc_m0_n0_s0_og_oh_oo_op_oq_or_om_on_ok_ol_oi_oj_ad0.0.0.0.0.0.0.0.0.0
5-happy=40**aa21.39.1.30.31.6.71.1.17.23_ab_ac_ba70_bb98.1_bc500.500.8.0.1_bd98_be180_ca66.0.17.63.18.48.47.28.98_cb0_daD4CBC2.0.0.100_db_dd9.1.74.3.0_dh9A938C.30.50.50.0_di6_qa_qb_dc0.1.D4CBC2.D4CBC2.D4CBC2_eh4.482B75_ea20.482B75.482B75.482B75.0.1_ec_ed_ef4.2.22.482B75.482B75.172343_eg4.2.22.482B75.482B75.172343_r0_fa6.40.100.71.22.49.56_fb_fh_fc1.482b75.55.1.482b75.55.36.61.61.36.50.50_fd1.0.10.482B75.56_fe60.79_ff0000000000_fg3.64_pa0.0.0.0.40.50.87.79.0.0_t014.58.61.0.10.12.180.500.364.0_t12.d4cbc2.D4CBC2.0.8.0.0.500.341.0_t22.58.58.0.5.0.180.500.336.0_t313.61.61.0.9.2.357.373.470.0_t413.61.61.0.9.2.3.626.470.0_t91.C60000.24.0.2.11.0.500.620.0_pb_pc_pd_pe_ga0_gb1_gc63.0_ge0000000000_gh_gf_gg_gd11000000_ha28.82_hb50.1.55.44_hc1.50.49.1.50.49_hd3.1.100.19_ia_if_ib_id_ic_jc_ie_ja_jb_jd_je_jf_jg_ka_kb_kc_kd_ke_kf_la_lb_oa_os_ob_oc_od_oe_of_lc_m0_n0_s0_og_oh_oo_op_oq_or_om_on_ok_ol_oi_oj_ad0.0.0.0.0.0.0.0.0.0
5-awkward=40**aa7.79.1.16.38.7.79.1.49.21_ab_ac_ba49_bb98.1_bc500.500.8.0.1_bd98_be180_ca66.0.17.63.18.48.47.28.98_cb0_daD4CBC2.0.0.100_db_dd9.1.74.3.0_dh9A938C.30.50.50.0_di6_qa_qb_dc0.1.D4CBC2.D4CBC2.D4CBC2_eh4.482B75_ea20.482B75.482B75.482B75.0.1_ec_ed_ef4.2.22.482B75.482B75.172343_eg4.2.22.482B75.482B75.172343_r0_fa6.40.100.71.22.49.56_fb_fh_fc1.482b75.55.1.482b75.55.20.61.61.20.50.50_fd1.0.10.482B75.56_fe60.79_ff0000000000_fg3.64_pa0.0.0.0.40.50.87.79.0.0_t014.58.61.0.10.12.180.500.364.0_t12.d4cbc2.D4CBC2.0.8.0.0.500.341.0_t22.58.58.0.5.0.180.500.336.0_t313.61.61.0.9.2.357.373.470.0_t413.61.61.0.9.2.3.626.470.0_t91.C60000.24.0.2.11.0.500.620.0_pb_pc_pd_pe_ga0_gb1_gc60.0_ge0000000000_gh_gf_gg_gd11000000_ha53.53_hb100.1.17.44_hc0.39.26.0.39.26_hd8.1.80.19_ia_if_ib_id_ic_jc_ie_ja_jb_jd_je_jf_jg_ka_kb_kc_kd_ke_kf_la_lb_oa_os_ob_oc_od_oe_of_lc_m0_n0_s0_og_oh_oo_op_oq_or_om_on_ok_ol_oi_oj_ad0.0.0.0.0.0.0.0.0.0
5-angry=40**aa6.7.1.0.80.6.7.1.0.80_ab_ac_ba50_bb98.1_bc500.500.8.0.1_bd98_be180_ca66.0.17.63.18.48.47.28.98_cb0_daD4CBC2.0.0.100_db_dd9.1.74.3.0_dh9A938C.30.50.50.0_di6_qa_qb_dc0.1.D4CBC2.D4CBC2.D4CBC2_eh4.482B75_ea20.482B75.482B75.482B75.0.1_ec_ed_ef4.2.22.482B75.482B75.172343_eg4.2.22.482B75.482B75.172343_r0_fa6.40.100.71.22.49.56_fb_fh_fc1.482b75.55.1.482b75.55.36.61.61.36.50.50_fd1.0.10.482B75.56_fe60.79_ff0000000000_fg3.64_pa0.0.0.0.40.50.87.79.0.0_t014.58.61.0.10.12.180.500.364.0_t12.d4cbc2.D4CBC2.0.8.0.0.500.341.0_t22.58.58.0.5.0.180.500.336.0_t313.61.61.0.9.2.357.373.470.0_t413.61.61.0.9.2.3.626.470.0_t91.C60000.24.0.2.11.0.500.620.0_pb_pc_pd_pe_ga0_gb1_gc62.40_ge0000000000_gh_gf_gg_gd11000000_ha56.56_hb50.1.55.44_hc3.19.49.3.19.49_hd26.1.80.19_ia_if_ib_id_ic_jc_ie_ja_jb_jd_je_jf_jg_ka_kb_kc_kd_ke_kf_la_lb_oa_os_ob_oc_od_oe_of_lc_m0_n0_s0_og_oh_oo_op_oq_or_om_on_ok_ol_oi_oj_ad0.0.0.0.0.0.0.0.0.0
5-interested=40**aa47.62.1.49.60.6.85.1.45.70_ab_ac_ba70_bb98.1_bc500.500.8.0.1_bd98_be180_ca66.0.17.63.18.48.47.28.98_cb0_daD4CBC2.0.0.100_db_dd9.1.74.3.0_dh9A938C.30.50.50.0_di6_qa_qb_dc0.1.D4CBC2.D4CBC2.D4CBC2_eh4.482B75_ea20.482B75.482B75.482B75.0.1_ec_ed_ef4.2.22.482B75.482B75.172343_eg4.2.22.482B75.482B75.172343_r0_fa6.40.100.71.22.49.56_fb_fh_fc1.482b75.55.1.482b75.55.36.61.61.36.50.50_fd1.0.10.482B75.56_fe60.79_ff0000000000_fg3.64_pa0.0.0.0.40.50.87.79.0.0_t014.58.61.0.10.12.180.500.364.0_t12.d4cbc2.D4CBC2.0.8.0.0.500.341.0_t22.58.58.0.5.0.180.500.336.0_t313.61.61.0.9.2.357.373.470.0_t413.61.61.0.9.2.3.626.470.0_t91.C60000.24.0.2.11.0.500.620.0_pb_pc_pd_pe_ga0_gb1_gc63.0_ge0000000000_gh_gf_gg_gd11000000_ha75.75_hb50.1.55.44_hc1.50.49.1.50.49_hd1.1.100.19_ia_if_ib_id_ic_jc_ie_ja_jb_jd_je_jf_jg_ka_kb_kc_kd_ke_kf_la_lb_oa_os_ob_oc_od_oe_of_lc_m0_n0_s0_og_oh_oo_op_oq_or_om_on_ok_ol_oi_oj_ad0.0.0.0.0.0.0.0.0.0
5-shocked=40**aa30.82.1.27.37.30.82.1.27.37_ab_ac_ba26_bb98.1_bc500.500.8.0.1_bd98_be180_ca66.0.17.63.18.48.47.28.98_cb0_daD4CBC2.0.0.100_db_dd9.1.74.3.0_dh9A938C.30.50.50.0_di6_qa_qb_dc0.1.D4CBC2.D4CBC2.D4CBC2_eh4.482B75_ea20.482B75.482B75.482B75.0.1_ec_ed_ef4.2.22.482B75.482B75.172343_eg4.2.22.482B75.482B75.172343_r0_fa6.40.100.71.22.49.56_fb_fh_fc1.482b75.55.1.482b75.55.36.61.61.36.50.50_fd1.0.10.482B75.56_fe60.79_ff0000000000_fg3.64_pa0.0.0.0.40.50.87.79.0.0_t014.58.61.0.10.12.180.500.364.0_t12.d4cbc2.D4CBC2.0.8.0.0.500.341.0_t22.58.58.0.5.0.180.500.336.0_t313.61.61.0.9.2.357.373.470.0_t413.61.61.0.9.2.3.626.470.0_t91.C60000.24.0.2.11.0.500.620.0_pb_pc_pd_pe_ga0_gb1_gc28.0_ge0000000000_gh_gf_gg_gd11000000_ha60.84_hb50.1.55.44_hc0.49.15.2.46.50_hd33.1.90.38_ia_if_ib_id_ic_jc_ie_ja_jb_jd_je_jf_jg_ka_kb_kc_kd_ke_kf_la_lb_oa_os_ob_oc_od_oe_of_lc_m0_n0_s0_og_oh_oo_op_oq_or_om_on_ok_ol_oi_oj_ad0.0.0.0.0.0.0.0.0.0
 
0-angry=47***aa15.98.0.0.72.19.53.1.16.56_ab57.4.3.43_ac_ba48_bb4.1_bc217.500.0.0.1_bd4_be180_ca54.2.42.75.56.40.34.0.10_cb0_da1.0.0.100_db_dd0.3.34.50.14.50_dh1.30.50.50.0_di7_qa_qb_dc0.1.1.1.1_eh1.35_ea21.35.35.56.0.0_ec5.32.35.35.56.38.66.0_ed29.16.1.0.35.56_ef_eg_r00_fa0.70.60.52.12.42.56_fb9_fh_fc2.26.55.2.26.55.34.61.61.34.50.50_fd7.0.15.29.55_fe86.57_ff0000000000_fg4.49_pa0.0.0.0.40.50.85.85.0.0_t00_pb_pc_pd_pe_ga0_gb1_gc72.0_ge0000000000_gh_gf_gg_gd10000000_ha89.89_hb50.1.50.100_hc0.68.70.0.68.70_hd25.1.43.26_ia_if7.4.2.0.1.8.0.0.8.0.0.0.0.3_ib_id0.2.2.2.0.0.1.5.0.0.5.0.0.2_ic24.51.7296E4.AD1F4D.0_jc_ie_ja4.59.2.0_jb4.59.2.0_jd7.3.50.50_je7.3.44.60_jf_jg_ka5.1.1.1.0_kb5.1.1.1_kc_kd_ke_kf_la_lb_oa_os_ob_oc_od_oe_of_lc_m00_n00_s00_og_oh_oo_op_oq_or_om_on_ok_ol_oi_oj_ad0.0.0.0.0.0.0.0.0.0*0*0*0*0*0*0*0*0#/]a00_b00_c00_d00_w00_x00_e00_y00_z00_ua1.0.0.0.100_uf0.3.0.0_ue_ub_u0_v0_uc7.0.30_ud7.8
crop_pixels=0,0,800,1400
0-angry=47**aa11.18.1.3.100.11.18.1.3.100_ab_ac_ba50_bb6.1_bc150.500.8.0.1_bd6_be180_ca66.0.17.63.18.48.47.28.98_cb0_daD4CBC2.0.0.100_db_dd9.1.74.3.0.50_dh9A938C.30.50.50.0_di6_qa_qb_dc0.1.D4CBC2.D4CBC2.D4CBC2_eh4.56_ea10.56.56.56.0.1_ec_ed_ef_eg_r0038.172d90.172D90.172D90.0.0.82.69.354.543.269.1_r0138.172d90.172D90.172D90.0.0.100.66.3.448.229.1_r023.172d90.172D90.17.0.2.62.49.303.419.354.0_r0341.172d90.172D90.172D90.0.0.100.42.14.493.0.1_r0426.56.56.56.0.0.56.87.0.476.493.0_r057.172d90.172D90.172D90.0.2.28.0.54.470.648.0_r063.172d90.172D90.172D90.0.2.26.0.152.599.618.0_r073.172d90.172D90.172D90.0.2.14.26.16.386.566.0_r083.172d90.172D90.172D90.0.2.44.58.351.370.450.0_r093.172d90.172D90.172D90.0.2.16.8.109.448.648.0_fa6.40.100.71.22.49.56_fb_fh_fc1.482b75.55.1.482b75.55.36.61.61.36.50.100_fd1.0.10.56.56_fe60.79_ff0000000000_fg3.64_pa_t002.61.61.0.100.68.180.500.650.0_t0113.61.D4CBC2.0.48.57.201.320.453.0_t0213.61.58.0.49.57.159.690.453.0_t043.61.D4CBC2.0.100.30.0.500.517.0_t0513.57.61.0.44.46.249.266.358.0_t0613.57.D4CBC2.0.44.46.111.744.358.0_t072.58.58.0.5.0.180.500.336.0_t082.d4cbc2.D4CBC2.0.8.0.0.500.341.0_t0914.58.61.0.10.12.180.500.364.0_pb_pc_pd_pe_ga0_gb1_gc0.0_ge0000000000_gh_gf_gg_gd11000000_ha76.76_hb50.1.26.44_hc0.29.19.0.29.19_hd6.1.80.19_ia_if_ib_id_ic_jc_ie_ja_jb_jd3.172d90.172D90.60_je3.172d90.172D90.60_jf_jg_ka24.1D1D40.0.0.0_kb_kc_kd_ke_kf_la_lb_oa_os_ob_oc_od11.172D90.172D90.0.1_oe_of_lc_m0052.172d90.172D90.0.0.2.67.55.15.73.2.172d90_n00_s00_og_oh_oo_op_oq_or_om_on_ok_ol_oi_oj_ad0.0.0.0.0.0.0.0.0.0

1-angry=47**aa11.18.1.3.100.11.18.1.3.100_ab_ac_ba50_bb6.1_bc150.500.8.0.1_bd6_be180_ca66.0.17.63.18.48.47.28.98_cb0_daD4CBC2.0.0.100_db_dd9.1.74.3.0.50_dh9A938C.30.50.50.0_di6_qa_qb_dc0.1.D4CBC2.D4CBC2.D4CBC2_eh4.56_ea10.56.56.56.0.1_ec_ed_ef_eg_r0038.172d90.172D90.172D90.0.0.82.69.354.543.269.1_r0138.172d90.172D90.172D90.0.0.100.66.3.448.229.1_r023.172d90.172D90.17.0.2.62.49.303.419.354.0_r0341.172d90.172D90.172D90.0.0.100.42.14.493.0.1_r0426.56.56.56.0.0.56.87.0.476.493.0_r057.172d90.172D90.172D90.0.2.28.0.54.470.648.0_r063.172d90.172D90.172D90.0.2.26.0.152.599.618.0_r073.172d90.172D90.172D90.0.2.14.26.16.386.566.0_r083.172d90.172D90.172D90.0.2.44.58.351.370.450.0_r093.172d90.172D90.172D90.0.2.16.8.109.448.648.0_fa6.40.100.71.22.49.56_fb_fh_fc1.482b75.55.1.482b75.55.36.61.61.36.50.100_fd1.0.10.56.56_fe60.79_ff0000000000_fg3.64_pa_t002.61.61.0.100.68.180.500.650.0_t0113.61.D4CBC2.0.48.57.201.320.453.0_t0213.61.58.0.49.57.159.690.453.0_t043.61.D4CBC2.0.100.30.0.500.517.0_t0513.57.61.0.44.46.249.266.358.0_t0613.57.D4CBC2.0.44.46.111.744.358.0_t072.58.58.0.5.0.180.500.336.0_t082.d4cbc2.D4CBC2.0.8.0.0.500.341.0_t0914.58.61.0.10.12.180.500.364.0_pb_pc_pd_pe_ga0_gb1_gc0.0_ge0000000000_gh_gf_gg_gd11000000_ha76.76_hb50.1.26.44_hc0.29.19.0.29.19_hd6.1.80.19_ia_if_ib_id_ic_jc_ie_ja_jb_jd_je_jf_jg_ka24.1D1D40.0.0.0_kb_kc_kd_ke_kf_la_lb_oa_os_ob_oc_od11.172D90.172D90.0.1_oe_of_lc_m0052.172d90.172D90.0.0.2.67.55.15.73.2.172d90_n00_s00_og_oh_oo_op_oq_or_om_on_ok_ol_oi_oj_ad0.0.0.0.0.0.0.0.0.0

2-horny=47**aa9.88.1.49.51.8.15.1.4.75_ab_ac_ba33_bb46.1_bc150.500.8.0.1_bd46_be180_ca66.0.17.63.18.48.47.28.98_cb0_daD4CBC2.0.0.100_db_dd9.1.74.3.0.50_dh9A938C.30.50.50.0_di6_qa_qb_dc0.1.D4CBC2.D4CBC2.D4CBC2_eh4.482B75_ea20.482B75.482B75.482B75.0.1_ec_ed_ef4.2.22.482B75.482B75.172343_eg4.2.22.482B75.482B75.172343_r00_fa6.40.100.71.22.49.56_fb_fh_fc1.482b75.55.1.482b75.55.36.61.61.36.50.50_fd1.0.10.482B75.56_fe60.79_ff0000000000_fg3.64_pa0.0.0.0.40.50.87.79.0.0_t001.C60000.24.0.2.11.0.500.620.0_t0113.61.D4CBC2.0.9.2.3.626.470.0_t0213.61.58.0.9.2.357.373.470.0_t032.58.58.0.5.0.180.500.336.0_t042.d4cbc2.D4CBC2.0.8.0.0.500.341.0_t0914.58.61.0.10.12.180.500.364.0_pb_pc_pd_pe_ga0_gb1_gc31.0_ge0000000000_gh_gf_gg_gd11000000_ha79.79_hb48.1.55.44_hc0.59.32.0.59.32_hd31.1.80.19_ia_if_ib_id_ic_jc_ie_ja_jb_jd_je_jf_jg_ka24.1D1D40.42.42.0_kb_kc_kd_ke_kf_la_lb_oa_os_ob_oc_od_oe_of_lc_m00_n00_s00_og_oh_oo_op_oq_or_om_on_ok_ol_oi_oj_ad0.0.0.0.0.0.0.0.0.0

5-finished=47***aa19.0.1.0.50.6.100.0.0.50_ab_ac_ba50_bb98.1_bc217.200.0.0.1_bd17_be180_ca70.0.46.62.18.32.34.0.0_cb0_da1.0.0.100_db_dd0.1.34.50.50.50_dh4.30.50.57.4_di7_qa_qb_dc0.1.1.1.1_eh4.40_ea24.40.40.56.0.0_ec_ed0.16.1.1.40.56_ef0.0.50.40.40.56_eg0.0.50.40.40.56_r00_fa2.50.57.12.64.65.56_fb7_fh2_fc0.19.55.0.19.55.44.61.61.50.50.50_fd1.1.41.40.56_fe50.61_ff0000000000_fg0.50_pa0.0.0.0.40.50.85.85.0.0_t00_pb_pc_pd_pe_ga0_gb1_gc0.0_ge0000000000_gh_gf_gg_gd10000000_ha89.89_hb49.1.44.99_hc0.59.39.0.59.39_hd0.1.49.49_ia_if_ib7.44.49.60.0.0.0.1.1.0.0.1.0.0.15_id_ic_jc_ie4.56.56.0.2.60.60.0.2.60.60.0.0_ja13.60.2.0_jb13.60.2.0_jd_je14.55.44.60_jf_jg_ka0.43.43.0.0_kb_kc_kd_ke_kf_la18.67CD5F.55.0.1_lb_oa_os_ob_oc_od_oe_of_lc_m013.4EBA43.3.0.2.0.44.0.0.79.3.61_n00_s003.34.34.34.0.38.0.573.534.3.0.0.38.4.61_og_oh_oo_op_oq_or_om_on_ok_ol_oi7.55.60.34.0_oj7.55.60.34.0_ad0.0.0.0.0.0.0.0.0.0*0*0*0*0*0*0*0*0#/]a00_b00_c00_d00_w00_x00_e00_y00_z00_ua1.0.0.0.100_uf0.3.0.0_ue_ub_u0_v0_uc7.0.30_ud7.8
5-finished=40**aa21.100.1.0.87.21.100.1.0.87_ab_ac_ba49_bb66.1_bc500.500.8.0.1_bd66_be180_ca66.0.17.63.18.48.47.28.98_cb0_daD4CBC2.0.0.100_db_dd9.1.74.3.0_dh9A938C.30.50.50.0_di6_qa_qb_dc0.1.D4CBC2.D4CBC2.D4CBC2_eh4.482B75_ea20.482B75.482B75.482B75.0.1_ec_ed_ef4.2.22.482B75.482B75.172343_eg4.2.22.482B75.482B75.172343_r0_fa6.40.100.71.22.49.56_fb_fh_fc1.482b75.55.1.482b75.55.36.61.61.36.50.50_fd1.0.10.482B75.56_fe60.79_ff0000000000_fg3.64_pa0.0.0.0.40.50.87.79.0.0_t014.58.61.0.10.12.180.500.364.0_t12.d4cbc2.D4CBC2.0.8.0.0.500.341.0_t22.58.58.0.5.0.180.500.336.0_t313.61.61.0.9.2.357.373.470.0_t413.61.61.0.9.2.3.626.470.0_t91.C60000.24.0.2.11.0.500.620.0_pb_pc_pd_pe_ga0_gb1_gc88.0_ge0000000000_gh_gf_gg_gd11000000_ha71.71_hb50.1.55.44_hc0.31.35.0.31.35_hd24.1.78.19_ia_if_ib_id_ic_jc_ie_ja_jb_jd_je_jf_jg_ka_kb_kc_kd_ke_kf_la_lb_oa_os_ob_oc_od_oe_of_lc_m0_n0_s0_og_oh_oo_op_oq_or_om_on_ok_ol_oi_oj_ad0.0.0.0.0.0.0.0.0.0

