0-loss=47**aa11.89.1.42.54.11.89.1.4.70_ab_ac2.52.52.52_ba50_bb17.1_bc150.500.8.0.1_bd17_be180_ca61.0.40.61.14.8.34.0.9_cb0_da1.0.0.100_db_dd9.0.34.50.45.50_dh1.30.50.50.0_di6_qa_qb_dc0.1.1.1.1_eh4.A27241_ea26.A27241.A27241.56.0.0_ec10.28.A27241.A27241.56.45.60.1_ed28.50.1.1.A27241.56_ef_eg_r00_fa2.50.50.60.50.86.56_fb7_fh_fc0.9.55.0.9.55.50.61.61.50.50.50_fd1.0.19.A27241.56_fe58.61_ff0000000000_fg0.50_pa0.0.0.0.40.50.85.85.0.0_t00_pb_pc_pd_pe_ga0_gb1_gc0.0_ge0000000000_gh_gf_gg_gd10000000_ha61.61_hb49.1.3.99_hc0.65.39.0.65.39_hd21.1.49.49_ia_if_ib_id_ic3.6.55.6.0_jc_ie_ja_jb_jd3.6.6.50_je3.6.6.50_jf_jg_ka10.6.0.0.0_kb10.6.0.0_kc_kd_ke_kf_la_lb_oa_os_ob_oc_od_oe_of_lc_m00_n00_s00_og_oh_oo_op_oq_or_om_on_ok_ol_oi_oj_ad0.0.0.0.0.0.0.0.0.0
0-stunned=47**aa8.100.1.0.54.8.100.1.6.30_ab_ac2.52.52.52_ba50_bb17.1_bc237.500.8.0.1_bd17_be180_ca61.0.40.61.14.8.34.0.9_cb0_da1.0.0.100_db_dd9.0.34.50.45.50_dh1.30.50.50.0_di6_qa_qb_dc0.1.1.1.1_eh4.A27241_ea26.A27241.A27241.56.0.0_ec10.28.A27241.A27241.56.45.60.1_ed28.50.1.1.A27241.56_ef_eg_r00_fa2.50.50.60.50.59.56_fb7_fh_fc0.9.55.0.9.55.50.61.61.50.50.50_fd1.0.19.A27241.56_fe58.61_ff0000000000_fg0.50_pa0.0.0.0.40.50.85.85.0.0_t00_pb_pc_pd_pe_ga0_gb1_gc14.0_ge0000000000_gh_gf_gg_gd10000000_ha73.73_hb49.1.44.45_hc0.0.39.0.0.39_hd40.1.49.49_ia_if_ib_id_ic3.6.55.6.0_jc_ie_ja_jb_jd3.6.6.50_je3.6.6.50_jf_jg_ka10.6.18.18.0_kb10.6.18.18_kc_kd_ke_kf_la_lb_oa_os_ob_oc_od_oe_of_lc_m00_n00_s00_og_oh_oo_op_oq_or_om_on_ok_ol_oi_oj_ad0.0.0.0.0.0.0.0.0.0
0-excited=47**aa7.44.0.43.54.7.44.0.6.43_ab_ac2.52.52.52_ba50_bb17.1_bc325.500.8.0.1_bd17_be180_ca61.0.40.61.14.8.34.0.9_cb0_da1.0.0.100_db_dd0.0.34.50.45.50_dh1.30.50.50.0_di6_qa_qb_dc0.1.1.1.1_eh4.A27241_ea26.A27241.A27241.56.0.0_ec10.28.A27241.A27241.56.45.60.1_ed28.50.1.1.A27241.56_ef_eg_r00_fa2.50.50.60.50.99.56_fb7_fh_fc0.9.55.0.9.55.50.61.61.50.50.50_fd1.0.19.A27241.56_fe58.61_ff0000000000_fg0.50_pa0.0.0.0.40.50.85.85.0.0_t00_pb_pc_pd_pe_ga0_gb1_gc27.0_ge0000000000_gh_gf_gg_gd10000000_ha96.96_hb49.1.44.99_hc0.41.39.0.41.39_hd34.1.49.49_ia_if_ib_id_ic3.6.55.6.0_jc_ie_ja_jb_jd3.6.6.50_je3.6.6.50_jf_jg_ka10.6.43.0.0_kb10.6.43.0_kc_kd_ke_kf_la_lb_oa_os_ob_oc_od_oe_of_lc_m00_n00_s00_og_oh_oo_op_oq_or_om_on_ok_ol_oi_oj_ad0.0.0.0.0.0.0.0.0.0
0-angry=47**aa22.83.1.16.42.22.83.1.4.52_ab_ac2.52.52.52_ba50_bb17.1_bc412.500.8.0.1_bd17_be180_ca61.0.40.61.14.8.34.0.9_cb0_da1.0.0.100_db_dd9.0.34.50.45.50_dh1.30.50.50.0_di6_qa_qb_dc0.1.1.1.1_eh4.A27241_ea26.A27241.A27241.56.0.0_ec10.28.A27241.A27241.56.45.60.1_ed28.50.1.1.A27241.56_ef_eg_r00_fa6.50.50.60.50.31.56_fb6_fh_fc0.9.55.0.9.55.50.61.61.50.50.50_fd1.0.19.A27241.56_fe58.61_ff0000000000_fg0.50_pa0.0.0.0.40.50.85.85.0.0_t00_pb_pc_pd_pe_ga0_gb1_gc0.0_ge0000000000_gh_gf_gg_gd10000000_ha77.77_hb49.1.44.99_hc0.0.39.0.0.39_hd38.1.49.49_ia_if_ib_id_ic3.6.55.6.0_jc_ie_ja_jb_jd3.6.6.50_je3.6.6.50_jf_jg_ka10.6.0.0.0_kb10.6.0.0_kc_kd_ke_kf_la_lb_oa_os_ob_oc_od_oe_of_lc_m00_n00_s00_og_oh_oo_op_oq_or_om_on_ok_ol_oi_oj_ad0.0.0.0.0.0.0.0.0.0
0-shocked=47**aa65.38.1.27.41.75.36.1.4.60_ab_ac2.52.52.52_ba50_bb17.1_bc500.500.8.0.1_bd17_be180_ca61.0.40.61.14.8.34.0.9_cb0_da1.0.0.100_db_dd9.0.34.50.45.50_dh1.30.50.50.0_di6_qa_qb_dc0.1.1.1.1_eh4.A27241_ea26.A27241.A27241.56.0.0_ec10.28.A27241.A27241.56.45.60.1_ed28.50.1.1.A27241.56_ef_eg_r00_fa2.50.50.60.50.79.56_fb7_fh_fc0.9.55.0.9.55.50.61.61.50.50.50_fd1.0.19.A27241.56_fe58.61_ff0000000000_fg0.50_pa0.0.0.0.40.50.85.85.0.0_t00_pb_pc_pd_pe_ga0_gb1_gc14.0_ge0000000000_gh_gf_gg_gd10000000_ha88.88_hb49.1.44.99_hc0.59.39.0.59.39_hd41.1.49.49_ia_if_ib_id_ic3.6.55.6.0_jc_ie_ja_jb_jd3.6.6.50_je3.6.6.50_jf_jg_ka10.6.17.17.0_kb10.6.17.17_kc_kd_ke_kf_la_lb_oa_os_ob_oc_od_oe_of_lc_m00_n00_s00_og_oh_oo_op_oq_or_om_on_ok_ol_oi_oj_ad0.0.0.0.0.0.0.0.0.0
0-sad=47**aa13.97.0.42.54.13.97.0.4.70_ab_ac2.52.52.52_ba50_bb17.1_bc587.500.8.0.1_bd17_be180_ca61.0.40.61.14.8.34.0.9_cb0_da1.0.0.100_db_dd9.0.34.50.45.50_dh1.30.50.50.0_di6_qa_qb_dc0.1.1.1.1_eh4.A27241_ea26.A27241.A27241.56.0.0_ec10.28.A27241.A27241.56.45.60.1_ed28.50.1.1.A27241.56_ef_eg_r00_fa3.50.50.60.50.74.56_fb6_fh_fc0.9.55.0.9.55.50.61.61.50.50.50_fd1.0.19.A27241.56_fe58.61_ff0000000000_fg0.50_pa0.0.0.0.40.50.85.85.0.0_t00_pb_pc_pd_pe_ga0_gb1_gc0.0_ge0000000000_gh_gf_gg_gd10000000_ha59.59_hb49.1.20.99_hc0.61.39.0.61.39_hd8.1.49.49_ia_if_ib_id_ic3.6.55.6.0_jc_ie_ja_jb_jd3.6.6.50_je3.6.6.50_jf_jg_ka10.6.1.1.0_kb10.6.1.1_kc_kd_ke_kf_la_lb_oa_os_ob_oc_od_oe_of_lc_m00_n00_s00_og_oh_oo_op_oq_or_om_on_ok_ol_oi_oj_ad0.0.0.0.0.0.0.0.0.0
0-interested=47**aa26.63.0.16.58.24.63.1.0.64_ab_ac2.52.52.52_ba50_bb17.1_bc675.500.8.0.1_bd17_be180_ca61.0.40.61.14.8.34.0.9_cb0_da1.0.0.100_db_dd9.0.34.50.45.50_dh1.30.50.50.0_di6_qa_qb_dc0.1.1.1.1_eh4.A27241_ea26.A27241.A27241.56.0.0_ec10.28.A27241.A27241.56.45.60.1_ed28.50.1.1.A27241.56_ef_eg_r00_fa5.50.50.60.50.0.56_fb8_fh_fc0.9.55.0.9.55.50.61.61.50.50.50_fd1.0.19.A27241.56_fe58.61_ff0000000000_fg0.50_pa0.0.0.0.40.50.85.85.0.0_t00_pb_pc_pd_pe_ga0_gb1_gc14.0_ge0000000000_gh_gf_gg_gd10000000_ha84.84_hb49.1.44.99_hc0.39.39.0.39.39_hd1.1.49.49_ia_if_ib_id_ic3.6.55.6.0_jc_ie_ja_jb_jd3.6.6.50_je3.6.6.50_jf_jg_ka10.6.32.32.0_kb10.6.32.32_kc_kd_ke_kf_la_lb_oa_os_ob_oc_od_oe_of_lc_m00_n00_s00_og_oh_oo_op_oq_or_om_on_ok_ol_oi_oj_ad0.0.0.0.0.0.0.0.0.0
0-calm=47**aa11.98.0.42.54.11.98.0.4.70_ab_ac2.52.52.52_ba50_bb17.1_bc762.500.8.0.1_bd17_be180_ca61.0.40.61.14.8.34.0.9_cb0_da1.0.0.100_db_dd9.0.34.50.45.50_dh1.30.50.50.0_di6_qa_qb_dc0.1.1.1.1_eh4.A27241_ea26.A27241.A27241.56.0.0_ec10.28.A27241.A27241.56.45.60.1_ed28.50.1.1.A27241.56_ef_eg_r00_fa2.50.50.60.50.65.56_fb7_fh_fc0.9.55.0.9.55.50.61.61.50.50.50_fd1.0.19.A27241.56_fe58.61_ff0000000000_fg0.50_pa0.0.0.0.40.50.85.85.0.0_t00_pb_pc_pd_pe_ga0_gb1_gc0.0_ge0000000000_gh_gf_gg_gd10000000_ha70.70_hb49.1.44.99_hc0.65.39.0.65.39_hd0.1.49.49_ia_if_ib_id_ic3.6.55.6.0_jc_ie_ja_jb_jd3.6.6.50_je3.6.6.50_jf_jg_ka10.6.59.59.0_kb10.6.59.59_kc_kd_ke_kf_la_lb_oa_os_ob_oc_od_oe_of_lc_m00_n00_s00_og_oh_oo_op_oq_or_om_on_ok_ol_oi_oj_ad0.0.0.0.0.0.0.0.0.0
0-smug=47**aa20.72.0.42.49.20.72.0.4.49_ab_ac2.52.52.52_ba50_bb18.1_bc850.500.8.0.1_bd18_be180_ca61.0.40.61.14.8.34.0.9_cb0_da1.0.0.100_db_dd9.0.34.50.45.50_dh1.30.50.50.0_di6_qa_qb_dc0.1.1.1.1_eh4.A27241_ea26.A27241.A27241.56.0.0_ec10.28.A27241.A27241.56.45.60.1_ed28.50.1.1.A27241.56_ef_eg_r00_fa2.50.50.60.50.38.56_fb7_fh_fc0.9.55.0.9.55.50.61.61.50.50.50_fd1.0.19.A27241.56_fe58.61_ff0000000000_fg0.50_pa0.0.0.0.40.50.85.85.0.0_t00_pb_pc_pd_pe_ga0_gb1_gc0.0_ge0000000000_gh_gf_gg_gd10000000_ha63.63_hb49.1.44.99_hc0.35.39.0.35.39_hd2.1.49.49_ia_if_ib_id_ic3.6.55.6.0_jc_ie_ja_jb_jd3.6.6.50_je3.6.6.50_jf_jg_ka10.6.59.0.0_kb10.6.59.0_kc_kd_ke_kf_la_lb_oa_os_ob_oc_od_oe_of_lc_m00_n00_s00_og_oh_oo_op_oq_or_om_on_ok_ol_oi_oj_ad0.0.0.0.0.0.0.0.0.0
0-horny=47**aa10.58.0.42.75.10.58.0.4.75_ab_ac2.52.52.52_ba50_bb17.1_bc150.500.8.0.1_bd17_be180_ca61.0.40.61.14.8.34.0.9_cb0_da1.0.0.100_db_dd0.0.34.50.45.50_dh1.30.50.50.0_di6_qa_qb_dc0.1.1.1.1_eh4.A27241_ea26.A27241.A27241.56.0.0_ec10.28.A27241.A27241.56.45.60.1_ed28.50.1.1.A27241.56_ef_eg_r00_fa2.50.50.60.50.65.56_fb7_fh_fc0.9.55.0.9.55.50.61.61.50.50.50_fd1.0.19.A27241.56_fe58.61_ff0000000000_fg0.50_pa0.0.0.0.40.50.85.85.0.0_t00_pb_pc_pd_pe_ga0_gb1_gc27.0_ge0000000000_gh_gf_gg_gd10000000_ha87.87_hb49.1.44.99_hc0.59.39.0.59.39_hd27.1.49.49_ia_if_ib_id_ic3.6.55.6.0_jc_ie_ja_jb_jd3.6.6.50_je3.6.6.50_jf_jg_ka10.6.0.0.0_kb10.6.0.0_kc_kd_ke_kf_la_lb_oa_os_ob_oc_od_oe_of_lc_m00_n00_s00_og_oh_oo_op_oq_or_om_on_ok_ol_oi_oj_ad0.0.0.0.0.0.0.0.0.0
0-happy=47**aa12.42.0.42.54.12.42.0.4.70_ab_ac2.52.52.52_ba50_bb17.1_bc237.500.8.0.1_bd17_be180_ca61.0.40.61.14.8.34.0.9_cb0_da1.0.0.100_db_dd9.0.34.50.45.50_dh1.30.50.50.0_di6_qa_qb_dc0.1.1.1.1_eh4.A27241_ea26.A27241.A27241.56.0.0_ec10.28.A27241.A27241.56.45.60.1_ed28.50.1.1.A27241.56_ef_eg_r00_fa2.50.50.60.50.65.56_fb7_fh_fc0.9.55.0.9.55.50.61.61.50.50.50_fd1.0.19.A27241.56_fe58.61_ff0000000000_fg0.50_pa0.0.0.0.40.50.85.85.0.0_t00_pb_pc_pd_pe_ga0_gb1_gc0.0_ge0000000000_gh_gf_gg_gd10000000_ha75.75_hb49.1.44.99_hc0.59.39.0.59.39_hd1.1.49.49_ia_if_ib_id_ic3.6.55.6.0_jc_ie_ja_jb_jd3.6.6.50_je3.6.6.50_jf_jg_ka10.6.18.18.0_kb10.6.18.18_kc_kd_ke_kf_la_lb_oa_os_ob_oc_od_oe_of_lc_m00_n00_s00_og_oh_oo_op_oq_or_om_on_ok_ol_oi_oj_ad0.0.0.0.0.0.0.0.0.0


1-loss=47**aa11.89.1.42.54.11.89.1.4.70_ab_ac2.52.52.52_ba50_bb17.1_bc150.500.8.0.1_bd17_be180_ca61.0.40.61.14.8.34.0.9_cb0_da1.0.0.100_db_dd9.0.34.50.45.50_dh1.30.50.50.0_di6_qa_qb_dc0.1.1.1.1_eh4.A27241_ea26.A27241.A27241.56.0.0_ec10.28.A27241.A27241.56.45.60.1_ed28.50.1.1.A27241.56_ef_eg_r00_fa2.50.50.60.50.86.56_fb7_fh_fc0.9.55.0.9.55.50.61.61.50.50.50_fd1.0.19.A27241.56_fe58.61_ff0000000000_fg0.50_pa0.0.0.0.40.50.85.85.0.0_t00_pb_pc_pd_pe_ga0_gb1_gc0.0_ge0000000000_gh_gf_gg_gd10000000_ha61.61_hb49.1.3.99_hc0.65.39.0.65.39_hd21.1.49.49_ia_if_ib_id_ic3.6.55.6.0_jc_ie_ja_jb_jd_je_jf_jg_ka10.6.0.0.0_kb10.6.0.0_kc_kd_ke_kf_la_lb_oa_os_ob_oc_od_oe_of_lc_m00_n00_s00_og_oh_oo_op_oq_or_om_on_ok_ol_oi_oj_ad0.0.0.0.0.0.0.0.0.0
1-stunned=47**aa8.100.1.0.54.8.100.1.6.30_ab_ac2.52.52.52_ba50_bb17.1_bc237.500.8.0.1_bd17_be180_ca61.0.40.61.14.8.34.0.9_cb0_da1.0.0.100_db_dd9.0.34.50.45.50_dh1.30.50.50.0_di6_qa_qb_dc0.1.1.1.1_eh4.A27241_ea26.A27241.A27241.56.0.0_ec10.28.A27241.A27241.56.45.60.1_ed28.50.1.1.A27241.56_ef_eg_r00_fa2.50.50.60.50.59.56_fb7_fh_fc0.9.55.0.9.55.50.61.61.50.50.50_fd1.0.19.A27241.56_fe58.61_ff0000000000_fg0.50_pa0.0.0.0.40.50.85.85.0.0_t00_pb_pc_pd_pe_ga0_gb1_gc14.0_ge0000000000_gh_gf_gg_gd10000000_ha73.73_hb49.1.44.45_hc0.0.39.0.0.39_hd40.1.49.49_ia_if_ib_id_ic3.6.55.6.0_jc_ie_ja_jb_jd_je_jf_jg_ka10.6.18.18.0_kb10.6.18.18_kc_kd_ke_kf_la_lb_oa_os_ob_oc_od_oe_of_lc_m00_n00_s00_og_oh_oo_op_oq_or_om_on_ok_ol_oi_oj_ad0.0.0.0.0.0.0.0.0.0
1-excited=47**aa7.44.0.43.54.7.44.0.6.43_ab_ac2.52.52.52_ba50_bb17.1_bc325.500.8.0.1_bd17_be180_ca61.0.40.61.14.8.34.0.9_cb0_da1.0.0.100_db_dd0.0.34.50.45.50_dh1.30.50.50.0_di6_qa_qb_dc0.1.1.1.1_eh4.A27241_ea26.A27241.A27241.56.0.0_ec10.28.A27241.A27241.56.45.60.1_ed28.50.1.1.A27241.56_ef_eg_r00_fa2.50.50.60.50.99.56_fb7_fh_fc0.9.55.0.9.55.50.61.61.50.50.50_fd1.0.19.A27241.56_fe58.61_ff0000000000_fg0.50_pa0.0.0.0.40.50.85.85.0.0_t00_pb_pc_pd_pe_ga0_gb1_gc27.0_ge0000000000_gh_gf_gg_gd10000000_ha96.96_hb49.1.44.99_hc0.41.39.0.41.39_hd34.1.49.49_ia_if_ib_id_ic3.6.55.6.0_jc_ie_ja_jb_jd_je_jf_jg_ka10.6.43.0.0_kb10.6.43.0_kc_kd_ke_kf_la_lb_oa_os_ob_oc_od_oe_of_lc_m00_n00_s00_og_oh_oo_op_oq_or_om_on_ok_ol_oi_oj_ad0.0.0.0.0.0.0.0.0.0
1-angry=47**aa22.83.1.16.42.22.83.1.4.52_ab_ac2.52.52.52_ba50_bb17.1_bc412.500.8.0.1_bd17_be180_ca61.0.40.61.14.8.34.0.9_cb0_da1.0.0.100_db_dd9.0.34.50.45.50_dh1.30.50.50.0_di6_qa_qb_dc0.1.1.1.1_eh4.A27241_ea26.A27241.A27241.56.0.0_ec10.28.A27241.A27241.56.45.60.1_ed28.50.1.1.A27241.56_ef_eg_r00_fa6.50.50.60.50.31.56_fb6_fh_fc0.9.55.0.9.55.50.61.61.50.50.50_fd1.0.19.A27241.56_fe58.61_ff0000000000_fg0.50_pa0.0.0.0.40.50.85.85.0.0_t00_pb_pc_pd_pe_ga0_gb1_gc0.0_ge0000000000_gh_gf_gg_gd10000000_ha77.77_hb49.1.44.99_hc0.0.39.0.0.39_hd38.1.49.49_ia_if_ib_id_ic3.6.55.6.0_jc_ie_ja_jb_jd_je_jf_jg_ka10.6.0.0.0_kb10.6.0.0_kc_kd_ke_kf_la_lb_oa_os_ob_oc_od_oe_of_lc_m00_n00_s00_og_oh_oo_op_oq_or_om_on_ok_ol_oi_oj_ad0.0.0.0.0.0.0.0.0.0
1-shocked=47**aa65.38.1.27.41.75.36.1.4.60_ab_ac2.52.52.52_ba50_bb17.1_bc500.500.8.0.1_bd17_be180_ca61.0.40.61.14.8.34.0.9_cb0_da1.0.0.100_db_dd9.0.34.50.45.50_dh1.30.50.50.0_di6_qa_qb_dc0.1.1.1.1_eh4.A27241_ea26.A27241.A27241.56.0.0_ec10.28.A27241.A27241.56.45.60.1_ed28.50.1.1.A27241.56_ef_eg_r00_fa2.50.50.60.50.79.56_fb7_fh_fc0.9.55.0.9.55.50.61.61.50.50.50_fd1.0.19.A27241.56_fe58.61_ff0000000000_fg0.50_pa0.0.0.0.40.50.85.85.0.0_t00_pb_pc_pd_pe_ga0_gb1_gc14.0_ge0000000000_gh_gf_gg_gd10000000_ha88.88_hb49.1.44.99_hc0.59.39.0.59.39_hd41.1.49.49_ia_if_ib_id_ic3.6.55.6.0_jc_ie_ja_jb_jd_je_jf_jg_ka10.6.17.17.0_kb10.6.17.17_kc_kd_ke_kf_la_lb_oa_os_ob_oc_od_oe_of_lc_m00_n00_s00_og_oh_oo_op_oq_or_om_on_ok_ol_oi_oj_ad0.0.0.0.0.0.0.0.0.0
1-sad=47**aa13.97.0.42.54.13.97.0.4.70_ab_ac2.52.52.52_ba50_bb17.1_bc587.500.8.0.1_bd17_be180_ca61.0.40.61.14.8.34.0.9_cb0_da1.0.0.100_db_dd9.0.34.50.45.50_dh1.30.50.50.0_di6_qa_qb_dc0.1.1.1.1_eh4.A27241_ea26.A27241.A27241.56.0.0_ec10.28.A27241.A27241.56.45.60.1_ed28.50.1.1.A27241.56_ef_eg_r00_fa3.50.50.60.50.74.56_fb6_fh_fc0.9.55.0.9.55.50.61.61.50.50.50_fd1.0.19.A27241.56_fe58.61_ff0000000000_fg0.50_pa0.0.0.0.40.50.85.85.0.0_t00_pb_pc_pd_pe_ga0_gb1_gc0.0_ge0000000000_gh_gf_gg_gd10000000_ha59.59_hb49.1.20.99_hc0.61.39.0.61.39_hd8.1.49.49_ia_if_ib_id_ic3.6.55.6.0_jc_ie_ja_jb_jd_je_jf_jg_ka10.6.1.1.0_kb10.6.1.1_kc_kd_ke_kf_la_lb_oa_os_ob_oc_od_oe_of_lc_m00_n00_s00_og_oh_oo_op_oq_or_om_on_ok_ol_oi_oj_ad0.0.0.0.0.0.0.0.0.0
1-interested=47**aa26.63.0.16.58.24.63.1.0.64_ab_ac2.52.52.52_ba50_bb17.1_bc675.500.8.0.1_bd17_be180_ca61.0.40.61.14.8.34.0.9_cb0_da1.0.0.100_db_dd9.0.34.50.45.50_dh1.30.50.50.0_di6_qa_qb_dc0.1.1.1.1_eh4.A27241_ea26.A27241.A27241.56.0.0_ec10.28.A27241.A27241.56.45.60.1_ed28.50.1.1.A27241.56_ef_eg_r00_fa5.50.50.60.50.0.56_fb8_fh_fc0.9.55.0.9.55.50.61.61.50.50.50_fd1.0.19.A27241.56_fe58.61_ff0000000000_fg0.50_pa0.0.0.0.40.50.85.85.0.0_t00_pb_pc_pd_pe_ga0_gb1_gc14.0_ge0000000000_gh_gf_gg_gd10000000_ha84.84_hb49.1.44.99_hc0.39.39.0.39.39_hd1.1.49.49_ia_if_ib_id_ic3.6.55.6.0_jc_ie_ja_jb_jd_je_jf_jg_ka10.6.32.32.0_kb10.6.32.32_kc_kd_ke_kf_la_lb_oa_os_ob_oc_od_oe_of_lc_m00_n00_s00_og_oh_oo_op_oq_or_om_on_ok_ol_oi_oj_ad0.0.0.0.0.0.0.0.0.0
1-calm=47**aa11.98.0.42.54.11.98.0.4.70_ab_ac2.52.52.52_ba50_bb17.1_bc762.500.8.0.1_bd17_be180_ca61.0.40.61.14.8.34.0.9_cb0_da1.0.0.100_db_dd9.0.34.50.45.50_dh1.30.50.50.0_di6_qa_qb_dc0.1.1.1.1_eh4.A27241_ea26.A27241.A27241.56.0.0_ec10.28.A27241.A27241.56.45.60.1_ed28.50.1.1.A27241.56_ef_eg_r00_fa2.50.50.60.50.65.56_fb7_fh_fc0.9.55.0.9.55.50.61.61.50.50.50_fd1.0.19.A27241.56_fe58.61_ff0000000000_fg0.50_pa0.0.0.0.40.50.85.85.0.0_t00_pb_pc_pd_pe_ga0_gb1_gc0.0_ge0000000000_gh_gf_gg_gd10000000_ha70.70_hb49.1.44.99_hc0.65.39.0.65.39_hd0.1.49.49_ia_if_ib_id_ic3.6.55.6.0_jc_ie_ja_jb_jd_je_jf_jg_ka10.6.59.59.0_kb10.6.59.59_kc_kd_ke_kf_la_lb_oa_os_ob_oc_od_oe_of_lc_m00_n00_s00_og_oh_oo_op_oq_or_om_on_ok_ol_oi_oj_ad0.0.0.0.0.0.0.0.0.0
1-smug=47**aa20.72.0.42.49.20.72.0.4.49_ab_ac2.52.52.52_ba50_bb18.1_bc850.500.8.0.1_bd18_be180_ca61.0.40.61.14.8.34.0.9_cb0_da1.0.0.100_db_dd9.0.34.50.45.50_dh1.30.50.50.0_di6_qa_qb_dc0.1.1.1.1_eh4.A27241_ea26.A27241.A27241.56.0.0_ec10.28.A27241.A27241.56.45.60.1_ed28.50.1.1.A27241.56_ef_eg_r00_fa2.50.50.60.50.38.56_fb7_fh_fc0.9.55.0.9.55.50.61.61.50.50.50_fd1.0.19.A27241.56_fe58.61_ff0000000000_fg0.50_pa0.0.0.0.40.50.85.85.0.0_t00_pb_pc_pd_pe_ga0_gb1_gc0.0_ge0000000000_gh_gf_gg_gd10000000_ha63.63_hb49.1.44.99_hc0.35.39.0.35.39_hd2.1.49.49_ia_if_ib_id_ic3.6.55.6.0_jc_ie_ja_jb_jd_je_jf_jg_ka10.6.59.0.0_kb10.6.59.0_kc_kd_ke_kf_la_lb_oa_os_ob_oc_od_oe_of_lc_m00_n00_s00_og_oh_oo_op_oq_or_om_on_ok_ol_oi_oj_ad0.0.0.0.0.0.0.0.0.0
1-horny=47**aa10.58.0.42.75.10.58.0.4.75_ab_ac2.52.52.52_ba50_bb17.1_bc150.500.8.0.1_bd17_be180_ca61.0.40.61.14.8.34.0.9_cb0_da1.0.0.100_db_dd0.0.34.50.45.50_dh1.30.50.50.0_di6_qa_qb_dc0.1.1.1.1_eh4.A27241_ea26.A27241.A27241.56.0.0_ec10.28.A27241.A27241.56.45.60.1_ed28.50.1.1.A27241.56_ef_eg_r00_fa2.50.50.60.50.65.56_fb7_fh_fc0.9.55.0.9.55.50.61.61.50.50.50_fd1.0.19.A27241.56_fe58.61_ff0000000000_fg0.50_pa0.0.0.0.40.50.85.85.0.0_t00_pb_pc_pd_pe_ga0_gb1_gc27.0_ge0000000000_gh_gf_gg_gd10000000_ha87.87_hb49.1.44.99_hc0.59.39.0.59.39_hd27.1.49.49_ia_if_ib_id_ic3.6.55.6.0_jc_ie_ja_jb_jd_je_jf_jg_ka10.6.0.0.0_kb10.6.0.0_kc_kd_ke_kf_la_lb_oa_os_ob_oc_od_oe_of_lc_m00_n00_s00_og_oh_oo_op_oq_or_om_on_ok_ol_oi_oj_ad0.0.0.0.0.0.0.0.0.0
1-happy=47**aa12.42.0.42.54.12.42.0.4.70_ab_ac2.52.52.52_ba50_bb17.1_bc237.500.8.0.1_bd17_be180_ca61.0.40.61.14.8.34.0.9_cb0_da1.0.0.100_db_dd9.0.34.50.45.50_dh1.30.50.50.0_di6_qa_qb_dc0.1.1.1.1_eh4.A27241_ea26.A27241.A27241.56.0.0_ec10.28.A27241.A27241.56.45.60.1_ed28.50.1.1.A27241.56_ef_eg_r00_fa2.50.50.60.50.65.56_fb7_fh_fc0.9.55.0.9.55.50.61.61.50.50.50_fd1.0.19.A27241.56_fe58.61_ff0000000000_fg0.50_pa0.0.0.0.40.50.85.85.0.0_t00_pb_pc_pd_pe_ga0_gb1_gc0.0_ge0000000000_gh_gf_gg_gd10000000_ha75.75_hb49.1.44.99_hc0.59.39.0.59.39_hd1.1.49.49_ia_if_ib_id_ic3.6.55.6.0_jc_ie_ja_jb_jd_je_jf_jg_ka10.6.18.18.0_kb10.6.18.18_kc_kd_ke_kf_la_lb_oa_os_ob_oc_od_oe_of_lc_m00_n00_s00_og_oh_oo_op_oq_or_om_on_ok_ol_oi_oj_ad0.0.0.0.0.0.0.0.0.0


2-loss=40**aa11.89.1.42.54.11.89.1.4.70_ab_ac2.52.52.52_ba50_bb17.1_bc150.500.8.0.1_bd17_be180_ca61.0.40.61.14.8.34.0.9_cb0_da1.0.0.100_db_dd9.0.34.50.45_dh1.30.50.50.0_di6_qa_qb_dc0.1.1.1.1_eh4.A27241_ea26.A27241.A27241.56.0.0_ec10.28.A27241.A27241.56.45.60.1_ed28.50.1.1.A27241.56_ef_eg_r0_fa2.50.50.60.50.86.56_fb7_fh_fc0.9.55.0.9.55.50.61.61.50.50.50_fd1.0.19.A27241.56_fe58.61_ff0000000000_fg0.50_pa0.0.0.0.40.50.85.85.0.0_t0_pb_pc_pd_pe_ga0_gb1_gc14.0_ge0000000000_gh_gf_gg_gd10000000_ha61.61_hb49.1.3.99_hc0.65.39.0.65.39_hd21.1.49.49_ia_if_ib_id_ic_jc_ie_ja_jb_jd_je_jf_jg_ka10.6.42.42.0_kb10.6.42.42_kc_kd_ke_kf_la_lb_oa_os_ob_oc_od_oe_of_lc_m0_n0_s0_og_oh_oo_op_oq_or_om_on_ok_ol_oi_oj_ad0.0.0.0.0.0.0.0.0.0
2-stunned=40**aa8.100.1.0.54.8.100.1.6.30_ab_ac2.52.52.52_ba50_bb17.1_bc237.500.8.0.1_bd17_be180_ca61.0.40.61.14.8.34.0.9_cb0_da1.0.0.100_db_dd0.0.34.50.45_dh1.30.50.50.0_di6_qa_qb_dc0.1.1.1.1_eh4.A27241_ea26.A27241.A27241.56.0.0_ec10.28.A27241.A27241.56.45.60.1_ed28.50.1.1.A27241.56_ef_eg_r0_fa2.50.50.60.50.59.56_fb7_fh_fc0.9.55.0.9.55.50.61.61.50.50.50_fd1.0.19.A27241.56_fe58.61_ff0000000000_fg0.50_pa0.0.0.0.40.50.85.85.0.0_t0_pb_pc_pd_pe_ga0_gb1_gc27.0_ge0000000000_gh_gf_gg_gd10000000_ha73.73_hb49.1.44.45_hc0.0.39.0.0.39_hd40.1.49.49_ia_if_ib_id_ic_jc_ie_ja_jb_jd_je_jf_jg_ka10.6.59.0.0_kb10.6.59.0_kc_kd_ke_kf_la_lb_oa_os_ob_oc_od_oe_of_lc_m0_n0_s0_og_oh_oo_op_oq_or_om_on_ok_ol_oi_oj_ad0.0.0.0.0.0.0.0.0.0
2-excited=40**aa7.44.0.43.54.7.44.0.6.43_ab_ac2.52.52.52_ba50_bb17.1_bc325.500.8.0.1_bd17_be180_ca61.0.40.61.14.8.34.0.9_cb0_da1.0.0.100_db_dd1.0.34.50.45_dh1.30.50.50.0_di6_qa_qb_dc0.1.1.1.1_eh4.A27241_ea26.A27241.A27241.56.0.0_ec10.28.A27241.A27241.56.45.60.1_ed28.50.1.1.A27241.56_ef_eg_r0_fa2.50.50.60.50.99.56_fb7_fh_fc0.9.55.0.9.55.50.61.61.50.50.50_fd1.0.19.A27241.56_fe58.61_ff0000000000_fg0.50_pa0.0.0.0.40.50.85.85.0.0_t0_pb_pc_pd_pe_ga0_gb1_gc50.0_ge0000000000_gh_gf_gg_gd10000000_ha96.96_hb49.1.44.99_hc0.41.39.0.41.39_hd34.1.49.49_ia_if_ib_id_ic_jc_ie_ja_jb_jd_je_jf_jg_ka10.6.1.1.0_kb10.6.1.1_kc_kd_ke_kf_la_lb_oa_os_ob_oc_od_oe_of_lc_m0_n0_s0_og_oh_oo_op_oq_or_om_on_ok_ol_oi_oj_ad0.0.0.0.0.0.0.0.0.0
2-angry=40**aa22.83.1.16.42.22.83.1.4.52_ab_ac2.52.52.52_ba50_bb17.1_bc412.500.8.0.1_bd17_be180_ca61.0.40.61.14.8.34.0.9_cb0_da1.0.0.100_db_dd9.0.34.50.45_dh1.30.50.50.0_di6_qa_qb_dc0.1.1.1.1_eh4.A27241_ea26.A27241.A27241.56.0.0_ec10.28.A27241.A27241.56.45.60.1_ed28.50.1.1.A27241.56_ef_eg_r0_fa6.50.50.60.50.31.56_fb6_fh_fc0.9.55.0.9.55.50.61.61.50.50.50_fd1.0.19.A27241.56_fe58.61_ff0000000000_fg0.50_pa0.0.0.0.40.50.85.85.0.0_t0_pb_pc_pd_pe_ga0_gb1_gc14.0_ge0000000000_gh_gf_gg_gd10000000_ha77.77_hb49.1.44.99_hc0.0.39.0.0.39_hd38.1.49.49_ia_if_ib_id_ic_jc_ie_ja_jb_jd_je_jf_jg_ka10.6.0.0.0_kb10.6.0.0_kc_kd_ke_kf_la_lb_oa_os_ob_oc_od_oe_of_lc_m0_n0_s0_og_oh_oo_op_oq_or_om_on_ok_ol_oi_oj_ad0.0.0.0.0.0.0.0.0.0
2-shocked=40**aa65.38.1.27.41.75.36.1.4.60_ab_ac2.52.52.52_ba50_bb17.1_bc500.500.8.0.1_bd17_be180_ca61.0.40.61.14.8.34.0.9_cb0_da1.0.0.100_db_dd0.0.34.50.45_dh1.30.50.50.0_di6_qa_qb_dc0.1.1.1.1_eh4.A27241_ea26.A27241.A27241.56.0.0_ec10.28.A27241.A27241.56.45.60.1_ed28.50.1.1.A27241.56_ef_eg_r0_fa2.50.50.60.50.79.56_fb7_fh_fc0.9.55.0.9.55.50.61.61.50.50.50_fd1.0.19.A27241.56_fe58.61_ff0000000000_fg0.50_pa0.0.0.0.40.50.85.85.0.0_t0_pb_pc_pd_pe_ga0_gb1_gc27.0_ge0000000000_gh_gf_gg_gd10000000_ha88.88_hb49.1.44.99_hc0.59.39.0.59.39_hd41.1.49.49_ia_if_ib_id_ic_jc_ie_ja_jb_jd_je_jf_jg_ka10.6.59.59.0_kb10.6.59.59_kc_kd_ke_kf_la_lb_oa_os_ob_oc_od_oe_of_lc_m0_n0_s0_og_oh_oo_op_oq_or_om_on_ok_ol_oi_oj_ad0.0.0.0.0.0.0.0.0.0
2-sad=40**aa13.97.0.42.54.13.97.0.4.70_ab_ac2.52.52.52_ba50_bb17.1_bc587.500.8.0.1_bd17_be180_ca61.0.40.61.14.8.34.0.9_cb0_da1.0.0.100_db_dd9.0.34.50.45_dh1.30.50.50.0_di6_qa_qb_dc0.1.1.1.1_eh4.A27241_ea26.A27241.A27241.56.0.0_ec10.28.A27241.A27241.56.45.60.1_ed28.50.1.1.A27241.56_ef_eg_r0_fa3.50.50.60.50.74.56_fb6_fh_fc0.9.55.0.9.55.50.61.61.50.50.50_fd1.0.19.A27241.56_fe58.61_ff0000000000_fg0.50_pa0.0.0.0.40.50.85.85.0.0_t0_pb_pc_pd_pe_ga0_gb1_gc14.0_ge0000000000_gh_gf_gg_gd10000000_ha59.59_hb49.1.20.99_hc0.61.39.0.61.39_hd8.1.49.49_ia_if_ib_id_ic_jc_ie_ja_jb_jd_je_jf_jg_ka10.6.18.18.0_kb10.6.18.18_kc_kd_ke_kf_la_lb_oa_os_ob_oc_od_oe_of_lc_m0_n0_s0_og_oh_oo_op_oq_or_om_on_ok_ol_oi_oj_ad0.0.0.0.0.0.0.0.0.0
2-interested=40**aa26.63.0.16.58.24.63.1.0.64_ab_ac2.52.52.52_ba50_bb17.1_bc675.500.8.0.1_bd17_be180_ca61.0.40.61.14.8.34.0.9_cb0_da1.0.0.100_db_dd0.0.34.50.45_dh1.30.50.50.0_di6_qa_qb_dc0.1.1.1.1_eh4.A27241_ea26.A27241.A27241.56.0.0_ec10.28.A27241.A27241.56.45.60.1_ed28.50.1.1.A27241.56_ef_eg_r0_fa5.50.50.60.50.0.56_fb8_fh_fc0.9.55.0.9.55.50.61.61.50.50.50_fd1.0.19.A27241.56_fe58.61_ff0000000000_fg0.50_pa0.0.0.0.40.50.85.85.0.0_t0_pb_pc_pd_pe_ga0_gb1_gc27.0_ge0000000000_gh_gf_gg_gd10000000_ha84.84_hb49.1.44.99_hc0.39.39.0.39.39_hd1.1.49.49_ia_if_ib_id_ic_jc_ie_ja_jb_jd_je_jf_jg_ka10.6.2.2.0_kb10.6.2.2_kc_kd_ke_kf_la_lb_oa_os_ob_oc_od_oe_of_lc_m0_n0_s0_og_oh_oo_op_oq_or_om_on_ok_ol_oi_oj_ad0.0.0.0.0.0.0.0.0.0
2-calm=40**aa11.98.0.42.54.11.98.0.4.70_ab_ac2.52.52.52_ba50_bb17.1_bc762.500.8.0.1_bd17_be180_ca61.0.40.61.14.8.34.0.9_cb0_da1.0.0.100_db_dd9.0.34.50.45_dh1.30.50.50.0_di6_qa_qb_dc0.1.1.1.1_eh4.A27241_ea26.A27241.A27241.56.0.0_ec10.28.A27241.A27241.56.45.60.1_ed28.50.1.1.A27241.56_ef_eg_r0_fa2.50.50.60.50.65.56_fb7_fh_fc0.9.55.0.9.55.50.61.61.50.50.50_fd1.0.19.A27241.56_fe58.61_ff0000000000_fg0.50_pa0.0.0.0.40.50.85.85.0.0_t0_pb_pc_pd_pe_ga0_gb1_gc14.0_ge0000000000_gh_gf_gg_gd10000000_ha70.70_hb49.1.44.99_hc0.65.39.0.65.39_hd0.1.49.49_ia_if_ib_id_ic_jc_ie_ja_jb_jd_je_jf_jg_ka10.6.33.33.0_kb10.6.33.33_kc_kd_ke_kf_la_lb_oa_os_ob_oc_od_oe_of_lc_m0_n0_s0_og_oh_oo_op_oq_or_om_on_ok_ol_oi_oj_ad0.0.0.0.0.0.0.0.0.0
2-smug=40**aa20.72.0.42.49.20.72.0.4.49_ab_ac2.52.52.52_ba50_bb18.1_bc850.500.8.0.1_bd18_be180_ca61.0.40.61.14.8.34.0.9_cb0_da1.0.0.100_db_dd9.0.34.50.45_dh1.30.50.50.0_di6_qa_qb_dc0.1.1.1.1_eh4.A27241_ea26.A27241.A27241.56.0.0_ec10.28.A27241.A27241.56.45.60.1_ed28.50.1.1.A27241.56_ef_eg_r0_fa2.50.50.60.50.38.56_fb7_fh_fc0.9.55.0.9.55.50.61.61.50.50.50_fd1.0.19.A27241.56_fe58.61_ff0000000000_fg0.50_pa0.0.0.0.40.50.85.85.0.0_t0_pb_pc_pd_pe_ga0_gb1_gc14.0_ge0000000000_gh_gf_gg_gd10000000_ha63.63_hb49.1.44.99_hc0.35.39.0.35.39_hd2.1.49.49_ia_if_ib_id_ic_jc_ie_ja_jb_jd_je_jf_jg_ka10.6.0.0.0_kb10.6.0.0_kc_kd_ke_kf_la_lb_oa_os_ob_oc_od_oe_of_lc_m0_n0_s0_og_oh_oo_op_oq_or_om_on_ok_ol_oi_oj_ad0.0.0.0.0.0.0.0.0.0
2-horny=40**aa10.58.0.42.75.10.58.0.4.75_ab_ac2.52.52.52_ba50_bb17.1_bc150.500.8.0.1_bd17_be180_ca61.0.40.61.14.8.34.0.9_cb0_da1.0.0.100_db_dd1.0.34.50.45_dh1.30.50.50.0_di6_qa_qb_dc0.1.1.1.1_eh4.A27241_ea26.A27241.A27241.56.0.0_ec10.28.A27241.A27241.56.45.60.1_ed28.50.1.1.A27241.56_ef_eg_r0_fa2.50.50.60.50.65.56_fb7_fh_fc0.9.55.0.9.55.50.61.61.50.50.50_fd1.0.19.A27241.56_fe58.61_ff0000000000_fg0.50_pa0.0.0.0.40.50.85.85.0.0_t0_pb_pc_pd_pe_ga0_gb1_gc50.0_ge0000000000_gh_gf_gg_gd10000000_ha87.87_hb49.1.44.99_hc0.59.39.0.59.39_hd27.1.49.49_ia_if_ib_id_ic_jc_ie_ja_jb_jd_je_jf_jg_ka10.6.42.42.0_kb10.6.42.42_kc_kd_ke_kf_la_lb_oa_os_ob_oc_od_oe_of_lc_m0_n0_s0_og_oh_oo_op_oq_or_om_on_ok_ol_oi_oj_ad0.0.0.0.0.0.0.0.0.0
2-happy=40**aa12.42.0.42.54.12.42.0.4.70_ab_ac2.52.52.52_ba50_bb17.1_bc237.500.8.0.1_bd17_be180_ca61.0.40.61.14.8.34.0.9_cb0_da1.0.0.100_db_dd9.0.34.50.45_dh1.30.50.50.0_di6_qa_qb_dc0.1.1.1.1_eh4.A27241_ea26.A27241.A27241.56.0.0_ec10.28.A27241.A27241.56.45.60.1_ed28.50.1.1.A27241.56_ef_eg_r0_fa2.50.50.60.50.65.56_fb7_fh_fc0.9.55.0.9.55.50.61.61.50.50.50_fd1.0.19.A27241.56_fe58.61_ff0000000000_fg0.50_pa0.0.0.0.40.50.85.85.0.0_t0_pb_pc_pd_pe_ga0_gb1_gc14.0_ge0000000000_gh_gf_gg_gd10000000_ha75.75_hb49.1.44.99_hc0.59.39.0.59.39_hd1.1.49.49_ia_if_ib_id_ic_jc_ie_ja_jb_jd_je_jf_jg_ka10.6.59.0.0_kb10.6.59.0_kc_kd_ke_kf_la_lb_oa_os_ob_oc_od_oe_of_lc_m0_n0_s0_og_oh_oo_op_oq_or_om_on_ok_ol_oi_oj_ad0.0.0.0.0.0.0.0.0.0


6-loss=40**aa11.89.1.42.54.11.89.1.4.70_ab_ac2.52.52.52_ba50_bb17.1_bc150.500.8.0.1_bd17_be180_ca61.0.40.61.14.8.34.0.9_cb0_da1.0.0.100_db_dd1.0.34.50.45_dh1.30.50.50.0_di6_qa_qb_dc140.1.1.1.1_eh4.A27241_ea26.A27241.A27241.56.0.0_ec10.28.A27241.A27241.56.45.60.1_ed28.50.1.1.A27241.56_ef_eg_r0_fa2.50.50.60.50.86.56_fb7_fh_fc0.9.55.0.9.55.50.61.61.50.50.50_fd1.0.19.A27241.56_fe58.61_ff0000000000_fg0.50_pa0.0.0.0.40.50.85.85.0.0_t0_pb_pc_pd_pe_ga0_gb1_gc50.0_ge0000000000_gh_gf_gg_gd10000000_ha61.61_hb49.1.3.99_hc0.65.39.0.65.39_hd21.1.49.49_ia_if_ib_id_ic_jc_ie_ja_jb_jd_je_jf_jg_ka_kb_kc_kd_ke_kf_la_lb_oa_os_ob_oc_od_oe_of_lc_m0_n0_s0_og_oh_oo_op_oq_or_om_on_ok_ol_oi_oj_ad0.0.0.0.0.0.0.0.0.0
6-stunned=40**aa8.100.1.0.54.8.100.1.6.30_ab_ac2.52.52.52_ba50_bb17.1_bc237.500.8.0.1_bd17_be180_ca61.0.40.61.14.8.34.0.9_cb0_da1.0.0.100_db_dd10.0.34.50.45_dh1.30.50.50.0_di6_qa_qb_dc140.1.1.1.1_eh4.A27241_ea26.A27241.A27241.56.0.0_ec10.28.A27241.A27241.56.45.60.1_ed28.50.1.1.A27241.56_ef_eg_r0_fa2.50.50.60.50.59.56_fb7_fh_fc0.9.55.0.9.55.50.61.61.50.50.50_fd1.0.19.A27241.56_fe58.61_ff0000000000_fg0.50_pa0.0.0.0.40.50.85.85.0.0_t0_pb_pc_pd_pe_ga0_gb1_gc60.0_ge0000000000_gh_gf_gg_gd10000000_ha73.73_hb49.1.44.45_hc0.0.39.0.0.39_hd40.1.49.49_ia_if_ib_id_ic_jc_ie_ja_jb_jd_je_jf_jg_ka_kb_kc_kd_ke_kf_la_lb_oa_os_ob_oc_od_oe_of_lc_m0_n0_s0_og_oh_oo_op_oq_or_om_on_ok_ol_oi_oj_ad0.0.0.0.0.0.0.0.0.0
6-excited=40**aa7.44.0.43.54.7.44.0.6.43_ab_ac2.52.52.52_ba50_bb17.1_bc325.500.8.0.1_bd17_be180_ca61.0.40.61.14.8.34.0.9_cb0_da1.0.0.100_db_dd12.0.34.50.45_dh1.30.50.50.0_di6_qa_qb_dc140.1.1.1.1_eh4.A27241_ea26.A27241.A27241.56.0.0_ec10.28.A27241.A27241.56.45.60.1_ed28.50.1.1.A27241.56_ef_eg_r0_fa2.50.50.60.50.99.56_fb7_fh_fc0.9.55.0.9.55.50.61.61.50.50.50_fd1.0.19.A27241.56_fe58.61_ff0000000000_fg0.50_pa0.0.0.0.40.50.85.85.0.0_t0_pb_pc_pd_pe_ga0_gb1_gc70.0_ge0000000000_gh_gf_gg_gd10000000_ha96.96_hb49.1.44.99_hc0.41.39.0.41.39_hd34.1.49.49_ia_if_ib_id_ic_jc_ie_ja_jb_jd_je_jf_jg_ka_kb_kc_kd_ke_kf_la_lb_oa_os_ob_oc_od_oe_of_lc_m0_n0_s0_og_oh_oo_op_oq_or_om_on_ok_ol_oi_oj_ad0.0.0.0.0.0.0.0.0.0
6-angry=40**aa22.83.1.16.42.22.83.1.4.52_ab_ac2.52.52.52_ba50_bb17.1_bc412.500.8.0.1_bd17_be180_ca61.0.40.61.14.8.34.0.9_cb0_da1.0.0.100_db_dd1.0.34.50.45_dh1.30.50.50.0_di6_qa_qb_dc140.1.1.1.1_eh4.A27241_ea26.A27241.A27241.56.0.0_ec10.28.A27241.A27241.56.45.60.1_ed28.50.1.1.A27241.56_ef_eg_r0_fa6.50.50.60.50.31.56_fb6_fh_fc0.9.55.0.9.55.50.61.61.50.50.50_fd1.0.19.A27241.56_fe58.61_ff0000000000_fg0.50_pa0.0.0.0.40.50.85.85.0.0_t0_pb_pc_pd_pe_ga0_gb1_gc50.0_ge0000000000_gh_gf_gg_gd10000000_ha77.77_hb49.1.44.99_hc0.0.39.0.0.39_hd38.1.49.49_ia_if_ib_id_ic_jc_ie_ja_jb_jd_je_jf_jg_ka_kb_kc_kd_ke_kf_la_lb_oa_os_ob_oc_od_oe_of_lc_m0_n0_s0_og_oh_oo_op_oq_or_om_on_ok_ol_oi_oj_ad0.0.0.0.0.0.0.0.0.0
6-shocked=40**aa65.38.1.27.41.75.36.1.4.60_ab_ac2.52.52.52_ba50_bb17.1_bc500.500.8.0.1_bd17_be180_ca61.0.40.61.14.8.34.0.9_cb0_da1.0.0.100_db_dd10.0.34.50.45_dh1.30.50.50.0_di6_qa_qb_dc140.1.1.1.1_eh4.A27241_ea26.A27241.A27241.56.0.0_ec10.28.A27241.A27241.56.45.60.1_ed28.50.1.1.A27241.56_ef_eg_r0_fa2.50.50.60.50.79.56_fb7_fh_fc0.9.55.0.9.55.50.61.61.50.50.50_fd1.0.19.A27241.56_fe58.61_ff0000000000_fg0.50_pa0.0.0.0.40.50.85.85.0.0_t0_pb_pc_pd_pe_ga0_gb1_gc60.0_ge0000000000_gh_gf_gg_gd10000000_ha88.88_hb49.1.44.99_hc0.59.39.0.59.39_hd41.1.49.49_ia_if_ib_id_ic_jc_ie_ja_jb_jd_je_jf_jg_ka_kb_kc_kd_ke_kf_la_lb_oa_os_ob_oc_od_oe_of_lc_m0_n0_s0_og_oh_oo_op_oq_or_om_on_ok_ol_oi_oj_ad0.0.0.0.0.0.0.0.0.0
6-sad=40**aa13.97.0.42.54.13.97.0.4.70_ab_ac2.52.52.52_ba50_bb17.1_bc587.500.8.0.1_bd17_be180_ca61.0.40.61.14.8.34.0.9_cb0_da1.0.0.100_db_dd1.0.34.50.45_dh1.30.50.50.0_di6_qa_qb_dc140.1.1.1.1_eh4.A27241_ea26.A27241.A27241.56.0.0_ec10.28.A27241.A27241.56.45.60.1_ed28.50.1.1.A27241.56_ef_eg_r0_fa3.50.50.60.50.74.56_fb6_fh_fc0.9.55.0.9.55.50.61.61.50.50.50_fd1.0.19.A27241.56_fe58.61_ff0000000000_fg0.50_pa0.0.0.0.40.50.85.85.0.0_t0_pb_pc_pd_pe_ga0_gb1_gc50.0_ge0000000000_gh_gf_gg_gd10000000_ha59.59_hb49.1.20.99_hc0.61.39.0.61.39_hd8.1.49.49_ia_if_ib_id_ic_jc_ie_ja_jb_jd_je_jf_jg_ka_kb_kc_kd_ke_kf_la_lb_oa_os_ob_oc_od_oe_of_lc_m0_n0_s0_og_oh_oo_op_oq_or_om_on_ok_ol_oi_oj_ad0.0.0.0.0.0.0.0.0.0
6-interested=40**aa26.63.0.16.58.24.63.1.0.64_ab_ac2.52.52.52_ba50_bb17.1_bc675.500.8.0.1_bd17_be180_ca61.0.40.61.14.8.34.0.9_cb0_da1.0.0.100_db_dd10.0.34.50.45_dh1.30.50.50.0_di6_qa_qb_dc140.1.1.1.1_eh4.A27241_ea26.A27241.A27241.56.0.0_ec10.28.A27241.A27241.56.45.60.1_ed28.50.1.1.A27241.56_ef_eg_r0_fa5.50.50.60.50.0.56_fb8_fh_fc0.9.55.0.9.55.50.61.61.50.50.50_fd1.0.19.A27241.56_fe58.61_ff0000000000_fg0.50_pa0.0.0.0.40.50.85.85.0.0_t0_pb_pc_pd_pe_ga0_gb1_gc60.0_ge0000000000_gh_gf_gg_gd10000000_ha84.84_hb49.1.44.99_hc0.39.39.0.39.39_hd1.1.49.49_ia_if_ib_id_ic_jc_ie_ja_jb_jd_je_jf_jg_ka_kb_kc_kd_ke_kf_la_lb_oa_os_ob_oc_od_oe_of_lc_m0_n0_s0_og_oh_oo_op_oq_or_om_on_ok_ol_oi_oj_ad0.0.0.0.0.0.0.0.0.0
6-calm=40**aa11.98.0.42.54.11.98.0.4.70_ab_ac2.52.52.52_ba50_bb17.1_bc762.500.8.0.1_bd17_be180_ca61.0.40.61.14.8.34.0.9_cb0_da1.0.0.100_db_dd1.0.34.50.45_dh1.30.50.50.0_di6_qa_qb_dc140.1.1.1.1_eh4.A27241_ea26.A27241.A27241.56.0.0_ec10.28.A27241.A27241.56.45.60.1_ed28.50.1.1.A27241.56_ef_eg_r0_fa2.50.50.60.50.65.56_fb7_fh_fc0.9.55.0.9.55.50.61.61.50.50.50_fd1.0.19.A27241.56_fe58.61_ff0000000000_fg0.50_pa0.0.0.0.40.50.85.85.0.0_t0_pb_pc_pd_pe_ga0_gb1_gc50.0_ge0000000000_gh_gf_gg_gd10000000_ha70.70_hb49.1.44.99_hc0.65.39.0.65.39_hd0.1.49.49_ia_if_ib_id_ic_jc_ie_ja_jb_jd_je_jf_jg_ka_kb_kc_kd_ke_kf_la_lb_oa_os_ob_oc_od_oe_of_lc_m0_n0_s0_og_oh_oo_op_oq_or_om_on_ok_ol_oi_oj_ad0.0.0.0.0.0.0.0.0.0
6-smug=40**aa20.72.0.42.49.20.72.0.4.49_ab_ac2.52.52.52_ba50_bb18.1_bc850.500.8.0.1_bd18_be180_ca61.0.40.61.14.8.34.0.9_cb0_da1.0.0.100_db_dd1.0.34.50.45_dh1.30.50.50.0_di6_qa_qb_dc140.1.1.1.1_eh4.A27241_ea26.A27241.A27241.56.0.0_ec10.28.A27241.A27241.56.45.60.1_ed28.50.1.1.A27241.56_ef_eg_r0_fa2.50.50.60.50.38.56_fb7_fh_fc0.9.55.0.9.55.50.61.61.50.50.50_fd1.0.19.A27241.56_fe58.61_ff0000000000_fg0.50_pa0.0.0.0.40.50.85.85.0.0_t0_pb_pc_pd_pe_ga0_gb1_gc50.0_ge0000000000_gh_gf_gg_gd10000000_ha63.63_hb49.1.44.99_hc0.35.39.0.35.39_hd2.1.49.49_ia_if_ib_id_ic_jc_ie_ja_jb_jd_je_jf_jg_ka_kb_kc_kd_ke_kf_la_lb_oa_os_ob_oc_od_oe_of_lc_m0_n0_s0_og_oh_oo_op_oq_or_om_on_ok_ol_oi_oj_ad0.0.0.0.0.0.0.0.0.0
6-horny=40**aa10.58.0.42.75.10.58.0.4.75_ab_ac2.52.52.52_ba50_bb17.1_bc150.500.8.0.1_bd17_be180_ca61.0.40.61.14.8.34.0.9_cb0_da1.0.0.100_db_dd12.0.34.50.45_dh1.30.50.50.0_di6_qa_qb_dc140.1.1.1.1_eh4.A27241_ea26.A27241.A27241.56.0.0_ec10.28.A27241.A27241.56.45.60.1_ed28.50.1.1.A27241.56_ef_eg_r0_fa2.50.50.60.50.65.56_fb7_fh_fc0.9.55.0.9.55.50.61.61.50.50.50_fd1.0.19.A27241.56_fe58.61_ff0000000000_fg0.50_pa0.0.0.0.40.50.85.85.0.0_t0_pb_pc_pd_pe_ga0_gb1_gc70.0_ge0000000000_gh_gf_gg_gd10000000_ha87.87_hb49.1.44.99_hc0.59.39.0.59.39_hd27.1.49.49_ia_if_ib_id_ic_jc_ie_ja_jb_jd_je_jf_jg_ka_kb_kc_kd_ke_kf_la_lb_oa_os_ob_oc_od_oe_of_lc_m0_n0_s0_og_oh_oo_op_oq_or_om_on_ok_ol_oi_oj_ad0.0.0.0.0.0.0.0.0.0
6-happy=40**aa12.42.0.42.54.12.42.0.4.70_ab_ac2.52.52.52_ba50_bb17.1_bc237.500.8.0.1_bd17_be180_ca61.0.40.61.14.8.34.0.9_cb0_da1.0.0.100_db_dd1.0.34.50.45_dh1.30.50.50.0_di6_qa_qb_dc140.1.1.1.1_eh4.A27241_ea26.A27241.A27241.56.0.0_ec10.28.A27241.A27241.56.45.60.1_ed28.50.1.1.A27241.56_ef_eg_r0_fa2.50.50.60.50.65.56_fb7_fh_fc0.9.55.0.9.55.50.61.61.50.50.50_fd1.0.19.A27241.56_fe58.61_ff0000000000_fg0.50_pa0.0.0.0.40.50.85.85.0.0_t0_pb_pc_pd_pe_ga0_gb1_gc50.0_ge0000000000_gh_gf_gg_gd10000000_ha75.75_hb49.1.44.99_hc0.59.39.0.59.39_hd1.1.49.49_ia_if_ib_id_ic_jc_ie_ja_jb_jd_je_jf_jg_ka_kb_kc_kd_ke_kf_la_lb_oa_os_ob_oc_od_oe_of_lc_m0_n0_s0_og_oh_oo_op_oq_or_om_on_ok_ol_oi_oj_ad0.0.0.0.0.0.0.0.0.0
