MENU('&File'),USE(?N01)
                           ITEM('P&rint Setup...'),USE(?01PS),MSG('Setup Printer'),STD(STD:PrintSetup)
                           ITEM,USE(?SEPARATOR1),SEPARATOR
                           ITEM('Report Options'),USE(?01R),HIDE
                           ITEM('Rf Polling Mode'),USE(?01RFPM)
                           ITEM('Wi-Fi Polling Mode'),USE(?01WFPM)
                           ITEM('Wi-Fi Polling Mode (CE)'),USE(?01WFPCE),HIDE
                           ITEM('Price Checker'),USE(?01PC),HIDE
                           ITEM,USE(?SEPARATOR2),SEPARATOR
                           ITEM('Alerts'),USE(?01FSA)
                           ITEM('Check Voucher Status'),USE(?01CVS),HIDE
                           ITEM('Change Settings'),USE(?01CSettings),HIDE
                           ITEM('Configure Sendout Files'),USE(?01FCSF),HIDE
                           ITEM,USE(?SEPARATOR3),SEPARATOR
                           ITEM('File Manager'),USE(?01FM)
                           ITEM('Ex&it'),USE(?01EX),MSG('Exit this application'),STD(STD:Close)
                         END
                         MENU('&Purchasing'),USE(?N02)
                           ITEM('S&uppliers'),USE(?02PS)
                           ITEM('Departments / Sub Groups'),USE(?02DSG)
                           ITEM('Web Departments / Sub Groups'),USE(?02WDSG),HIDE
                           MENU('P&roducts'),USE(?02P)
                             ITEM('All &Products - By Stockcode / Description'),USE(?02APSD)
                             ITEM('All Products by Barcode'),USE(?02APB)
                             ITEM('All Products by Supplier Product Code'),USE(?02APBSPC)
                             ITEM('All Products for Keyword'),USE(?02APK)
                             ITEM('Specific Product for Barcode'),USE(?02SPB)
                             ITEM('For Specific UDF'),USE(?02SUDF)
                           END
                           ITEM('Change Product Dept / Sub Group'),USE(?02CPDSG)
                           ITEM('Preset PO'),USE(?02PP),HIDE
                           ITEM,USE(?SEPARATOR4),SEPARATOR
                           MENU('Send Products to Hand Held Terminal'),USE(?02SPHHT)
                             MENU('All Products'),USE(?02HHTAP)
                               ITEM('with Retail Prices'),USE(?02HHTWRP)
                               ITEM('with Cost Prices'),USE(?02HHTWCP)
                             END
                             MENU('For Supplier'),USE(?02HHTFS)
                               ITEM('with &Retail Prices'),USE(?02HHTFS2)
                               ITEM('with &Cost Prices'),USE(?02HHTFS3)
                             END
                           END
                           ITEM,USE(?SEPARATOR5),SEPARATOR
                           ITEM('Customer Special Orders from Shop'),USE(?02CSOFS)
                           ITEM('Suggested Order from Supplier(s)'),USE(?02PSOPONLY)
                           ITEM('Purchase &Orders'),USE(?02PO)
                           ITEM('Complete old Orders'),USE(?02COO),HIDE
                           ITEM('Shop Order'),USE(?02SO),HIDE
                           ITEM('WiFi Purchase Ordering'),USE(?02WFPO)
                           ITEM('Import Purchase Order'),USE(?02IPO)
                           ITEM('Enter Goods Received'),USE(?02EGR)
                           ITEM('Donated Goods In'),USE(?02DGI),HIDE
                           ITEM,USE(?SEPARATOR6),SEPARATOR
                           ITEM('Pallet Info.'),USE(?02PI)
                           ITEM('Adjust Goods In Costing'),USE(?02AGIC)
                           MENU('Post Sale Allocation'),USE(?02PSA),HIDE
                             ITEM('Generate Picking List'),USE(?02GPL)
                             ITEM('Enter Picked Quantity'),USE(?02EPQ)
                             ITEM,USE(?SEPARATOR7),SEPARATOR
                             ITEM('R&eports'),USE(?02R)
                           END
                           ITEM('Supplier Returns'),USE(?02SR),HIDE
                         END
                         MENU('&Stock'),USE(?Stock)
                           ITEM('Shop Stocks'),USE(?SSS)
                           ITEM('&Product Stock'),USE(?SPS)
                           ITEM('Stock in limbo'),USE(?SSH)
                           MENU('Inter Shop &Transfers'),USE(?StIST2)
                             ITEM('Enter &Transfers'),USE(?SIST)
                             ITEM('Limbo Stock Transfers'),USE(?SISTLST)
                             ITEM('Send to HHT'),USE(?StISTsStoHHT)
                             ITEM,USE(?SEPARATOR8),SEPARATOR
                             ITEM('Accept Stock Transferred to my shop'),USE(?ASTTMS)
                             ITEM('In Transit From My Outlet'),USE(?SISTITFMO)
                             ITEM,USE(?SEPARATOR9),SEPARATOR
                             ITEM('Products Awaiting Transfer to Shops'),USE(?StISTPAT)
                             ITEM('Valuation of products in transit'),USE(?StISTVofPI)
                           END
                           MENU('Shop Picking Lists'),USE(?StSPL)
                             MENU('Produce Picking Lists'),USE(?SSPLPPL)
                               ITEM('Specific Dept / Sub Group / Outlet(s)'),USE(?StPSPLs)
                               ITEM('Specific Products'),USE(?StSPLPPLsS)
                               ITEM('Based on Shop Orders'),USE(?StSPLsPPLsBon)
                               ITEM('Re Print Last Nights Picking Lists'),USE(?StSPLsPPLReP)
                             END
                             ITEM('Change Picking List'),USE(?SSPLCPL)
                             ITEM('Enter Picked Quantities'),USE(?SSPLEPQ)
                             ITEM('Allocated Stock'),USE(?StSPLAStk)
                           END
                           MENU('S&tock take'),USE(?StockStocktake)
                             ITEM('Prepare For a Fresh Stocktake'),USE(?SStPFaFSt)
                             ITEM('Prepare For a Fresh RF Stocktake'),USE(?StStPForaFRFSke)
                             ITEM('Prepare For a Fresh Offline Stocktake (Wifi)'),USE(?PFOLSTQ),HIDE
                             MENU('Stock &Sheets'),USE(?StockStocktakeStockSheets)
                               ITEM('All Products by &Description'),USE(?SStSSAllPbyN)
                               ITEM('All Products by &Stockcode'),USE(?SStSSI62)
                               ITEM('All Products By S&upplier Product Code'),USE(?SStSSAllPBySP)
                               ITEM('For &Department'),USE(?SStSSFD)
                               ITEM('For Department / Sub Group'),USE(?SStSSFDSG)
                               ITEM('For S&upplier'),USE(?SStSSFS)
                             END
                             MENU('Enter Counted Figures'),USE(?EnterCountedFigures)
                               ITEM('By Product &Description'),USE(?ESTDESC)
                               ITEM('By &Stockcode'),USE(?ESTSC)
                               ITEM('By Supplier Product Code'),USE(?SStECFBySP)
                               ITEM,USE(?SEPARATOR10),SEPARATOR
                               ITEM('For D&epartment'),USE(?SStECFFD)
                               ITEM('&For Department / Sub Group'),USE(?SStECFFDS)
                               ITEM('For Su&pplier'),USE(?SStECFForS)
                               ITEM('For Specific Products'),USE(?SStECFForSPro)
                               ITEM,USE(?SEPARATOR11),SEPARATOR
                               ITEM('&Post Stock Count for All Outlets'),USE(?PSCAO)
                             END
                             ITEM('Exceptions Report'),USE(?SStExRpt)
                             ITEM('View offline stocktake products'),USE(?VOLSTP),HIDE
                           END
                           ITEM('Stock Ad&justments'),USE(?SSAdj)
                           MENU('Promotions'),USE(?SPromo2)
                             ITEM('Live (Current and Future)'),USE(?SPromo)
                             ITEM('Completed'),USE(?SPromoCom)
                           END
                           ITEM('Replenishment - InterBranch'),USE(?03R)
                           ITEM('Floor Movements'),USE(?PFM),HIDE
                           ITEM('Rolling Stock'),USE(?StRS),HIDE
                         END
                         MENU('Quotation'),USE(?Quotation)
                           ITEM('New'),USE(?QuoNew)
                           ITEM('View / Change'),USE(?QuoVChg)
                         END
                         MENU('Sales Order Process&ing'),USE(?MailOrder)
                           ITEM('Customer Stock Enquiry'),USE(?05CSE)
                           ITEM('Enter Customer Sales Order'),USE(?05ESO)
                           ITEM('Enter Picked Goods'),USE(?05EPG)
                           ITEM('Search Web Order'),USE(?SopSWO),HIDE
                           ITEM,USE(?SEPARATOR12),SEPARATOR
                           MENU('Produce Picking Lists for Outstanding Sales Orders'),USE(?05PPLFOS3)
                             ITEM('All'),USE(?MOPPLforOutS)
                             ITEM('Specific Product'),USE(?SOPPPLforOuts)
                             ITEM('for Dept / Sub Group'),USE(?MOPPLforOutsSal2)
                             ITEM('For User Definable'),USE(?MOPPLforOutsSal4)
                           END
                           ITEM('Batch accept picking lists'),USE(?05BAPL)
                           ITEM('Invoice Generated Picking Lists'),USE(?05PI367)
                           ITEM,USE(?SEPARATOR13),SEPARATOR
                           ITEM('Cancel All Orders for Specified Product'),USE(?MOCOFP)
                           ITEM('Delivery Charges'),USE(?MailOrderDeliveryCharges)
                           ITEM,USE(?SEPARATOR14),SEPARATOR
                           MENU('Reports'),USE(?MOReports)
                             MENU('Outstanding Sales Orders'),USE(?MORptOutsSalOrd2)
                               ITEM('All Customers'),USE(?MORptOutsSalOrd)
                               ITEM('Specific Customer'),USE(?MORptOutsSalOrdSpeA)
                               ITEM,USE(?SEPARATOR15),SEPARATOR
                               ITEM('S&pecific Product'),USE(?SOPRptOutsSalOrd)
                             END
                             ITEM('Outstanding Products'),USE(?SOPROuP)
                             ITEM('Picking Lists for Consignment Note No'),USE(?MORptsPLforCNN)
                             ITEM('List of Picking Lists shipped on'),USE(?MORptI325)
                             MENU('Picking List Summary'),USE(?MORPLSumm)
                               ITEM('Between Picking List Numbers'),USE(?MORptPLSummBP)
                               ITEM('Between Dates'),USE(?MORptPLSummyBD)
                               ITEM('Un-Invoiced'),USE(?SOPRPLSUnIn)
                             END
                             ITEM('Batch Print Order Acknowledgments'),USE(?MORptBPOAck)
                             ITEM('Re-Print Picking Lists'),USE(?MORptRePPL)
                             ITEM('Cancelled Orders / Products'),USE(?MORptCOProd)
                             ITEM('List of UnAuthorised CC Transactions'),USE(?SOPRptLofUnAuthCC)
                             ITEM('Summary Source of Sales Orders'),USE(?MORptSSofSO)
                             ITEM('Suggested P Order for SOP'),USE(?SOPPO)
                             ITEM('Picking list for specific product / customer'),USE(?MORptPicL4PrAc)
                             ITEM('Orders with card issue(s)'),USE(?SOPROwci)
                           END
                           ITEM('Batch Enter Consignment Details'),USE(?05RBECD)
                           ITEM('Prepare File for Batch Credit Card Submission'),USE(?MailOrderPrepareFileforBatchCreditCardSubmissio),HIDE
                           ITEM('Auto Invoice from Batch Authorised Credit Cards'),USE(?MailOrderAutoInvoicefromBatchAuthorisedCreditCa),HIDE
                           ITEM('Batch Invoice Range of Picking Lists'),USE(?MOBIROPL),HIDE
                           ITEM('Show Picking list Batches'),USE(?05SPB)
                           ITEM('Web Order Refund/Cancellation '),USE(?SOPWebIssues),HIDE
                           ITEM('Incomplete Web Transaction(s)'),USE(?SOPInCWT),HIDE
                           ITEM('Invoice Log'),USE(?05IL),HIDE
                           ITEM('Personalised Products'),USE(?05BotLB),HIDE
                         END
                         MENU('S&etup'),USE(?Setup)
                           ITEM('&Outlets'),USE(?SetOut)
                           ITEM('&VAT Rates'),USE(?SetVATR)
                           ITEM('&Discount Structures'),USE(?SetDiscStruc)
                           ITEM('Rounding Tables'),USE(?06RT)
                           ITEM('Staff Discount Structure'),USE(?06GCD)
                           ITEM('Staff Discount'),USE(?SetupStaffDiscount),HIDE
                           MENU('Price Bands'),USE(?SetupPriceBands)
                             ITEM('Minimum Margins'),USE(?SetPriBdMinMrg)
                             ITEM('Relationships'),USE(?SetPriBndRel)
                           END
                           ITEM('Customer Discount Profiles'),USE(?06CDP)
                           ITEM('Promotion Types'),USE(?06PT)
                           ITEM('User Groups'),USE(?06UG)
                           ITEM('Operators'),USE(?06O)
                           ITEM('Kit Building'),USE(?06KB)
                           ITEM('Recipe'),USE(?SetupRecipe)
                           ITEM('Bar Recipes'),USE(?SetupBarRecipes),HIDE
                           ITEM('Tilling Hotkeys'),USE(?06TH)
                           ITEM('Tilling Skins'),USE(?06TS)
                           ITEM('Reasons'),USE(?06R)
                           ITEM('User Definable Info'),USE(?SUrDI)
                           ITEM('Size Ranges'),USE(?SetupSizeRanges)
                           ITEM('Product Profile Selection'),USE(?SPPS)
                           ITEM('Block Vouchers'),USE(?06BV)
                           ITEM('E&xchange Rates'),USE(?06ER)
                           ITEM('Loyalty Scheme'),USE(?06LS)
                           ITEM('Titles'),USE(?SetupTitles)
                           ITEM('Currency Denominations Text'),USE(?06CDT)
                           ITEM('Customer Marketing Questions'),USE(?06CMQ)
                           ITEM('Feedback Questions'),USE(?SFQ)
                           ITEM('Point of Sale Messages'),USE(?SPofSM)
                           ITEM('Customer Balance/Loyalty Adjustments'),USE(?06ACB)
                           ITEM('Adjust Allowances'),USE(?06AA)
                           ITEM('Allocation Bands'),USE(?06AB)
                           ITEM('Tenants Details'),USE(?06TD)
                           ITEM('Stall Holders'),USE(?06SH)
                           ITEM('Stall Holder Commission Structure'),USE(?06SHCS)
                           ITEM('Terminal / Till Details'),USE(?06TerDet)
                           ITEM('Van Delivery and Warehouse Pick Days'),USE(?06VDWPD)
                           ITEM('Generic Notes'),USE(?06GN)
                           ITEM('Link to Barcode Scales'),USE(?06LBS)
                           ITEM('Pre-Orders'),USE(?06Itm366)
                           ITEM('Shelf Talkers'),USE(?06ST)
                           ITEM('Countries'),USE(?SC)
                           ITEM('Bays'),USE(?PB),HIDE
                           ITEM('Bay Allocation'),USE(?PBA),HIDE
                           MENU('Charity'),USE(?SCHTY),HIDE
                             ITEM('Categories'),USE(?PC)
                             ITEM('Source'),USE(?PS)
                           END
                           ITEM('Tour Control Panel'),USE(?STos),HIDE
                           ITEM('Lottery Control Panel'),USE(?06LGD),HIDE
                           ITEM('SSB Control Panel'),USE(?SSBCP),HIDE
                           ITEM('Collection/Delivery Control Panel'),USE(?06FCDCP),HIDE
                           ITEM('Web Sites'),USE(?WebSites),HIDE
                           ITEM('Product Image Types'),USE(?ProdImagTyp),HIDE
                           ITEM('Web Stock'),USE(?SWebSt),HIDE
                           ITEM('Web Find && Replace'),USE(?06FnR),HIDE
                           ITEM('Payment Gateways'),USE(?SPayGws),HIDE
                           ITEM('Send SMS'),USE(?SMS),HIDE
                           ITEM('Generic Cash Counter'),USE(?GCC),HIDE
                           ITEM('Hire Days'),USE(?SHD442),HIDE
                           ITEM('EAN Barcodes'),USE(?SEANBc),HIDE
                           ITEM,USE(?SEPARATOR16),SEPARATOR
                           ITEM('System Settings'),USE(?06SS)
                           ITEM('Chariot Settings'),USE(?SChS),HIDE
                           ITEM('&Modem Configuration'),USE(?06MC)
                           ITEM('Unlock Trans.'),USE(?SUTr),HIDE
                           ITEM('IntraMail Templates'),USE(?SIMT),HIDE
                           ITEM('Targets'),USE(?STar),HIDE
                           ITEM('Avery Berkel Setup'),USE(?06ABS),HIDE
                           ITEM('Kitchen Stock'),USE(?SetupKitchenStock)
                           ITEM('Food Collection'),USE(?SetupFoodCollection)
                           ITEM('Alcohol Times'),USE(?SetAlcoTime),HIDE
                           ITEM('External Department Links'),USE(?SEDLS),HIDE
                           ITEM('Price Gradings'),USE(?SPG),HIDE
                           ITEM('Personalised products text'),USE(?SPPT),HIDE
                           ITEM('Dashboard Budgets'),USE(?SDBB)
                           ITEM('Carrier Bag Question'),USE(?SCBQU)
                           ITEM('GDPR Settings'),USE(?GDPRS),DISABLE
                           ITEM('EBay Control Panel'),USE(?ECPan),HIDE
                           ITEM('Password Policy'),USE(?PasswordPolicy)
                         END
                         MENU('Batc&h Updates'),USE(?BatchUpdates)
                           MENU('Product Selling Prices'),USE(?BUPSP)
                             ITEM('By Barcode'),USE(?PurBatUpdSelPri)
                             ITEM('For Specified Criteria'),USE(?BatUpdDptSGrpSelPri)
                             MENU('Using HHT'),USE(?BUPSPUHHT)
                               MENU('with Cradle'),USE(?BUPSPUHHTWC)
                                 ITEM('Send to &HHT'),USE(?07PSPUHHTWC2)
                                 ITEM('Receive and Apply Changes'),USE(?07PSPUHHTWC3)
                               END
                             END
                             ITEM('Clone a Price Band'),USE(?07PSPCPB)
                           END
                           ITEM('Forward dated cost price changes for Criteria'),USE(?FDatdCPChgsForSupp)
                           ITEM('Live Price Updates'),USE(?BLSP),HIDE
                           ITEM('Inventory Levels'),USE(?SBUIL)
                           ITEM('Clone Inventory Levels to an Outlet'),USE(?BUCILstoanO)
                           ITEM('Product Profiles'),USE(?BUPP)
                           ITEM('Barcodes'),USE(?BUB)
                           ITEM('Customer Accounts'),USE(?BUCA)
                           ITEM,USE(?SEPARATOR17),SEPARATOR
                           ITEM('Remove Products'),USE(?07RP)
                           ITEM('Suspend Product for Criteria'),USE(?BUSPfC)
                           ITEM('Un - Suspend Products for Criteria'),USE(?BUUnSPfC)
                           ITEM,USE(?SEPARATOR18),SEPARATOR
                           ITEM('Post Concession Sales'),USE(?07PCS)
                           ITEM('Concession Categories'),USE(?07CC)
                           ITEM('Update Monthly Allowances'),USE(?07UMA)
                           ITEM('Update 6 Monthly Allowances'),USE(?07U6MA)
                           ITEM('Import Sales from External Source'),USE(?07ISFES)
                           ITEM('Resend export file'),USE(?07REF)
                           ITEM('Tiso File Checker'),USE(?RTFC),HIDE
                           ITEM,USE(?SEPARATOR19),SEPARATOR
                           ITEM('NEWS Agent System'),USE(?BNGS),HIDE
                           ITEM,USE(?SEPARATOR20),SEPARATOR
                           MENU('Imports'),USE(?07I)
                             ITEM('Account Customers'),USE(?07IAC)
                             ITEM('Products'),USE(?07P)
                             ITEM('Additional Imports'),USE(?AddImp)
                           END
                           ITEM('Year End'),USE(?07YE)
                           ITEM('&Feedback Questions'),USE(?BUFQ)
                           ITEM('Export to SQL'),USE(?BUExp2SQL),HIDE
                           ITEM('Product Update'),USE(?07BUPU)
                           ITEM('Pre-Pack Labels'),USE(?07PPLbls),HIDE
                           ITEM('Spar Link'),USE(?SparLink),HIDE
                           ITEM('Booker Link'),USE(?Booker),HIDE
                           ITEM('Web Coupons'),USE(?07WC),HIDE
                           ITEM('ADSR Link'),USE(?07ADL),HIDE
                           ITEM('Outlet Headers and Footers'),USE(?BUOutHaF)
                           ITEM,USE(?SEPARATOR32),SEPARATOR
                           ITEM('Right To Be Forgotten (GDPR)'),USE(?GDPRRTBF),DISABLE
                         END
                         MENU('&Reports'),USE(?Reports)
                           MENU('Pro&ducts'),USE(?ReportsProducts)
                             MENU('All &Products'),USE(?RPAP2)
                               ITEM('By StockCode'),USE(?RPAP)
                               ITEM('By &Description'),USE(?RPAPbyD)
                               ITEM('By Description with Min Max'),USE(?RPAPByDwMIM)
                               ITEM('For Department, Sub Group'),USE(?RPAPFDSG)
                               ITEM('For User Definable Profile'),USE(?RPAPFUDP)
                               ITEM('GP for all Selling Prices'),USE(?RPAPGPfaSP)
                               ITEM('Stock / Min / Max Matrix'),USE(?RPAPSMMM)
                               ITEM('Cost/Retail Price Analysis'),USE(?CRPA)
                               ITEM('Colour Size Analysis'),USE(?CSZA)
                               MENU('For Supp&lier'),USE(?RPAPFS2)
                                 ITEM('Basic'),USE(?RPAPFS)
                                 ITEM('Detailed'),USE(?RPAPFSD)
                               END
                               ITEM('Suspened, but has stock'),USE(?0801SBHS)
                             END
                             ITEM('Trail - Between Dates'),USE(?RPTBD)
                             ITEM('By Department, By Sub Group'),USE(?RPBDBSG)
                             ITEM('For De&partment'),USE(?RPFD)
                             MENU('Price Changes'),USE(?RPPC)
                               MENU('Retail'),USE(?RPPCRP)
                                 ITEM('for outlet, between dates'),USE(?RPPCRlFOB)
                               END
                               MENU('Costs'),USE(?RPPCC)
                                 ITEM('&Between Dates'),USE(?081PCCBD)
                               END
                             END
                             MENU('Batch Print'),USE(?RPBPL)
                               ITEM('Barcode Labels'),USE(?RPBPLFDSG)
                               ITEM('Price Changes between dates (Labels/Shelfedge)'),USE(?RPBPPCBD)
                               MENU('Shelf Edge Tickets'),USE(?RPBPSET)
                                 ITEM('For Product Criteria'),USE(?RPBPSETFD)
                                 ITEM('Clear Spooler'),USE(?RPBPSETCS)
                               END
                             END
                             ITEM,USE(?SEPARATOR21),SEPARATOR
                             ITEM('Entered between Dates'),USE(?RPEBD)
                             ITEM('Suspended between dates'),USE(?SUSBDS)
                             ITEM('Invalid Depts / Sub Groups'),USE(?RPIDSG)
                             ITEM('Invalid VAT Rates @ Selling Price'),USE(?RPIVRSP)
                             ITEM('Invalid VAT Rate @ Cost'),USE(?RPIVRC)
                             ITEM('Retail and Cost VAT Rates Differ'),USE(?RPRACVRD)
                             ITEM('Department and Stockcode Differ'),USE(?RPDASD)
                             ITEM('Invalid Suppliers '),USE(?RPIS)
                             ITEM('Zero Selling Price'),USE(?RPZSP)
                             ITEM('Zero Cost Prices'),USE(?RPZCP)
                             ITEM('No Barcodes Attached'),USE(?RPNBA)
                             ITEM('With Invalid Barcodes'),USE(?RPWIB)
                             ITEM('Retail less than Cost'),USE(?RPRLTC)
                             ITEM('Products NOT Achieving Margin'),USE(?RPPNAM)
                             ITEM('Expiry'),USE(?08Expiry)
                             ITEM('With Associations'),USE(?ReportsProductsWithAssociations)
                           END
                           ITEM,USE(?SEPARATOR22),SEPARATOR
                           MENU('&Sales'),USE(?ReportsSales)
                             MENU('Departmental'),USE(?RSDl)
                               MENU('Department / Sub Group'),USE(?RSDDSG)
                                 ITEM('Preset Weekend Dates'),USE(?RSA)
                                 ITEM('Between Dates - Weekly'),USE(?RSDDSGB)
                               END
                               ITEM('So far Today @ this site'),USE(?082DSSFTTS)
                               ITEM('By Outlet, Between Dates - Totals Only'),USE(?RSDBOBDTot)
                               ITEM('Sales Statistics'),USE(?RSDSS),HIDE
                               ITEM('Time on Floor'),USE(?RSDToFl),HIDE
                               ITEM('Price Analysis'),USE(?CDPA)
                             END
                             MENU('Gross Profit / Sales / Stocks Analysis'),USE(?082GPSSA)
                               ITEM('Gross Profit / Sales / Stocks'),USE(?RSGPSS)
                               ITEM('Dept Sub Grp Gross Profit Sales Analysis (Totals Only)'),USE(?082FPSSADS)
                               MENU('Prediction'),USE(?RSGPSSAP)
                                 MENU('Forward Season'),USE(?RSGPSSAP4)
                                   ITEM('Sales Value'),USE(?RSGPSSAP2)
                                   ITEM('Sales Qty'),USE(?RSGPSSAP5)
                                 END
                                 MENU('Forward Year to Date'),USE(?RSGPSSAP6)
                                   ITEM('S&ales Value'),USE(?RSGPSSAP3)
                                   ITEM('&Sales Qty'),USE(?RSGPSSAP7)
                                 END
                               END
                             END
                             ITEM('Product Review'),USE(?082PR)
                             ITEM('Stock / Sales Analyser'),USE(?RSSSA)
                             ITEM('Colour / Size Matrix'),USE(?082CSM)
                             ITEM('Grouped by colour'),USE(?RPTGrpBycolr),HIDE
                             ITEM('Top / Worst Products'),USE(?RSTWP)
                             ITEM('Sales By Country'),USE(?RSaBC)
                             ITEM('Donated Goods'),USE(?RSBDC),HIDE
                             MENU('All Outlets'),USE(?RSAllO)
                               ITEM('Statistics'),USE(?RAOS)
                               ITEM('Category Breakdown'),USE(?RCB)
                               MENU('Weekly'),USE(?RSAllOWly2)
                                 ITEM('Sales Only'),USE(?RSAllOWly)
                                 ITEM('Sales v''s Takings'),USE(?RSAllOWlySvsT)
                                 ITEM('This Week, Last Week Comparison'),USE(?RSAllOWlyTWLWC)
                               END
                               MENU('Month'),USE(?082AOM)
                                 ITEM('Monthly Comparison'),USE(?RMoC)
                                 ITEM('League Table'),USE(?RAMLT)
                               END
                               MENU('Yearly'),USE(?082GPSSAYI)
                                 ITEM('Yearly Comparison'),USE(?RYoC)
                                 ITEM('Detailed Yearly Sales'),USE(?ReDYS)
                                 ITEM('Detailed Yearly Comparison'),USE(?ReTYLYC)
                                 ITEM('Detailed Yearly comparison With Graph'),USE(?082AOYDYC)
                                 ITEM('Target Comparison'),USE(?ReYAT),HIDE
                               END
                               MENU('B&etween Dates'),USE(?082AOBD2)
                                 ITEM('Takings Summary'),USE(?082AOTS)
                                 ITEM('Sales by Weight'),USE(?frsbw)
                               END
                               ITEM('Matrix'),USE(?082AOMX)
                               ITEM('Matrix Detail'),USE(?082AOMD)
                             END
                             MENU('Product Sales'),USE(?082PS)
                               MENU('All Outlets - Between Dates'),USE(?082PSAO)
                                 ITEM('All Departments - Product Level'),USE(?082PSAOBD)
                                 ITEM('All Departments - Totals Only'),USE(?082PSAOAPB)
                                 ITEM('Specific Department - Sub Group Totals'),USE(?082PSAOSD)
                                 ITEM('Sp&ecific Product'),USE(?082PSAOSP)
                                 ITEM('Specific Product - Outlet Totals'),USE(?082PSAOSP2)
                               END
                               MENU('Specific Outlet Between Dates'),USE(?082PSSOBD2)
                                 ITEM('All Departments - &Product Level'),USE(?082PSSOBD)
                                 ITEM('All Departments - &Totals Only'),USE(?082PSSOBD5)
                                 ITEM('&Specific Department - Sub Group Totals'),USE(?082PSSOBD6)
                                 ITEM('Specific Department - Product Level'),USE(?082PSSOBD3)
                                 ITEM('Spe&cific Product'),USE(?082PSSOBD4)
                               END
                               ITEM('S&o far Today @ this site'),USE(?082PSSFTTS)
                               MENU('Not Sold Since'),USE(?082PSNSS)
                                 ITEM('x Days'),USE(?082PSNSSXD)
                                 ITEM('Date'),USE(?082PSNSSSD)
                               END
                               ITEM('For UDF Between Dates'),USE(?082PSFUDFBD)
                             END
                             MENU('Point of Sale'),USE(?082POS)
                               ITEM('&Exceptions'),USE(?082POSE)
                               ITEM('Staff Discounts'),USE(?082POSSDBSB)
                               ITEM('Staff Discounts Totals Only'),USE(?RSDTO)
                               MENU('Voucher Redemptions'),USE(?0821POSVR)
                                 ITEM('&Detailed'),USE(?0821VRD)
                                 ITEM('Summary by outlets'),USE(?0821VRSBO)
                               END
                               ITEM('Kit Sales - Breakdown'),USE(?082POSKS)
                               ITEM('Kit Sales - Summary'),USE(?RKSS)
                               MENU('Till Cluster'),USE(?082POSTC)
                                 MENU('For Department'),USE(?082POSTCFD)
                                   ITEM('Product Level'),USE(?082POSTCI273)
                                   ITEM('Totals Only'),USE(?082POSTCFD2)
                                 END
                                 MENU('&For Department, Sub Group'),USE(?082POSTCFD3)
                                   ITEM('P&roduct Level'),USE(?082POSTCFD4)
                                   ITEM('T&otals Only'),USE(?082POSTCFD5)
                                 END
                               END
                               ITEM('Card Payment'),USE(?RCP)
                               ITEM('Banking'),USE(?RSPoSBS)
                               ITEM('Banking Export'),USE(?RSPoSBankingExport),HIDE
                               ITEM('Cash Back'),USE(?ROCBN)
                               ITEM('Payouts Between Dates'),USE(?PAYOBDS)
                               ITEM('Functions'),USE(?082POSF)
                               ITEM('Refusal Register'),USE(?NoIDRR),HIDE
                               ITEM('Age Authorisation'),USE(?CAAR),HIDE
                               ITEM('Kiosk hopper audit'),USE(?KHO),HIDE
                               ITEM('Kiosk Sales'),USE(?KOS),HIDE
                               ITEM('Journal Analysis Export'),USE(?ReportsSalesPointofSaleJournalAnalysisExport)
                             END
                             MENU('Operator Sales'),USE(?082OS)
                               ITEM('Summary'),USE(?082O)
                               MENU('Detailed - Between Dates'),USE(?082OSD)
                                 ITEM('Specific Operator'),USE(?082OSBD)
                                 ITEM('All Operators'),USE(?082OSDAO)
                               END
                               ITEM('Tender Breakdown'),USE(?082TBD)
                             END
                             ITEM('Cashing Up Summary'),USE(?082CUS)
                             ITEM('Cashing Up Summary Detailed'),USE(?ReCUSD)
                             ITEM('Cashing Up Summary (CC split)'),USE(?ReCUSDsplit),HIDE
                             MENU('&Hourly Sales'),USE(?082HS)
                               ITEM('Be&tween Dates'),USE(?RHSBD)
                               MENU('For Week'),USE(?082HSFW)
                                 ITEM('All &Outlets'),USE(?082HSFWAO)
                                 ITEM('Specific Outlet'),USE(?082HSFWSO)
                               END
                               ITEM('So &far today @ this site'),USE(?082SHSFTTS)
                             END
                             ITEM('Activity - Between Dates'),USE(?082ABD)
                             MENU('Special Orders Between Dates'),USE(?082SOBD)
                               ITEM('A&ll'),USE(?082SOBDA)
                               ITEM('Live'),USE(?082SOBDL)
                               ITEM('&Completed'),USE(?082SOBDCOM)
                               ITEM('Cancelled'),USE(?082SOBDC)
                             END
                             MENU('Supplier'),USE(?RSSupp)
                               ITEM('Specific Supplier Analysis'),USE(?082SSA)
                               ITEM('All - Totals Only'),USE(?RSSupTO)
                             END
                             ITEM('UDF - Totals Only'),USE(?RSUDFTO)
                             ITEM('By Selling Price Break'),USE(?082SPB)
                             MENU('Customer Account'),USE(?082CA)
                               ITEM('Debtors List for Outlet'),USE(?082CADLFO)
                               ITEM('Top Worst Account Customers'),USE(?082CATWACT)
                               MENU('Aged &Debtors'),USE(?082AD)
                                 ITEM('All O&utlets'),USE(?082ADFC)
                                 ITEM('for Specific Outlet'),USE(?082ADFSO)
                                 ITEM('for Specific Account'),USE(?082ADFSA)
                               END
                               MENU('Bet&ween Dates'),USE(?082CABD2)
                                 MENU('Specific Account'),USE(?082CABDS)
                                   ITEM('Product Detail Level'),USE(?082CABD)
                                   ITEM('Account Summary'),USE(?082CABDS2)
                                   ITEM('Invoice Summary'),USE(?082CABDS2IS)
                                 END
                                 MENU('All Accounts'),USE(?082CABDAA)
                                   ITEM('&Product Detail Level'),USE(?082CABDAA3)
                                   ITEM('Spec&ific Product'),USE(?082CABDAA4)
                                   ITEM('Totals Only By Date'),USE(?082CABDTO)
                                   ITEM('To&tals Only'),USE(?082CABDAA2)
                                   ITEM('A&ccount Summary'),USE(?082CABDAA5)
                                   ITEM('Payment Breakdown'),USE(?082CABDAA6)
                                 END
                                 MENU('Account Spends'),USE(?082CAAS)
                                   ITEM('S&pecific outlet'),USE(?082CAASS)
                                   ITEM('For company, By outlet'),USE(?082CAASFC)
                                 END
                               END
                               ITEM('Post Dated Cheques'),USE(?082CAPDC)
                               ITEM,USE(?SEPARATOR23),SEPARATOR
                               ITEM('Present Account Allowances'),USE(?082AA)
                               ITEM('Over used Allowances'),USE(?082CAOUA)
                               ITEM('Free Allowance Movements'),USE(?082CAFAM)
                               ITEM('Buying Allowance Movements'),USE(?082CABAM)
                             END
                             MENU('Nominal Accounts'),USE(?082CANA)
                               ITEM('For Company - Totals'),USE(?082CANAFO)
                               ITEM('For Area'),USE(?082CANAFA)
                               ITEM('&For Company, By Outlet'),USE(?082CANAFC2)
                               MENU('Sub Account'),USE(?082CANASA)
                                 ITEM('&For Company - Totals'),USE(?082CANASA2)
                                 ITEM('For &Area'),USE(?082CANASA3)
                                 ITEM('F&or Company, By Outlet'),USE(?082CANASA4)
                                 ITEM('For Company - Outlet - Area - [Easy Export]'),USE(?082NASAFC)
                               END
                             END
                             MENU('Stall &Holders'),USE(?082SH)
                               ITEM('Commission Breakdown'),USE(?082SHCB)
                               MENU('Commission Summary'),USE(?082SHCS2)
                                 ITEM('Between Dates - Totals Only'),USE(?082SHCS)
                                 ITEM('For Cheque Number - Totals Only'),USE(?082SHCSFC)
                                 ITEM('Sales and Commission Between Dates'),USE(?082SHCSSA)
                               END
                               MENU('Payouts'),USE(?082SHP2)
                                 ITEM('Calculate Payouts'),USE(?082SHP)
                                 ITEM('Outstanding Payouts Between Dates'),USE(?082SHPOP)
                                 ITEM('Completed Payouts Between Dates'),USE(?082SHPCP)
                                 ITEM('Cheque No Changes Report'),USE(?082SHPCNCR)
                               END
                               ITEM('All Stall Holder Sales Between Dates'),USE(?082SHASHSB)
                             END
                             MENU('Vouchers'),USE(?V)
                               ITEM('UnRedeemed - Summary'),USE(?V2)
                               ITEM('UnRedeemed - Detailed'),USE(?V3)
                               ITEM('Quick View'),USE(?V4),DISABLE,HIDE
                             END
                             ITEM('Postcode Sales Summary'),USE(?RSPcSS),HIDE
                             ITEM('Postcode Analysis'),USE(?BDCPCA),HIDE
                             ITEM('Passenger Movements'),USE(?RptSPsMvnt),HIDE
                             ITEM('Web Sales Diff'),USE(?RSWSDif),HIDE
                             ITEM('Call Centre Sales'),USE(?RSCCSs),HIDE
                           END
                           ITEM,USE(?SEPARATOR24),SEPARATOR
                           MENU('&Purchases'),USE(?N083)
                             ITEM('All Purchase Orders Between Dates'),USE(?083APOBD)
                             ITEM('&Live Purchase Orders'),USE(?083LPO)
                             MENU('Batch &Print'),USE(?083BP)
                               ITEM('Purchase Orders'),USE(?083BPPO)
                               MENU('Goods In'),USE(?083BPGSI)
                                 ITEM('Betw&een Dates'),USE(?083BPGIBD)
                                 ITEM('Pr&oduct Level'),USE(?083BPGI)
                                 ITEM('Product Level - Totals Only (Export)'),USE(?REPGIPLT)
                                 ITEM('Department Level - Totals Only (Export)'),USE(?RDLTOE)
                                 ITEM('By Supplier - Totals Only'),USE(?R2_111)
                                 ITEM('By Department - Totals Only'),USE(?R2_112)
                               END
                             END
                             MENU('Matri&x'),USE(?083M2)
                               ITEM('C&ompleted'),USE(?083M)
                               ITEM('Li&ve'),USE(?083ML)
                               ITEM('Back Orders'),USE(?083MBO)
                             END
                             ITEM('Back Order by Supplier'),USE(?083BOBS)
                             ITEM('Back Orders for Product'),USE(?083BOFP)
                             ITEM('Invoice Matching'),USE(?RPIM)
                             ITEM('Credit Note Matching'),USE(?RCNM),HIDE
                             ITEM('Outsd PreOrder Products by Suppliers'),USE(?RPOdPOPbSr)
                             ITEM('PO Forecast Export'),USE(?083POFE)
                           END
                           ITEM,USE(?SEPARATOR25),SEPARATOR
                           MENU('VAT Analysis'),USE(?N084)
                             MENU('&For Company between Dates'),USE(?084FCBD)
                               ITEM('Tot&als Only'),USE(?ReportsVat)
                               ITEM('VAT Rate Breakdown'),USE(?084FCBDVR)
                               ITEM('VAT Rate Breakdown (Export / EU Split)'),USE(?084FCBDVR2)
                             END
                             ITEM('For Outlet, Product Breakdown  (Totals Only)'),USE(?084FOPBD)
                             ITEM('By Department / Dept, Sub Group'),USE(?084BD)
                           END
                           ITEM,USE(?SEPARATOR26),SEPARATOR
                           MENU('S&tocks'),USE(?ReportsStocks)
                             ITEM('Movement of stock in limbo'),USE(?085SHM)
                             ITEM('Valuation of stock in limbo'),USE(?085VOSIL)
                             MENU('Stock &Levels'),USE(?085SL)
                               ITEM('All Shops'),USE(?085SLAS)
                               ITEM('Ageing Analysis'),USE(?085SLAA)
                               MENU('Matr&ix'),USE(?085SLM2)
                                 ITEM('B&asic'),USE(?085SLM)
                                 ITEM('D&etailed'),USE(?085SLMD)
                                 ITEM('Excel Export'),USE(?N9912)
                               END
                               MENU('Spe&cific Shop'),USE(?085SLSS2)
                                 ITEM('All Stocks'),USE(?085SLSSHOP)
                                 ITEM('F&or Department, Sub Group'),USE(?085SLSSFD)
                               END
                               MENU('Specific Supplier'),USE(?085SLSS)
                                 ITEM('A&ll Shops'),USE(?085SLSSAS)
                                 ITEM('Specific Shop'),USE(?085SLSSSS)
                               END
                               ITEM('&By Selling Price Break'),USE(?085SLBSPB)
                             END
                             ITEM('Negative Stock Spe&cific Outlet'),USE(?085NSSS)
                             MENU('&Valuations'),USE(?085V)
                               MENU('&Current'),USE(?085VC)
                                 MENU('&All Outlets'),USE(?085VCAO)
                                   ITEM('By &Dept - Product Level'),USE(?085VCAS)
                                   ITEM('By Dept, By &Sub Group - Product Level'),USE(?085VCAOBDB)
                                   ITEM('By Supplier, By Dept - Product Level'),USE(?085VCAOBS)
                                   ITEM,USE(?SEPARATOR27),SEPARATOR
                                   ITEM('By Dept - Totals Only'),USE(?085VCAOBDT)
                                   ITEM('By Dept, By Sub Group - Totals Only'),USE(?085VCAOBDB2)
                                 END
                                 MENU('Spe&cific Outlet'),USE(?085VCSO)
                                   ITEM('By D&ept - Product Level'),USE(?085VCSS)
                                   ITEM('By Dept, By S&ub Group - Product Level'),USE(?085VCSOBD)
                                   ITEM('By Supplier, By Dept - P&roduct Level'),USE(?085VCSOBS)
                                   ITEM('For Specific Supplier'),USE(?085VCSOS)
                                   ITEM,USE(?SEPARATOR28),SEPARATOR
                                   ITEM('By Dept - Totals O&nly'),USE(?085VCSOBD2)
                                   ITEM('By Dept, By Sub Group - T&otals Only'),USE(?085VCSOBD3)
                                 END
                               END
                               ITEM('At last stocktake for specific supplier'),USE(?085VALSTSO3)
                               ITEM('At specific stocktake'),USE(?085VALSAS)
                               MENU('S&ummary'),USE(?085VS)
                                 ITEM('By Department - Product Level'),USE(?StkValSummByDeptProd)
                                 ITEM('By Department - &Totals Only'),USE(?StkValsSummByDeptTot)
                                 ITEM('By Supplier - &Totals Only'),USE(?RBSTO1)
                               END
                             END
                             MENU('Transfer Reports'),USE(?STRPT)
                               ITEM('Transfers FROM an Outlet'),USE(?N9911)
                               ITEM('Transfers TO an Outlet'),USE(?N9910)
                               ITEM('Transfer Notes Range'),USE(?N9909)
                               ITEM('Matrix Export'),USE(?ME)
                               MENU('Matrix - Transfers with Profit'),USE(?N9908)
                                 MENU('Betwee&n Dates'),USE(?N9907)
                                   ITEM('Dept / Sub Group / Product Level'),USE(?N9906)
                                   ITEM('Outlet Matrix'),USE(?N9905)
                                 END
                                 ITEM('Yearly Breakdown'),USE(?N9904)
                               END
                             END
                             ITEM('Over Stocks'),USE(?N9903)
                             ITEM('Over Stock Transfers'),USE(?ROST)
                           END
                           ITEM,USE(?SEPARATOR29),SEPARATOR
                           MENU('&Hire'),USE(?N9902)
                             ITEM('Returns on'),USE(?RHireNotYR)
                           END
                           ITEM,USE(?SEPARATOR30),SEPARATOR
                           MENU('&Account Customers'),USE(?AccountCustomers)
                             ITEM('Entered On Specified Date'),USE(?N9901)
                           END
                           ITEM('Tour Report'),USE(?N08TR),HIDE
                           ITEM('Web Promo by Postcode'),USE(?N08WPCSS),HIDE
                           MENU('Driver Loyalty'),USE(?RDL),HIDE
                             ITEM('Sales Benween Dates'),USE(?RDLSBD)
                             ITEM('Point Analysis Between Dates'),USE(?DLPABD)
                             ITEM('Drivers Current Points'),USE(?DLDCP)
                           END
                           ITEM('Postcode Lookup Analysis'),USE(?PCLA)
                           ITEM,USE(?SEPARATOR31),SEPARATOR
                           ITEM('Subject Access Request (GDPR)'),USE(?GDPRSAR),DISABLE
                         END
                         ITEM('&About'),USE(?HelpAbout)