{
	"info": {
		"_postman_id": "735192f3-ca30-4baa-87ae-5a239c37f9c3",
		"name": "java-springboot",
		"schema": "https://schema.getpostman.com/json/collection/v2.1.0/collection.json",
		"_exporter_id": "22137703"
	},
	"item": [
		{
			"name": "Get All Users",
			"protocolProfileBehavior": {
				"disableBodyPruning": true
			},
			"request": {
				"method": "GET",
				"header": [],
				"body": {
					"mode": "raw",
					"raw": ""
				},
				"url": {
					"raw": "http://localhost:8080/api/users",
					"protocol": "http",
					"host": [
						"localhost"
					],
					"port": "8080",
					"path": [
						"api",
						"users"
					]
				}
			},
			"response": []
		},
		{
			"name": "Add new user",
			"request": {
				"method": "POST",
				"header": [],
				"body": {
					"mode": "raw",
					"raw": "{\r\n    \"name\": \"Tinnakorn Siritanyapong\"\r\n}",
					"options": {
						"raw": {
							"language": "json"
						}
					}
				},
				"url": {
					"raw": "http://localhost:8080/api/users",
					"protocol": "http",
					"host": [
						"localhost"
					],
					"port": "8080",
					"path": [
						"api",
						"users"
					]
				}
			},
			"response": []
		},
		{
			"name": "Delete user",
			"request": {
				"method": "DELETE",
				"header": [],
				"body": {
					"mode": "raw",
					"raw": ""
				},
				"url": {
					"raw": "http://localhost:8080/api/users/:user",
					"protocol": "http",
					"host": [
						"localhost"
					],
					"port": "8080",
					"path": [
						"api",
						"users",
						":user"
					],
					"variable": [
						{
							"key": "user",
							"value": "Tinnakorn"
						}
					]
				}
			},
			"response": []
		},
		{
			"name": "Get All Users Bean",
			"request": {
				"method": "GET",
				"header": [],
				"url": {
					"raw": "http://localhost:8080/api/userbeans",
					"protocol": "http",
					"host": [
						"localhost"
					],
					"port": "8080",
					"path": [
						"api",
						"userbeans"
					]
				}
			},
			"response": []
		},
		{
			"name": "Add new user bean",
			"request": {
				"method": "POST",
				"header": [],
				"body": {
					"mode": "raw",
					"raw": "{\r\n    \"name\": \"Tinnakorn\",\r\n    \"surname\": \"Siritanyapong\",\r\n    \"age\": \"41\"\r\n}",
					"options": {
						"raw": {
							"language": "json"
						}
					}
				},
				"url": {
					"raw": "http://localhost:8080/api/userbeans",
					"protocol": "http",
					"host": [
						"localhost"
					],
					"port": "8080",
					"path": [
						"api",
						"userbeans"
					]
				}
			},
			"response": []
		},
		{
			"name": "Delete user bean",
			"request": {
				"method": "DELETE",
				"header": [],
				"body": {
					"mode": "raw",
					"raw": ""
				},
				"url": {
					"raw": "http://localhost:8080/api/userbeans/:user",
					"protocol": "http",
					"host": [
						"localhost"
					],
					"port": "8080",
					"path": [
						"api",
						"userbeans",
						":user"
					],
					"variable": [
						{
							"key": "user",
							"value": "Tinnakorn"
						}
					]
				}
			},
			"response": []
		},
		{
			"name": "Get All Users Entity",
			"request": {
				"method": "GET",
				"header": [],
				"url": {
					"raw": "http://localhost:8080/api/userentities",
					"protocol": "http",
					"host": [
						"localhost"
					],
					"port": "8080",
					"path": [
						"api",
						"userentities"
					]
				}
			},
			"response": []
		},
		{
			"name": "Add new User Entity",
			"request": {
				"method": "POST",
				"header": [],
				"body": {
					"mode": "raw",
					"raw": "{\r\n    \"id\": \"1234567890124\",\r\n    \"name\": \"Alesandro\",\r\n    \"surname\": \"Nuyie\",\r\n    \"age\": \"41\",\r\n    \"address\": \"334/108 10400\"\r\n}",
					"options": {
						"raw": {
							"language": "json"
						}
					}
				},
				"url": {
					"raw": "http://localhost:8080/api/userentities",
					"protocol": "http",
					"host": [
						"localhost"
					],
					"port": "8080",
					"path": [
						"api",
						"userentities"
					]
				}
			},
			"response": []
		},
		{
			"name": "Delete User Entity",
			"request": {
				"method": "DELETE",
				"header": [],
				"body": {
					"mode": "raw",
					"raw": ""
				},
				"url": {
					"raw": "http://localhost:8080/api/userentities/:user",
					"protocol": "http",
					"host": [
						"localhost"
					],
					"port": "8080",
					"path": [
						"api",
						"userentities",
						":user"
					],
					"variable": [
						{
							"key": "user",
							"value": "Alesandro"
						}
					]
				}
			},
			"response": []
		}
	]
}