#FIG 3.2
Landscape
Center
Inches
Letter  
100.00
Single
-2
1200 2
1 1 0 2 0 7 50 -1 -1 0.000 1 0.0000 3450 7500 675 225 3450 7500 4125 7725
1 1 0 2 0 7 50 -1 -1 0.000 1 0.0000 5850 6000 675 225 5850 6000 6525 6225
1 1 0 2 0 7 50 -1 -1 0.000 1 0.0000 7650 7500 375 225 7650 7500 8025 7725
1 1 0 2 0 7 50 -1 -1 0.000 1 0.0000 7650 7500 450 300 7650 7500 8100 7800
1 3 0 2 0 7 50 -1 -1 0.000 1 0.0000 9308 7524 212 212 9308 7524 9458 7674
1 3 0 2 0 7 50 -1 -1 0.000 1 0.0000 9300 6000 212 212 9300 6000 9450 6150
2 1 0 2 0 7 50 -1 -1 0.000 0 0 -1 0 0 3
	 2625 7350 2775 7500 2625 7650
2 1 0 2 0 7 50 -1 -1 0.000 0 0 -1 1 0 2
	0 0 2.00 120.00 240.00
	 4125 7500 7200 7500
2 1 0 2 0 7 50 -1 -1 0.000 0 0 -1 1 0 2
	0 0 2.00 120.00 240.00
	 3879 7338 5400 6150
2 1 0 2 0 7 50 -1 -1 0.000 0 0 -1 1 0 2
	0 0 2.00 120.00 240.00
	 7950 7275 9150 6150
2 1 0 2 0 7 50 -1 -1 0.000 0 0 -1 1 0 2
	0 0 2.00 120.00 240.00
	 8080 7514 9075 7500
2 1 0 2 0 7 50 -1 -1 0.000 0 0 -1 1 0 2
	0 0 2.00 120.00 240.00
	 9300 6225 9300 7275
2 1 0 2 0 7 50 -1 -1 0.000 0 0 -1 1 0 2
	0 0 2.00 120.00 240.00
	 9075 6000 6525 6000
2 1 0 2 0 7 50 -1 -1 0.000 0 0 -1 1 0 2
	0 0 2.00 120.00 240.00
	 6094 6203 7350 7275
3 2 0 2 0 7 50 -1 -1 0.000 0 1 0 4
	0 0 2.00 120.00 240.00
	 5165 5945 4650 5925 4650 6075 5191 6094
	 0.000 -1.000 -1.000 0.000
3 2 0 2 0 7 50 -1 -1 0.000 0 1 0 4
	0 0 2.00 120.00 240.00
	 9450 7350 9750 6900 9975 7125 9525 7425
	 0.000 -1.000 -1.000 0.000
4 0 0 50 -1 12 16 0.0000 4 180 1050 2925 7575 0,1,3,5\001
4 0 0 50 -1 12 16 0.0000 4 180 1050 5325 6075 1,3,4,5\001
4 0 0 50 -1 12 16 0.0000 4 180 450 7425 7575 2,6\001
4 0 0 50 -1 3 16 0.0000 0 120 120 5625 7725 a\001
4 0 0 50 -1 3 16 0.0000 0 165 120 4500 6675 b\001
4 0 0 50 -1 3 16 0.0000 0 165 120 4350 6075 b\001
4 0 0 50 -1 12 16 0.0000 4 150 150 9225 6075 3\001
4 0 0 50 -1 3 16 0.0000 0 120 120 8475 6675 a\001
4 0 0 50 -1 3 16 5.5851 0 195 300 9900 6825 a,b\001
4 0 0 50 -1 3 16 0.0000 0 165 120 8625 7800 b\001
4 0 0 50 -1 3 16 0.0000 0 120 120 9375 6825 a\001
4 0 0 50 -1 3 16 0.0000 0 165 120 7950 6225 b\001
4 0 0 50 -1 3 16 0.0000 0 120 120 6825 6750 a\001
