%!PS-Adobe-2.0 EPSF-2.0
%%Title: pikMed.fig
%%Creator: fig2dev Version 3.2 Patchlevel 4
%%CreationDate: Wed Dec  2 22:00:32 2009
%%For: raparede@niches-dhcp-wireless-172.17.49.41.in.utalca.cl (Rodrigo Paredes)
%%BoundingBox: 0 0 585 309
%%Magnification: 1.0000
%%EndComments
/$F2psDict 200 dict def
$F2psDict begin
$F2psDict /mtrx matrix put
/col-1 {0 setgray} bind def
/col0 {0.000 0.000 0.000 srgb} bind def
/col1 {0.000 0.000 1.000 srgb} bind def
/col2 {0.000 1.000 0.000 srgb} bind def
/col3 {0.000 1.000 1.000 srgb} bind def
/col4 {1.000 0.000 0.000 srgb} bind def
/col5 {1.000 0.000 1.000 srgb} bind def
/col6 {1.000 1.000 0.000 srgb} bind def
/col7 {1.000 1.000 1.000 srgb} bind def
/col8 {0.000 0.000 0.560 srgb} bind def
/col9 {0.000 0.000 0.690 srgb} bind def
/col10 {0.000 0.000 0.820 srgb} bind def
/col11 {0.530 0.810 1.000 srgb} bind def
/col12 {0.000 0.560 0.000 srgb} bind def
/col13 {0.000 0.690 0.000 srgb} bind def
/col14 {0.000 0.820 0.000 srgb} bind def
/col15 {0.000 0.560 0.560 srgb} bind def
/col16 {0.000 0.690 0.690 srgb} bind def
/col17 {0.000 0.820 0.820 srgb} bind def
/col18 {0.560 0.000 0.000 srgb} bind def
/col19 {0.690 0.000 0.000 srgb} bind def
/col20 {0.820 0.000 0.000 srgb} bind def
/col21 {0.560 0.000 0.560 srgb} bind def
/col22 {0.690 0.000 0.690 srgb} bind def
/col23 {0.820 0.000 0.820 srgb} bind def
/col24 {0.500 0.190 0.000 srgb} bind def
/col25 {0.630 0.250 0.000 srgb} bind def
/col26 {0.750 0.380 0.000 srgb} bind def
/col27 {1.000 0.500 0.500 srgb} bind def
/col28 {1.000 0.630 0.630 srgb} bind def
/col29 {1.000 0.750 0.750 srgb} bind def
/col30 {1.000 0.880 0.880 srgb} bind def
/col31 {1.000 0.840 0.000 srgb} bind def

end
save
newpath 0 309 moveto 0 0 lineto 585 0 lineto 585 309 lineto closepath clip newpath
-84.2 481.6 translate
1 -1 scale

/cp {closepath} bind def
/ef {eofill} bind def
/gr {grestore} bind def
/gs {gsave} bind def
/sa {save} bind def
/rs {restore} bind def
/l {lineto} bind def
/m {moveto} bind def
/rm {rmoveto} bind def
/n {newpath} bind def
/s {stroke} bind def
/sh {show} bind def
/slc {setlinecap} bind def
/slj {setlinejoin} bind def
/slw {setlinewidth} bind def
/srgb {setrgbcolor} bind def
/rot {rotate} bind def
/sc {scale} bind def
/sd {setdash} bind def
/ff {findfont} bind def
/sf {setfont} bind def
/scf {scalefont} bind def
/sw {stringwidth} bind def
/tr {translate} bind def
/tnt {dup dup currentrgbcolor
  4 -2 roll dup 1 exch sub 3 -1 roll mul add
  4 -2 roll dup 1 exch sub 3 -1 roll mul add
  4 -2 roll dup 1 exch sub 3 -1 roll mul add srgb}
  bind def
/shd {dup dup currentrgbcolor 4 -2 roll mul 4 -2 roll mul
  4 -2 roll mul srgb} bind def
/reencdict 12 dict def /ReEncode { reencdict begin
/newcodesandnames exch def /newfontname exch def /basefontname exch def
/basefontdict basefontname findfont def /newfont basefontdict maxlength dict def
basefontdict { exch dup /FID ne { dup /Encoding eq
{ exch dup length array copy newfont 3 1 roll put }
{ exch newfont 3 1 roll put } ifelse } { pop pop } ifelse } forall
newfont /FontName newfontname put newcodesandnames aload pop
128 1 255 { newfont /Encoding get exch /.notdef put } for
newcodesandnames length 2 idiv { newfont /Encoding get 3 1 roll put } repeat
newfontname newfont definefont pop end } def
/isovec [
8#055 /minus 8#200 /grave 8#201 /acute 8#202 /circumflex 8#203 /tilde
8#204 /macron 8#205 /breve 8#206 /dotaccent 8#207 /dieresis
8#210 /ring 8#211 /cedilla 8#212 /hungarumlaut 8#213 /ogonek 8#214 /caron
8#220 /dotlessi 8#230 /oe 8#231 /OE
8#240 /space 8#241 /exclamdown 8#242 /cent 8#243 /sterling
8#244 /currency 8#245 /yen 8#246 /brokenbar 8#247 /section 8#250 /dieresis
8#251 /copyright 8#252 /ordfeminine 8#253 /guillemotleft 8#254 /logicalnot
8#255 /hyphen 8#256 /registered 8#257 /macron 8#260 /degree 8#261 /plusminus
8#262 /twosuperior 8#263 /threesuperior 8#264 /acute 8#265 /mu 8#266 /paragraph
8#267 /periodcentered 8#270 /cedilla 8#271 /onesuperior 8#272 /ordmasculine
8#273 /guillemotright 8#274 /onequarter 8#275 /onehalf
8#276 /threequarters 8#277 /questiondown 8#300 /Agrave 8#301 /Aacute
8#302 /Acircumflex 8#303 /Atilde 8#304 /Adieresis 8#305 /Aring
8#306 /AE 8#307 /Ccedilla 8#310 /Egrave 8#311 /Eacute
8#312 /Ecircumflex 8#313 /Edieresis 8#314 /Igrave 8#315 /Iacute
8#316 /Icircumflex 8#317 /Idieresis 8#320 /Eth 8#321 /Ntilde 8#322 /Ograve
8#323 /Oacute 8#324 /Ocircumflex 8#325 /Otilde 8#326 /Odieresis 8#327 /multiply
8#330 /Oslash 8#331 /Ugrave 8#332 /Uacute 8#333 /Ucircumflex
8#334 /Udieresis 8#335 /Yacute 8#336 /Thorn 8#337 /germandbls 8#340 /agrave
8#341 /aacute 8#342 /acircumflex 8#343 /atilde 8#344 /adieresis 8#345 /aring
8#346 /ae 8#347 /ccedilla 8#350 /egrave 8#351 /eacute
8#352 /ecircumflex 8#353 /edieresis 8#354 /igrave 8#355 /iacute
8#356 /icircumflex 8#357 /idieresis 8#360 /eth 8#361 /ntilde 8#362 /ograve
8#363 /oacute 8#364 /ocircumflex 8#365 /otilde 8#366 /odieresis 8#367 /divide
8#370 /oslash 8#371 /ugrave 8#372 /uacute 8#373 /ucircumflex
8#374 /udieresis 8#375 /yacute 8#376 /thorn 8#377 /ydieresis] def
/Times-BoldItalic /Times-BoldItalic-iso isovec ReEncode
/Times-Roman /Times-Roman-iso isovec ReEncode
 /DrawEllipse {
	/endangle exch def
	/startangle exch def
	/yrad exch def
	/xrad exch def
	/y exch def
	/x exch def
	/savematrix mtrx currentmatrix def
	x y tr xrad yrad sc 0 0 1 startangle endangle arc
	closepath
	savematrix setmatrix
	} def

/$F2psBegin {$F2psDict begin /$F2psEnteredState save def} def
/$F2psEnd {$F2psEnteredState restore end} def

$F2psBegin
10 setmiterlimit
0 slj 0 slc
 0.06000 0.06000 sc
%
% Fig objects follow
%
% 
% here starts figure with depth 50
/Symbol ff 270.00 scf sf
3075 5400 m
gs 1 -1 sc (S,_,_) col0 sh gr
/Symbol ff 270.00 scf sf
4262 5252 m
gs 1 -1 sc  70.0 rot (e,   ,_) col0 sh gr
/Symbol ff 270.00 scf sf
4800 3075 m
gs 1 -1 sc (e,) col0 sh gr
/Times-BoldItalic-iso ff 270.00 scf sf
5025 3075 m
gs 1 -1 sc (EEEI,_) col0 sh gr
% Ellipse
15.000 slw
n 3607 4207 212 212 0 360 DrawEllipse gs col0 s gr

% Ellipse
n 1776 4208 212 212 0 360 DrawEllipse gs col0 s gr

% Ellipse
n 5400 4200 212 212 0 360 DrawEllipse gs col0 s gr

% Ellipse
n 7200 7800 212 212 0 360 DrawEllipse gs col0 s gr

% Ellipse
n 9000 7800 212 212 0 360 DrawEllipse gs col0 s gr

% Ellipse
n 10800 7800 212 212 0 360 DrawEllipse gs col0 s gr

% Ellipse
n 3300 6600 212 212 0 360 DrawEllipse gs col0 s gr

% Ellipse
n 3300 6600 270 270 0 360 DrawEllipse gs col0 s gr

% Ellipse
n 7200 4200 212 212 0 360 DrawEllipse gs col0 s gr

% Ellipse
n 7200 6000 212 212 0 360 DrawEllipse gs col0 s gr

% Polyline
gs  clippath
3390 4260 m 3390 4140 l 3102 4140 l 3342 4200 l 3102 4260 l cp
eoclip
n 1950 4200 m
 3375 4200 l gs col0 s gr gr

% arrowhead
n 3102 4260 m 3342 4200 l 3102 4140 l  col0 s
% Polyline
gs  clippath
5190 4260 m 5190 4140 l 4902 4140 l 5142 4200 l 4902 4260 l cp
eoclip
n 3825 4200 m
 5175 4200 l gs col0 s gr gr

% arrowhead
n 4902 4260 m 5142 4200 l 4902 4140 l  col0 s
% Polyline
gs  clippath
6990 4260 m 6990 4140 l 6702 4140 l 6942 4200 l 6702 4260 l cp
eoclip
n 5625 4200 m
 6975 4200 l gs col0 s gr gr

% arrowhead
n 6702 4260 m 6942 4200 l 6702 4140 l  col0 s
% Polyline
gs  clippath
7140 5790 m 7260 5790 l 7260 5502 l 7200 5742 l 7140 5502 l cp
eoclip
n 7200 4425 m
 7200 5775 l gs col0 s gr gr

% arrowhead
n 7140 5502 m 7200 5742 l 7260 5502 l  col0 s
% Polyline
gs  clippath
7140 7590 m 7260 7590 l 7260 7302 l 7200 7542 l 7140 7302 l cp
eoclip
n 7200 6225 m
 7200 7575 l gs col0 s gr gr

% arrowhead
n 7140 7302 m 7200 7542 l 7260 7302 l  col0 s
% Polyline
gs  clippath
8790 7860 m 8790 7740 l 8502 7740 l 8742 7800 l 8502 7860 l cp
eoclip
n 7425 7800 m
 8775 7800 l gs col0 s gr gr

% arrowhead
n 8502 7860 m 8742 7800 l 8502 7740 l  col0 s
% Polyline
gs  clippath
10590 7860 m 10590 7740 l 10302 7740 l 10542 7800 l 10302 7860 l cp
eoclip
n 9225 7800 m
 10575 7800 l gs col0 s gr gr

% arrowhead
n 10302 7860 m 10542 7800 l 10302 7740 l  col0 s
% Polyline
n 1425 4050 m 1575 4200 l
 1425 4350 l gs col0 s gr 
% Polyline
2 slj
gs  clippath
3689 4037 m 3797 4089 l 3921 3829 l 3764 4020 l 3813 3777 l cp
eoclip
n 3450 4050 m 3449 4048 l 3447 4045 l 3443 4038 l 3437 4029 l 3429 4015 l
 3420 3999 l 3409 3979 l 3396 3956 l 3383 3931 l 3370 3905 l
 3357 3877 l 3345 3848 l 3333 3817 l 3322 3786 l 3313 3754 l
 3305 3720 l 3299 3684 l 3295 3646 l 3293 3607 l 3295 3566 l
 3300 3525 l 3308 3485 l 3319 3448 l 3331 3414 l 3343 3385 l
 3355 3360 l 3366 3338 l 3376 3320 l 3386 3305 l 3395 3291 l
 3404 3280 l 3413 3269 l 3421 3259 l 3431 3248 l 3442 3238 l
 3454 3227 l 3468 3215 l 3484 3203 l 3502 3190 l 3523 3177 l
 3547 3165 l 3573 3156 l 3600 3150 l 3625 3149 l 3649 3152 l
 3671 3156 l 3691 3163 l 3709 3170 l 3725 3177 l 3738 3184 l
 3751 3192 l 3761 3198 l 3771 3205 l 3779 3212 l 3788 3219 l
 3795 3226 l 3803 3234 l 3812 3244 l 3820 3255 l 3829 3268 l
 3839 3284 l 3850 3303 l 3861 3325 l 3872 3351 l 3883 3380 l
 3892 3414 l 3900 3450 l 3905 3488 l 3907 3527 l 3906 3566 l
 3903 3603 l 3898 3640 l 3891 3676 l 3883 3710 l 3874 3744 l
 3864 3777 l 3853 3810 l 3842 3841 l 3830 3872 l 3818 3901 l
 3806 3929 l 3794 3955 l 3784 3979 l 3774 3999 l 3767 4016 l
 3760 4029 l
 3750 4050 l gs col0 s gr gr

% arrowhead
0 slj
n 3813 3777 m 3764 4020 l 3921 3829 l  col0 s
% Polyline
2 slj
gs  clippath
5485 4051 m 5593 4103 l 5717 3843 l 5560 4034 l 5609 3791 l cp
eoclip
n 5246 4064 m 5245 4062 l 5243 4059 l 5239 4052 l 5233 4043 l 5225 4029 l
 5216 4013 l 5205 3993 l 5192 3970 l 5179 3945 l 5166 3919 l
 5153 3891 l 5141 3862 l 5129 3831 l 5118 3800 l 5109 3768 l
 5101 3734 l 5095 3698 l 5091 3660 l 5089 3621 l 5091 3580 l
 5096 3539 l 5104 3499 l 5115 3462 l 5127 3428 l 5139 3399 l
 5151 3374 l 5162 3352 l 5172 3334 l 5182 3319 l 5191 3305 l
 5200 3294 l 5209 3283 l 5217 3273 l 5227 3262 l 5238 3252 l
 5250 3241 l 5264 3229 l 5280 3217 l 5298 3204 l 5319 3191 l
 5343 3179 l 5369 3170 l 5396 3164 l 5421 3163 l 5445 3166 l
 5467 3170 l 5487 3177 l 5505 3184 l 5521 3191 l 5534 3198 l
 5547 3206 l 5557 3212 l 5567 3219 l 5575 3226 l 5584 3233 l
 5591 3240 l 5599 3248 l 5608 3258 l 5616 3269 l 5625 3282 l
 5635 3298 l 5646 3317 l 5657 3339 l 5668 3365 l 5679 3394 l
 5688 3428 l 5696 3464 l 5701 3502 l 5703 3541 l 5702 3580 l
 5699 3617 l 5694 3654 l 5687 3690 l 5679 3724 l 5670 3758 l
 5660 3791 l 5649 3824 l 5638 3855 l 5626 3886 l 5614 3915 l
 5602 3943 l 5590 3969 l 5580 3993 l 5570 4013 l 5563 4030 l
 5556 4043 l
 5546 4064 l gs col0 s gr gr

% arrowhead
0 slj
n 5609 3791 m 5560 4034 l 5717 3843 l  col0 s
% Polyline
2 slj
gs  clippath
5458 4405 m 5338 4415 l 5363 4702 l 5403 4458 l 5482 4692 l cp
eoclip
n 6975 7800 m 6974 7800 l 6973 7800 l 6970 7799 l 6966 7799 l 6960 7798 l
 6952 7797 l 6941 7795 l 6929 7793 l 6914 7790 l 6897 7787 l
 6878 7782 l 6856 7777 l 6833 7771 l 6808 7764 l 6782 7756 l
 6754 7746 l 6726 7735 l 6696 7723 l 6666 7709 l 6634 7693 l
 6603 7675 l 6570 7655 l 6537 7633 l 6503 7608 l 6469 7580 l
 6434 7549 l 6399 7515 l 6363 7477 l 6325 7434 l 6287 7387 l
 6248 7334 l 6208 7276 l 6168 7213 l 6126 7143 l 6084 7068 l
 6042 6986 l 6000 6900 l 5969 6831 l 5939 6761 l 5909 6689 l
 5881 6617 l 5854 6545 l 5828 6472 l 5804 6400 l 5780 6328 l
 5758 6257 l 5737 6186 l 5717 6116 l 5698 6047 l 5680 5978 l
 5662 5910 l 5646 5842 l 5630 5775 l 5615 5708 l 5601 5642 l
 5587 5576 l 5574 5510 l 5561 5445 l 5549 5381 l 5537 5317 l
 5526 5254 l 5515 5191 l 5504 5130 l 5495 5070 l 5485 5012 l
 5476 4955 l 5468 4900 l 5460 4847 l 5452 4797 l 5445 4750 l
 5438 4705 l 5433 4663 l 5427 4625 l 5422 4590 l 5418 4558 l
 5414 4531 l 5411 4507 l 5408 4486 l 5406 4469 l 5404 4455 l
 5403 4444 l 5401 4437 l
 5400 4425 l gs col0 s gr gr

% arrowhead
0 slj
n 5482 4692 m 5403 4458 l 5363 4702 l  col0 s
% Polyline
2 slj
n 7125 4425 m 7124 4426 l 7123 4429 l 7120 4435 l 7116 4443 l 7110 4455 l
 7102 4471 l 7092 4491 l 7080 4515 l 7066 4542 l 7050 4573 l
 7032 4607 l 7012 4644 l 6991 4683 l 6968 4724 l 6944 4766 l
 6919 4809 l 6892 4853 l 6865 4896 l 6837 4939 l 6808 4982 l
 6778 5024 l 6746 5065 l 6714 5105 l 6680 5144 l 6645 5181 l
 6608 5217 l 6569 5251 l 6529 5283 l 6486 5313 l 6442 5340 l
 6396 5364 l 6348 5384 l 6300 5400 l 6249 5411 l 6198 5417 l
 6149 5417 l 6103 5413 l 6058 5405 l 6016 5393 l 5976 5378 l
 5937 5360 l 5901 5340 l 5866 5317 l 5832 5292 l 5800 5265 l
 5768 5237 l 5738 5208 l 5709 5178 l 5681 5147 l 5654 5116 l
 5629 5085 l 5605 5055 l 5583 5026 l 5562 4999 l 5544 4974 l
 5527 4951 l 5513 4931 l 5502 4915 l 5493 4901 l 5486 4891 l
 5481 4883 l 5477 4879 l 5476 4876 l
 5475 4875 l gs col0 s gr 
% Polyline
n 6975 6000 m 6974 6001 l 6972 6004 l 6969 6010 l 6964 6018 l 6957 6030 l
 6948 6045 l 6936 6063 l 6922 6085 l 6906 6110 l 6888 6137 l
 6868 6167 l 6846 6198 l 6823 6230 l 6799 6263 l 6774 6295 l
 6748 6328 l 6721 6360 l 6693 6391 l 6664 6421 l 6634 6449 l
 6603 6476 l 6571 6501 l 6537 6525 l 6501 6545 l 6464 6564 l
 6425 6579 l 6384 6590 l 6342 6597 l 6300 6600 l 6255 6597 l
 6211 6589 l 6170 6576 l 6130 6559 l 6094 6538 l 6059 6515 l
 6027 6489 l 5996 6461 l 5967 6431 l 5940 6399 l 5914 6367 l
 5889 6332 l 5866 6298 l 5843 6262 l 5822 6228 l 5802 6193 l
 5783 6160 l 5766 6129 l 5751 6101 l 5737 6075 l 5726 6053 l
 5717 6036 l 5710 6022 l 5706 6012 l 5702 6005 l 5701 6002 l

 5700 6000 l gs col0 s gr 
% Polyline
gs  clippath
10889 7637 m 10997 7689 l 11121 7429 l 10964 7620 l 11013 7377 l cp
eoclip
n 10650 7650 m 10649 7648 l 10647 7645 l 10643 7638 l 10637 7629 l 10629 7615 l
 10620 7599 l 10609 7579 l 10596 7556 l 10583 7531 l 10570 7505 l
 10557 7477 l 10545 7448 l 10533 7417 l 10522 7386 l 10513 7354 l
 10505 7320 l 10499 7284 l 10495 7246 l 10493 7207 l 10495 7166 l
 10500 7125 l 10508 7085 l 10519 7048 l 10531 7014 l 10543 6985 l
 10555 6960 l 10566 6938 l 10576 6920 l 10586 6905 l 10595 6891 l
 10604 6880 l 10613 6869 l 10621 6859 l 10631 6848 l 10642 6838 l
 10654 6827 l 10668 6815 l 10684 6803 l 10702 6790 l 10723 6777 l
 10747 6765 l 10773 6756 l 10800 6750 l 10825 6749 l 10849 6752 l
 10871 6756 l 10891 6763 l 10909 6770 l 10925 6777 l 10938 6784 l
 10951 6792 l 10961 6798 l 10971 6805 l 10979 6812 l 10988 6819 l
 10995 6826 l 11003 6834 l 11012 6844 l 11020 6855 l 11029 6868 l
 11039 6884 l 11050 6903 l 11061 6925 l 11072 6951 l 11083 6980 l
 11092 7014 l 11100 7050 l 11105 7088 l 11107 7127 l 11106 7166 l
 11103 7203 l 11098 7240 l 11091 7276 l 11083 7310 l 11074 7344 l
 11064 7377 l 11053 7410 l 11042 7441 l 11030 7472 l 11018 7501 l
 11006 7529 l 10994 7555 l 10984 7579 l 10974 7599 l 10967 7616 l
 10960 7629 l
 10950 7650 l gs col0 s gr gr

% arrowhead
0 slj
n 11013 7377 m 10964 7620 l 11121 7429 l  col0 s
% Polyline
2 slj
gs  clippath
5583 4079 m 5640 4184 l 5893 4046 l 5654 4109 l 5835 3941 l cp
eoclip
n 9000 7575 m 9000 7574 l 9001 7572 l 9002 7569 l 9003 7563 l 9005 7555 l
 9008 7544 l 9012 7529 l 9017 7511 l 9022 7490 l 9029 7464 l
 9037 7434 l 9045 7399 l 9055 7361 l 9066 7317 l 9078 7270 l
 9090 7218 l 9104 7162 l 9118 7103 l 9133 7039 l 9149 6972 l
 9165 6901 l 9182 6827 l 9199 6751 l 9216 6672 l 9233 6591 l
 9250 6507 l 9267 6422 l 9284 6336 l 9300 6248 l 9316 6159 l
 9332 6070 l 9347 5980 l 9361 5890 l 9374 5799 l 9386 5708 l
 9397 5618 l 9407 5527 l 9416 5437 l 9423 5347 l 9429 5257 l
 9433 5168 l 9436 5080 l 9436 4992 l 9435 4904 l 9432 4818 l
 9427 4731 l 9419 4646 l 9410 4561 l 9397 4478 l 9382 4395 l
 9364 4313 l 9343 4233 l 9319 4153 l 9292 4076 l 9261 4000 l
 9226 3926 l 9189 3854 l 9147 3786 l 9102 3720 l 9053 3658 l
 9000 3600 l 8942 3545 l 8881 3495 l 8817 3450 l 8750 3411 l
 8682 3376 l 8613 3346 l 8541 3320 l 8469 3299 l 8396 3282 l
 8323 3269 l 8248 3260 l 8173 3255 l 8098 3253 l 8022 3254 l
 7946 3258 l 7870 3265 l 7793 3274 l 7716 3286 l 7639 3300 l
 7561 3317 l 7484 3336 l 7406 3356 l 7328 3378 l 7250 3402 l
 7172 3428 l 7094 3454 l 7016 3482 l 6939 3511 l 6862 3541 l
 6785 3572 l 6710 3603 l 6635 3635 l 6561 3667 l 6489 3699 l
 6419 3731 l 6350 3762 l 6284 3793 l 6219 3824 l 6158 3853 l
 6099 3882 l 6043 3910 l 5991 3936 l 5941 3960 l 5896 3984 l
 5854 4005 l 5816 4025 l 5781 4042 l 5751 4058 l 5724 4072 l
 5701 4084 l 5682 4095 l 5666 4103 l 5653 4110 l 5643 4115 l
 5636 4119 l
 5625 4125 l gs col0 s gr gr

% arrowhead
0 slj
n 5835 3941 m 5654 4109 l 5893 4046 l  col0 s
% Polyline
2 slj
gs  clippath
3580 6541 m 3589 6660 l 3876 6640 l 3633 6598 l 3868 6521 l cp
eoclip
n 5250 4350 m 5249 4350 l 5247 4350 l 5243 4351 l 5237 4352 l 5229 4354 l
 5218 4356 l 5204 4359 l 5187 4362 l 5168 4366 l 5147 4371 l
 5123 4377 l 5098 4384 l 5071 4392 l 5043 4401 l 5013 4411 l
 4983 4422 l 4953 4435 l 4922 4449 l 4891 4465 l 4859 4482 l
 4827 4502 l 4795 4524 l 4763 4549 l 4730 4576 l 4697 4607 l
 4664 4642 l 4631 4680 l 4597 4723 l 4564 4769 l 4531 4820 l
 4500 4875 l 4472 4929 l 4447 4984 l 4425 5038 l 4405 5091 l
 4389 5141 l 4376 5188 l 4366 5232 l 4359 5273 l 4355 5310 l
 4353 5344 l 4353 5375 l 4355 5403 l 4359 5429 l 4363 5453 l
 4369 5476 l 4375 5497 l 4381 5519 l 4388 5540 l 4394 5562 l
 4400 5584 l 4404 5608 l 4408 5634 l 4410 5662 l 4411 5693 l
 4409 5726 l 4405 5763 l 4399 5803 l 4390 5846 l 4378 5892 l
 4363 5941 l 4345 5992 l 4324 6045 l 4301 6098 l 4275 6150 l
 4244 6205 l 4212 6256 l 4180 6303 l 4147 6344 l 4115 6380 l
 4083 6412 l 4051 6440 l 4020 6465 l 3989 6486 l 3959 6504 l
 3928 6520 l 3898 6534 l 3869 6546 l 3840 6556 l 3811 6565 l
 3783 6572 l 3756 6578 l 3731 6583 l 3707 6588 l 3685 6591 l
 3666 6594 l 3649 6596 l 3634 6597 l 3623 6598 l 3614 6599 l

 3600 6600 l gs col0 s gr gr

% arrowhead
0 slj
n 3868 6521 m 3633 6598 l 3876 6640 l  col0 s
% Polyline
2 slj
gs  clippath
3389 6362 m 3497 6414 l 3621 6154 l 3464 6345 l 3513 6102 l cp
eoclip
n 3150 6375 m 3149 6373 l 3147 6370 l 3143 6363 l 3137 6354 l 3129 6340 l
 3120 6324 l 3109 6304 l 3096 6281 l 3083 6256 l 3070 6230 l
 3057 6202 l 3045 6173 l 3033 6142 l 3022 6111 l 3013 6079 l
 3005 6045 l 2999 6009 l 2995 5971 l 2993 5932 l 2995 5891 l
 3000 5850 l 3008 5810 l 3019 5773 l 3031 5739 l 3043 5710 l
 3055 5685 l 3066 5663 l 3076 5645 l 3086 5630 l 3095 5616 l
 3104 5605 l 3113 5594 l 3121 5584 l 3131 5573 l 3142 5563 l
 3154 5552 l 3168 5540 l 3184 5528 l 3202 5515 l 3223 5502 l
 3247 5490 l 3273 5481 l 3300 5475 l 3325 5474 l 3349 5477 l
 3371 5481 l 3391 5488 l 3409 5495 l 3425 5502 l 3438 5509 l
 3451 5517 l 3461 5523 l 3471 5530 l 3479 5537 l 3488 5544 l
 3495 5551 l 3503 5559 l 3512 5569 l 3520 5580 l 3529 5593 l
 3539 5609 l 3550 5628 l 3561 5650 l 3572 5676 l 3583 5705 l
 3592 5739 l 3600 5775 l 3605 5813 l 3607 5852 l 3606 5891 l
 3603 5928 l 3598 5965 l 3591 6001 l 3583 6035 l 3574 6069 l
 3564 6102 l 3553 6135 l 3542 6166 l 3530 6197 l 3518 6226 l
 3506 6254 l 3494 6280 l 3484 6304 l 3474 6324 l 3467 6341 l
 3460 6354 l
 3450 6375 l gs col0 s gr gr

% arrowhead
0 slj
n 3513 6102 m 3464 6345 l 3621 6154 l  col0 s
/Symbol ff 270.00 scf sf
2175 4050 m
gs 1 -1 sc (e,_,) col0 sh gr
/Times-BoldItalic-iso ff 270.00 scf sf
2625 4050 m
gs 1 -1 sc (Z) col0 sh gr
/Symbol ff 270.00 scf sf
4125 4050 m
gs 1 -1 sc (e,_,_) col0 sh gr
/Symbol ff 270.00 scf sf
7350 6450 m
gs 1 -1 sc  270.0 rot (-,_,_) col0 sh gr
/Symbol ff 270.00 scf sf
7350 4725 m
gs 1 -1 sc  270.0 rot (-,_,_) col0 sh gr
/Times-BoldItalic-iso ff 270.00 scf sf
5175 4950 m
gs 1 -1 sc  280.0 rot (E,_,E) col0 sh gr
/Symbol ff 270.00 scf sf
7650 7650 m
gs 1 -1 sc (-,_,_) col0 sh gr
/Symbol ff 270.00 scf sf
6000 4050 m
gs 1 -1 sc (-,_,_) col0 sh gr
/Times-BoldItalic-iso ff 270.00 scf sf
3450 3075 m
gs 1 -1 sc (I,_,I) col0 sh gr
/Symbol ff 270.00 scf sf
7800 3150 m
gs 1 -1 sc (e,) col0 sh gr
/Times-BoldItalic-iso ff 270.00 scf sf
8025 3150 m
gs 1 -1 sc (E,_) col0 sh gr
/Symbol ff 270.00 scf sf
9525 7650 m
gs 1 -1 sc (e) col0 sh gr
/Times-BoldItalic-iso ff 270.00 scf sf
9675 7650 m
gs 1 -1 sc (,I,I) col0 sh gr
/Times-Roman-iso ff 270.00 scf sf
1725 4350 m
gs 1 -1 sc (0) col0 sh gr
/Times-Roman-iso ff 270.00 scf sf
3525 4350 m
gs 1 -1 sc (1) col0 sh gr
/Times-Roman-iso ff 270.00 scf sf
5325 4275 m
gs 1 -1 sc (2) col0 sh gr
/Times-Roman-iso ff 270.00 scf sf
10725 7875 m
gs 1 -1 sc (8) col0 sh gr
/Times-Roman-iso ff 270.00 scf sf
3225 6675 m
gs 1 -1 sc (3) col0 sh gr
/Times-Roman-iso ff 270.00 scf sf
7125 4275 m
gs 1 -1 sc (4) col0 sh gr
/Times-Roman-iso ff 270.00 scf sf
7125 6075 m
gs 1 -1 sc (5) col0 sh gr
/Times-Roman-iso ff 270.00 scf sf
7125 7875 m
gs 1 -1 sc (6) col0 sh gr
/Times-Roman-iso ff 270.00 scf sf
8925 7875 m
gs 1 -1 sc (7) col0 sh gr
/Times-BoldItalic-iso ff 270.00 scf sf
4425 3450 m
gs 1 -1 sc (E,_,E) col0 sh gr
/Symbol ff 270.00 scf sf
10500 6675 m
gs 1 -1 sc (S,_,_) col0 sh gr
/Times-BoldItalic-iso ff 270.00 scf sf
4339 5040 m
gs 1 -1 sc  70.0 rot (Z) col0 sh gr
% here ends figure;
$F2psEnd
rs
showpage
