%!PS-Adobe-2.0 EPSF-2.0
%%Title: ap3-2.fig
%%Creator: fig2dev Version 3.2 Patchlevel 4
%%CreationDate: Sun Dec  6 04:17:00 2009
%%For: raparede@rayen.local (Rodrigo Paredes)
%%BoundingBox: 0 0 266 188
%%Magnification: 1.0000
%%EndComments
/$F2psDict 200 dict def
$F2psDict begin
$F2psDict /mtrx matrix put
/col-1 {0 setgray} bind def
/col0 {0.000 0.000 0.000 srgb} bind def
/col1 {0.000 0.000 1.000 srgb} bind def
/col2 {0.000 1.000 0.000 srgb} bind def
/col3 {0.000 1.000 1.000 srgb} bind def
/col4 {1.000 0.000 0.000 srgb} bind def
/col5 {1.000 0.000 1.000 srgb} bind def
/col6 {1.000 1.000 0.000 srgb} bind def
/col7 {1.000 1.000 1.000 srgb} bind def
/col8 {0.000 0.000 0.560 srgb} bind def
/col9 {0.000 0.000 0.690 srgb} bind def
/col10 {0.000 0.000 0.820 srgb} bind def
/col11 {0.530 0.810 1.000 srgb} bind def
/col12 {0.000 0.560 0.000 srgb} bind def
/col13 {0.000 0.690 0.000 srgb} bind def
/col14 {0.000 0.820 0.000 srgb} bind def
/col15 {0.000 0.560 0.560 srgb} bind def
/col16 {0.000 0.690 0.690 srgb} bind def
/col17 {0.000 0.820 0.820 srgb} bind def
/col18 {0.560 0.000 0.000 srgb} bind def
/col19 {0.690 0.000 0.000 srgb} bind def
/col20 {0.820 0.000 0.000 srgb} bind def
/col21 {0.560 0.000 0.560 srgb} bind def
/col22 {0.690 0.000 0.690 srgb} bind def
/col23 {0.820 0.000 0.820 srgb} bind def
/col24 {0.500 0.190 0.000 srgb} bind def
/col25 {0.630 0.250 0.000 srgb} bind def
/col26 {0.750 0.380 0.000 srgb} bind def
/col27 {1.000 0.500 0.500 srgb} bind def
/col28 {1.000 0.630 0.630 srgb} bind def
/col29 {1.000 0.750 0.750 srgb} bind def
/col30 {1.000 0.880 0.880 srgb} bind def
/col31 {1.000 0.840 0.000 srgb} bind def

end
save
newpath 0 188 moveto 0 0 lineto 266 0 lineto 266 188 lineto closepath clip newpath
-111.7 419.8 translate
1 -1 scale

/cp {closepath} bind def
/ef {eofill} bind def
/gr {grestore} bind def
/gs {gsave} bind def
/sa {save} bind def
/rs {restore} bind def
/l {lineto} bind def
/m {moveto} bind def
/rm {rmoveto} bind def
/n {newpath} bind def
/s {stroke} bind def
/sh {show} bind def
/slc {setlinecap} bind def
/slj {setlinejoin} bind def
/slw {setlinewidth} bind def
/srgb {setrgbcolor} bind def
/rot {rotate} bind def
/sc {scale} bind def
/sd {setdash} bind def
/ff {findfont} bind def
/sf {setfont} bind def
/scf {scalefont} bind def
/sw {stringwidth} bind def
/tr {translate} bind def
/tnt {dup dup currentrgbcolor
  4 -2 roll dup 1 exch sub 3 -1 roll mul add
  4 -2 roll dup 1 exch sub 3 -1 roll mul add
  4 -2 roll dup 1 exch sub 3 -1 roll mul add srgb}
  bind def
/shd {dup dup currentrgbcolor 4 -2 roll mul 4 -2 roll mul
  4 -2 roll mul srgb} bind def
 /DrawEllipse {
	/endangle exch def
	/startangle exch def
	/yrad exch def
	/xrad exch def
	/y exch def
	/x exch def
	/savematrix mtrx currentmatrix def
	x y tr xrad yrad sc 0 0 1 startangle endangle arc
	closepath
	savematrix setmatrix
	} def

/$F2psBegin {$F2psDict begin /$F2psEnteredState save def} def
/$F2psEnd {$F2psEnteredState restore end} def

$F2psBegin
10 setmiterlimit
0 slj 0 slc
 0.06000 0.06000 sc
%
% Fig objects follow
%
% 
% here starts figure with depth 50
/Helvetica ff 270.00 scf sf
3997 6547 m
gs 1 -1 sc (v) col0 sh gr
% Ellipse
15.000 slw
n 6000 5400 212 212 0 360 DrawEllipse gs col0 s gr

% Ellipse
n 6000 5400 270 270 0 360 DrawEllipse gs col0 s gr

% Polyline
gs  clippath
5715 5460 m 5715 5340 l 5427 5340 l 5667 5400 l 5427 5460 l cp
eoclip
n 3225 5400 m
 5700 5400 l gs col0 s gr gr

% arrowhead
n 5427 5460 m 5667 5400 l 5427 5340 l  col0 s
% Polyline
n 2700 5250 m 2775 5400 l
 2700 5550 l gs col0 s gr 
% Polyline
2 slj
gs  clippath
3095 5249 m 3203 5300 l 3326 5039 l 3170 5231 l 3217 4988 l cp
eoclip
n 2856 5261 m 2855 5260 l 2854 5257 l 2852 5252 l 2848 5244 l 2843 5233 l
 2837 5218 l 2829 5200 l 2819 5179 l 2809 5154 l 2797 5127 l
 2784 5097 l 2771 5064 l 2758 5030 l 2744 4995 l 2730 4958 l
 2717 4921 l 2704 4882 l 2692 4843 l 2680 4803 l 2669 4763 l
 2659 4722 l 2650 4680 l 2642 4636 l 2636 4592 l 2631 4547 l
 2628 4501 l 2626 4454 l 2627 4407 l 2631 4361 l 2638 4314 l
 2646 4270 l 2656 4230 l 2667 4194 l 2678 4162 l 2690 4135 l
 2700 4111 l 2711 4091 l 2721 4074 l 2730 4059 l 2739 4046 l
 2748 4035 l 2756 4026 l 2765 4017 l 2774 4009 l 2783 4001 l
 2793 3993 l 2804 3984 l 2816 3976 l 2829 3966 l 2844 3956 l
 2861 3946 l 2880 3936 l 2901 3925 l 2923 3916 l 2948 3908 l
 2973 3902 l 3000 3900 l 3027 3902 l 3053 3908 l 3077 3916 l
 3100 3925 l 3121 3936 l 3140 3946 l 3158 3956 l 3173 3966 l
 3187 3976 l 3199 3984 l 3211 3993 l 3221 4001 l 3231 4009 l
 3240 4017 l 3249 4026 l 3258 4035 l 3267 4046 l 3277 4059 l
 3287 4074 l 3297 4091 l 3308 4111 l 3319 4135 l 3331 4162 l
 3343 4194 l 3354 4230 l 3365 4270 l 3374 4314 l 3381 4361 l
 3385 4407 l 3386 4454 l 3385 4501 l 3382 4547 l 3378 4592 l
 3371 4636 l 3364 4680 l 3355 4722 l 3345 4763 l 3334 4803 l
 3322 4843 l 3309 4882 l 3296 4921 l 3283 4958 l 3269 4995 l
 3255 5030 l 3242 5064 l 3228 5097 l 3216 5127 l 3204 5154 l
 3193 5179 l 3184 5200 l 3176 5218 l 3169 5233 l 3164 5244 l

 3156 5261 l gs col0 s gr gr

% arrowhead
0 slj
n 3217 4988 m 3170 5231 l 3326 5039 l  col0 s
% Polyline
2 slj
gs  clippath
3201 5552 m 3093 5603 l 3215 5864 l 3168 5622 l 3324 5813 l cp
eoclip
n 2854 5592 m 2853 5593 l 2852 5596 l 2850 5601 l 2846 5609 l 2841 5620 l
 2835 5634 l 2827 5652 l 2817 5673 l 2807 5698 l 2795 5725 l
 2782 5755 l 2769 5787 l 2756 5821 l 2742 5856 l 2728 5893 l
 2715 5930 l 2702 5968 l 2689 6007 l 2678 6047 l 2667 6087 l
 2657 6128 l 2648 6171 l 2640 6214 l 2633 6258 l 2629 6304 l
 2625 6350 l 2624 6398 l 2625 6445 l 2629 6492 l 2636 6540 l
 2644 6585 l 2655 6626 l 2666 6663 l 2677 6696 l 2688 6724 l
 2699 6749 l 2709 6770 l 2719 6788 l 2729 6804 l 2738 6817 l
 2747 6829 l 2755 6839 l 2764 6849 l 2773 6858 l 2782 6867 l
 2793 6876 l 2803 6885 l 2816 6894 l 2829 6904 l 2844 6915 l
 2861 6926 l 2880 6937 l 2900 6948 l 2923 6958 l 2948 6967 l
 2973 6973 l 3000 6975 l 3027 6973 l 3053 6967 l 3077 6958 l
 3100 6948 l 3121 6937 l 3140 6926 l 3157 6915 l 3173 6904 l
 3186 6894 l 3199 6885 l 3210 6876 l 3220 6867 l 3230 6858 l
 3239 6849 l 3248 6839 l 3257 6829 l 3266 6817 l 3276 6804 l
 3285 6788 l 3296 6770 l 3307 6749 l 3318 6724 l 3329 6696 l
 3341 6663 l 3352 6626 l 3363 6585 l 3372 6540 l 3379 6492 l
 3383 6445 l 3384 6398 l 3383 6350 l 3380 6304 l 3375 6258 l
 3369 6214 l 3361 6171 l 3352 6128 l 3342 6087 l 3331 6047 l
 3320 6007 l 3307 5968 l 3294 5930 l 3281 5893 l 3267 5856 l
 3253 5821 l 3239 5787 l 3226 5755 l 3214 5725 l 3202 5698 l
 3191 5673 l 3182 5652 l 3173 5634 l 3167 5620 l 3162 5609 l

 3154 5592 l gs col0 s gr gr

% arrowhead
0 slj
n 3324 5813 m 3168 5622 l 3215 5864 l  col0 s
/Times-Roman ff 270.00 scf sf
2954 5481 m
gs 1 -1 sc (s) col0 sh gr
/Times-Roman ff 270.00 scf sf
5960 5496 m
gs 1 -1 sc (f) col0 sh gr
/Symbol ff 270.00 scf sf
4725 5250 m
gs 1 -1 sc (e,) col0 sh gr
/Times-Roman ff 270.00 scf sf
4875 5250 m
gs 1 -1 sc (E,_) col0 sh gr
/Symbol ff 270.00 scf sf
1862 5971 m
gs 1 -1 sc (e,) col0 sh gr
/Symbol ff 270.00 scf sf
1862 6346 m
gs 1 -1 sc (e,) col0 sh gr
/Symbol ff 270.00 scf sf
1862 6721 m
gs 1 -1 sc (e,) col0 sh gr
/Symbol ff 270.00 scf sf
3572 6564 m
gs 1 -1 sc (e,) col0 sh gr
/Symbol ff 270.00 scf sf
3572 6189 m
gs 1 -1 sc (e,) col0 sh gr
/Times-Roman ff 270.00 scf sf
1950 4275 m
gs 1 -1 sc (^,_,^) col0 sh gr
/Helvetica ff 270.00 scf sf
1950 4590 m
gs 1 -1 sc (v,_.v) col0 sh gr
/Times-Roman ff 270.00 scf sf
1950 4905 m
gs 1 -1 sc (\(,_,\() col0 sh gr
/Times-Roman ff 270.00 scf sf
3525 4245 m
gs 1 -1 sc (\),_,\)) col0 sh gr
/Times-Roman ff 270.00 scf sf
3525 4560 m
gs 1 -1 sc (0,_,0) col0 sh gr
/Times-Roman ff 270.00 scf sf
3525 4875 m
gs 1 -1 sc (1,_,1) col0 sh gr
/Times-Roman ff 270.00 scf sf
2087 5971 m
gs 1 -1 sc (\)E\(,E) col0 sh gr
/Times-Roman ff 270.00 scf sf
2087 6346 m
gs 1 -1 sc (0,E) col0 sh gr
/Times-Roman ff 270.00 scf sf
2087 6721 m
gs 1 -1 sc (1,E) col0 sh gr
/Times-Roman ff 270.00 scf sf
3797 6189 m
gs 1 -1 sc (E^E,E) col0 sh gr
/Times-Roman ff 270.00 scf sf
3797 6564 m
gs 1 -1 sc (E   E,E) col0 sh gr
% Ellipse
n 3000 5400 212 212 0 360 DrawEllipse gs col0 s gr

% here ends figure;
$F2psEnd
rs
showpage
