%!PS-Adobe-2.0 EPSF-2.0
%%Title: p3as.fig
%%Creator: fig2dev Version 3.2 Patchlevel 4
%%CreationDate: Tue Oct  6 19:09:46 2009
%%For: raparede@niches-dhcp-wireless-172.17.49.124.in.utalca.cl (Rodrigo Paredes)
%%BoundingBox: 0 0 438 183
%%Magnification: 1.0000
%%EndComments
/$F2psDict 200 dict def
$F2psDict begin
$F2psDict /mtrx matrix put
/col-1 {0 setgray} bind def
/col0 {0.000 0.000 0.000 srgb} bind def
/col1 {0.000 0.000 1.000 srgb} bind def
/col2 {0.000 1.000 0.000 srgb} bind def
/col3 {0.000 1.000 1.000 srgb} bind def
/col4 {1.000 0.000 0.000 srgb} bind def
/col5 {1.000 0.000 1.000 srgb} bind def
/col6 {1.000 1.000 0.000 srgb} bind def
/col7 {1.000 1.000 1.000 srgb} bind def
/col8 {0.000 0.000 0.560 srgb} bind def
/col9 {0.000 0.000 0.690 srgb} bind def
/col10 {0.000 0.000 0.820 srgb} bind def
/col11 {0.530 0.810 1.000 srgb} bind def
/col12 {0.000 0.560 0.000 srgb} bind def
/col13 {0.000 0.690 0.000 srgb} bind def
/col14 {0.000 0.820 0.000 srgb} bind def
/col15 {0.000 0.560 0.560 srgb} bind def
/col16 {0.000 0.690 0.690 srgb} bind def
/col17 {0.000 0.820 0.820 srgb} bind def
/col18 {0.560 0.000 0.000 srgb} bind def
/col19 {0.690 0.000 0.000 srgb} bind def
/col20 {0.820 0.000 0.000 srgb} bind def
/col21 {0.560 0.000 0.560 srgb} bind def
/col22 {0.690 0.000 0.690 srgb} bind def
/col23 {0.820 0.000 0.820 srgb} bind def
/col24 {0.500 0.190 0.000 srgb} bind def
/col25 {0.630 0.250 0.000 srgb} bind def
/col26 {0.750 0.380 0.000 srgb} bind def
/col27 {1.000 0.500 0.500 srgb} bind def
/col28 {1.000 0.630 0.630 srgb} bind def
/col29 {1.000 0.750 0.750 srgb} bind def
/col30 {1.000 0.880 0.880 srgb} bind def
/col31 {1.000 0.840 0.000 srgb} bind def
/col32 {0.496 0.496 0.496 srgb} bind def

end
save
newpath 0 183 moveto 0 0 lineto 438 0 lineto 438 183 lineto closepath clip newpath
-151.7 415.3 translate
1 -1 scale

/cp {closepath} bind def
/ef {eofill} bind def
/gr {grestore} bind def
/gs {gsave} bind def
/sa {save} bind def
/rs {restore} bind def
/l {lineto} bind def
/m {moveto} bind def
/rm {rmoveto} bind def
/n {newpath} bind def
/s {stroke} bind def
/sh {show} bind def
/slc {setlinecap} bind def
/slj {setlinejoin} bind def
/slw {setlinewidth} bind def
/srgb {setrgbcolor} bind def
/rot {rotate} bind def
/sc {scale} bind def
/sd {setdash} bind def
/ff {findfont} bind def
/sf {setfont} bind def
/scf {scalefont} bind def
/sw {stringwidth} bind def
/tr {translate} bind def
/tnt {dup dup currentrgbcolor
  4 -2 roll dup 1 exch sub 3 -1 roll mul add
  4 -2 roll dup 1 exch sub 3 -1 roll mul add
  4 -2 roll dup 1 exch sub 3 -1 roll mul add srgb}
  bind def
/shd {dup dup currentrgbcolor 4 -2 roll mul 4 -2 roll mul
  4 -2 roll mul srgb} bind def
 /DrawEllipse {
	/endangle exch def
	/startangle exch def
	/yrad exch def
	/xrad exch def
	/y exch def
	/x exch def
	/savematrix mtrx currentmatrix def
	x y tr xrad yrad sc 0 0 1 startangle endangle arc
	closepath
	savematrix setmatrix
	} def

/$F2psBegin {$F2psDict begin /$F2psEnteredState save def} def
/$F2psEnd {$F2psEnteredState restore end} def

$F2psBegin
10 setmiterlimit
0 slj 0 slc
 0.06000 0.06000 sc
%
% Fig objects follow
%
% 
% here starts figure with depth 50
/Times-Italic ff 240.00 scf sf
4350 5625 m
gs 1 -1 sc (a) col0 sh gr
/Times-Italic ff 240.00 scf sf
6225 5850 m
gs 1 -1 sc (aa) col0 sh gr
/Symbol ff 240.00 scf sf
7125 5925 m
gs 1 -1 sc (e|) col0 sh gr
/Times-Italic ff 240.00 scf sf
7275 5925 m
gs 1 -1 sc (aa) col0 sh gr
/Times-Italic ff 240.00 scf sf
7050 5925 m
gs 1 -1 sc (\(      \)b) col0 sh gr
/Symbol ff 240.00 scf sf
7725 4200 m
gs 1 -1 sc (e|) col0 sh gr
/Times-Italic ff 240.00 scf sf
7875 4200 m
gs 1 -1 sc (aa) col0 sh gr
/Times-Italic ff 240.00 scf sf
7650 4200 m
gs 1 -1 sc (\(      \)b) col0 sh gr
/Times-Italic ff 180.00 scf sf
8415 4129 m
gs 1 -1 sc (*) col0 sh gr
/Times-Italic ff 240.00 scf sf
7575 4200 m
gs 1 -1 sc (\(           \)) col0 sh gr
% Arc
15.000 slw
gs  clippath
4901 5755 m 4878 5638 l 4595 5693 l 4843 5706 l 4619 5811 l cp
eoclip
n 4612.5 5062.5 689.4 157.6 67.6 arcn
gs col0 s gr
 gr

% arrowhead
n 4619 5811 m 4843 5706 l 4595 5693 l  col0 s
% Arc
gs  clippath
6283 5270 m 6182 5204 l 6026 5446 l 6207 5278 l 6126 5512 l cp
eoclip
n 5512.5 4950.0 773.1 104.0 22.8 arcn
gs col0 s gr
 gr

% arrowhead
n 6126 5512 m 6207 5278 l 6026 5446 l  col0 s
% Arc
gs  clippath
6211 5010 m 6265 4902 l 6006 4774 l 6195 4935 l 5953 4882 l cp
eoclip
n 5100.0 6909.4 2259.4 -119.9 -60.1 arc
gs col0 s gr
 gr

% arrowhead
n 5953 4882 m 6195 4935 l 6006 4774 l  col0 s
% Arc
gs  clippath
3844 4848 m 3936 4924 l 4120 4702 l 3921 4849 l 4027 4625 l cp
eoclip
n 5673.8 6172.5 2197.7 -33.8 -143.8 arcn
gs col0 s gr
 gr

% arrowhead
n 4027 4625 m 3921 4849 l 4120 4702 l  col0 s
% Ellipse
n 3000 6600 212 212 0 360 DrawEllipse gs col0 s gr

% Ellipse
n 3900 5100 212 212 0 360 DrawEllipse gs col0 s gr

% Ellipse
n 5100 5700 212 212 0 360 DrawEllipse gs col0 s gr

% Ellipse
n 6300 5100 212 212 0 360 DrawEllipse gs col0 s gr

% Ellipse
n 7500 5100 212 212 0 360 DrawEllipse gs col0 s gr

% Ellipse
n 8400 6600 212 212 0 360 DrawEllipse gs col0 s gr

% Ellipse
n 9600 6600 168 168 0 360 DrawEllipse gs col0 s gr

% Ellipse
n 9600 6600 212 212 0 360 DrawEllipse gs col0 s gr

% Polyline
n 2625 6450 m 2775 6600 l
 2625 6750 l gs col0 s gr 
% Polyline
gs  clippath
3884 5266 m 3780 5207 l 3639 5458 l 3809 5279 l 3743 5517 l cp
eoclip
n 3150 6450 m
 3825 5250 l gs col0 s gr gr

% arrowhead
n 3743 5517 m 3809 5279 l 3639 5458 l  col0 s
% Polyline
gs  clippath
7290 5160 m 7290 5040 l 7002 5040 l 7242 5100 l 7002 5160 l cp
eoclip
n 6525 5100 m
 7275 5100 l gs col0 s gr gr

% arrowhead
n 7002 5160 m 7242 5100 l 7002 5040 l  col0 s
% Polyline
gs  clippath
8206 6493 m 8309 6431 l 8160 6185 l 8233 6422 l 8058 6247 l cp
eoclip
n 7575 5325 m
 8250 6450 l gs col0 s gr gr

% arrowhead
n 8058 6247 m 8233 6422 l 8160 6185 l  col0 s
% Polyline
gs  clippath
8190 6660 m 8190 6540 l 7902 6540 l 8142 6600 l 7902 6660 l cp
eoclip
n 3225 6600 m
 8175 6600 l gs col0 s gr gr

% arrowhead
n 7902 6660 m 8142 6600 l 7902 6540 l  col0 s
% Polyline
gs  clippath
9390 6660 m 9390 6540 l 9102 6540 l 9342 6600 l 9102 6660 l cp
eoclip
n 8625 6600 m
 9375 6600 l gs col0 s gr gr

% arrowhead
n 9102 6660 m 9342 6600 l 9102 6540 l  col0 s
% Polyline
 [90] 0 sd
n 2655 3900 m 2550 3900 2550 6795 105 arcto 4 {pop} repeat
  2550 6900 8595 6900 105 arcto 4 {pop} repeat
  8700 6900 8700 4005 105 arcto 4 {pop} repeat
  8700 3900 2655 3900 105 arcto 4 {pop} repeat
 cp gs col32 s gr  [] 0 sd
% Polyline
 [90] 0 sd
n 3630 4425 m 3525 4425 3525 5970 105 arcto 4 {pop} repeat
  3525 6075 7695 6075 105 arcto 4 {pop} repeat
  7800 6075 7800 4530 105 arcto 4 {pop} repeat
  7800 4425 3630 4425 105 arcto 4 {pop} repeat
 cp gs col32 s gr  [] 0 sd
% Polyline
 [90] 0 sd
n 3705 4575 m 3600 4575 3600 5895 105 arcto 4 {pop} repeat
  3600 6000 6495 6000 105 arcto 4 {pop} repeat
  6600 6000 6600 4680 105 arcto 4 {pop} repeat
  6600 4575 3705 4575 105 arcto 4 {pop} repeat
 cp gs col32 s gr  [] 0 sd
/Courier ff 240.00 scf sf
2925 6675 m
gs 1 -1 sc (0) col0 sh gr
/Courier ff 240.00 scf sf
3825 5175 m
gs 1 -1 sc (1) col0 sh gr
/Courier ff 240.00 scf sf
5025 5775 m
gs 1 -1 sc (2) col0 sh gr
/Courier ff 240.00 scf sf
6225 5175 m
gs 1 -1 sc (3) col0 sh gr
/Courier ff 240.00 scf sf
7425 5175 m
gs 1 -1 sc (4) col0 sh gr
/Courier ff 240.00 scf sf
8325 6675 m
gs 1 -1 sc (5) col0 sh gr
/Courier ff 240.00 scf sf
9525 6675 m
gs 1 -1 sc (6) col0 sh gr
/Times-Italic ff 240.00 scf sf
6675 5325 m
gs 1 -1 sc (b) col0 sh gr
/Times-Italic ff 240.00 scf sf
8775 6750 m
gs 1 -1 sc (a) col0 sh gr
/Symbol ff 240.00 scf sf
3300 5850 m
gs 1 -1 sc (e) col0 sh gr
/Symbol ff 240.00 scf sf
5325 6825 m
gs 1 -1 sc (e) col0 sh gr
/Symbol ff 240.00 scf sf
7875 5775 m
gs 1 -1 sc (e) col0 sh gr
/Symbol ff 240.00 scf sf
5025 4875 m
gs 1 -1 sc (e) col0 sh gr
/Symbol ff 240.00 scf sf
5625 4200 m
gs 1 -1 sc (e) col0 sh gr
/Times-Italic ff 240.00 scf sf
5625 5625 m
gs 1 -1 sc (a) col0 sh gr
/Symbol ff 240.00 scf sf
6075 5850 m
gs 1 -1 sc (e|) col0 sh gr
% here ends figure;
$F2psEnd
rs
showpage
