#FIG 3.2
Landscape
Center
Inches
Letter  
100.00
Single
-2
1200 2
1 3 0 2 0 7 50 -1 -1 0.000 1 0.0000 3000 5400 212 212 3000 5400 3150 5550
1 3 0 2 0 7 50 -1 -1 0.000 1 0.0000 6000 5400 212 212 6000 5400 6150 5550
1 3 0 2 0 7 50 -1 -1 0.000 1 0.0000 6000 5400 270 270 6000 5400 6225 5550
2 1 0 2 0 7 50 -1 -1 0.000 0 0 -1 1 0 2
	0 0 2.00 120.00 240.00
	 3225 5400 5700 5400
2 1 0 2 0 7 50 -1 -1 0.000 0 0 -1 0 0 3
	 2700 5250 2775 5400 2700 5550
3 2 0 2 0 7 50 -1 -1 0.000 0 1 0 5
	0 0 2.00 120.00 240.00
	 2856 5261 2631 4361 3000 3900 3381 4361 3156 5261
	 0.000 -1.000 -1.000 -1.000 0.000
3 2 0 2 0 7 50 -1 -1 0.000 0 1 0 5
	0 0 2.00 120.00 240.00
	 2854 5592 2629 6492 3000 6975 3379 6492 3154 5592
	 0.000 -1.000 -1.000 -1.000 0.000
4 0 0 50 -1 0 18 0.0000 4 135 105 2954 5481 s\001
4 0 0 50 -1 0 18 0.0000 4 195 90 5960 5496 f\001
4 0 0 50 -1 32 18 0.0000 4 180 195 4725 5250 e,\001
4 0 0 50 -1 0 18 0.0000 4 255 360 4875 5250 E,_\001
4 0 0 50 -1 32 18 0.0000 4 180 195 1862 5971 e,\001
4 0 0 50 -1 32 18 0.0000 4 180 195 1862 6346 e,\001
4 0 0 50 -1 32 18 0.0000 4 180 195 1862 6721 e,\001
4 0 0 50 -1 32 18 0.0000 4 180 195 3572 6564 e,\001
4 0 0 50 -1 32 18 0.0000 4 180 195 3572 6189 e,\001
4 0 0 50 -1 0 18 0.0000 4 255 525 1950 4275 ^,_,^\001
4 0 0 50 -1 16 18 0.0000 4 210 600 1950 4590 v,_.v\001
4 0 0 50 -1 0 18 0.0000 4 255 465 1950 4905 (,_,(\001
4 0 0 50 -1 0 18 0.0000 4 255 465 3525 4245 ),_,)\001
4 0 0 50 -1 0 18 0.0000 4 255 525 3525 4560 0,_,0\001
4 0 0 50 -1 0 18 0.0000 4 255 525 3525 4875 1,_,1\001
4 0 0 50 -1 0 18 0.0000 4 255 600 2087 5971 )E(,E\001
4 0 0 50 -1 0 18 0.0000 4 240 360 2087 6346 0,E\001
4 0 0 50 -1 0 18 0.0000 4 240 360 2087 6721 1,E\001
4 0 0 50 -1 0 18 0.0000 4 240 690 3797 6189 E^E,E\001
4 0 0 50 -1 0 18 0.0000 4 240 735 3797 6564 E   E,E\001
4 0 0 50 -1 16 18 0.0000 4 150 150 3997 6547 v\001
