%!PS-Adobe-2.0 EPSF-2.0
%%Title: pikShort.fig
%%Creator: fig2dev Version 3.2 Patchlevel 4
%%CreationDate: Wed Dec  2 22:02:24 2009
%%For: raparede@niches-dhcp-wireless-172.17.49.41.in.utalca.cl (Rodrigo Paredes)
%%BoundingBox: 0 0 494 235
%%Magnification: 1.0000
%%EndComments
/$F2psDict 200 dict def
$F2psDict begin
$F2psDict /mtrx matrix put
/col-1 {0 setgray} bind def
/col0 {0.000 0.000 0.000 srgb} bind def
/col1 {0.000 0.000 1.000 srgb} bind def
/col2 {0.000 1.000 0.000 srgb} bind def
/col3 {0.000 1.000 1.000 srgb} bind def
/col4 {1.000 0.000 0.000 srgb} bind def
/col5 {1.000 0.000 1.000 srgb} bind def
/col6 {1.000 1.000 0.000 srgb} bind def
/col7 {1.000 1.000 1.000 srgb} bind def
/col8 {0.000 0.000 0.560 srgb} bind def
/col9 {0.000 0.000 0.690 srgb} bind def
/col10 {0.000 0.000 0.820 srgb} bind def
/col11 {0.530 0.810 1.000 srgb} bind def
/col12 {0.000 0.560 0.000 srgb} bind def
/col13 {0.000 0.690 0.000 srgb} bind def
/col14 {0.000 0.820 0.000 srgb} bind def
/col15 {0.000 0.560 0.560 srgb} bind def
/col16 {0.000 0.690 0.690 srgb} bind def
/col17 {0.000 0.820 0.820 srgb} bind def
/col18 {0.560 0.000 0.000 srgb} bind def
/col19 {0.690 0.000 0.000 srgb} bind def
/col20 {0.820 0.000 0.000 srgb} bind def
/col21 {0.560 0.000 0.560 srgb} bind def
/col22 {0.690 0.000 0.690 srgb} bind def
/col23 {0.820 0.000 0.820 srgb} bind def
/col24 {0.500 0.190 0.000 srgb} bind def
/col25 {0.630 0.250 0.000 srgb} bind def
/col26 {0.750 0.380 0.000 srgb} bind def
/col27 {1.000 0.500 0.500 srgb} bind def
/col28 {1.000 0.630 0.630 srgb} bind def
/col29 {1.000 0.750 0.750 srgb} bind def
/col30 {1.000 0.880 0.880 srgb} bind def
/col31 {1.000 0.840 0.000 srgb} bind def

end
save
newpath 0 235 moveto 0 0 lineto 494 0 lineto 494 235 lineto closepath clip newpath
-84.2 380.6 translate
1 -1 scale

/cp {closepath} bind def
/ef {eofill} bind def
/gr {grestore} bind def
/gs {gsave} bind def
/sa {save} bind def
/rs {restore} bind def
/l {lineto} bind def
/m {moveto} bind def
/rm {rmoveto} bind def
/n {newpath} bind def
/s {stroke} bind def
/sh {show} bind def
/slc {setlinecap} bind def
/slj {setlinejoin} bind def
/slw {setlinewidth} bind def
/srgb {setrgbcolor} bind def
/rot {rotate} bind def
/sc {scale} bind def
/sd {setdash} bind def
/ff {findfont} bind def
/sf {setfont} bind def
/scf {scalefont} bind def
/sw {stringwidth} bind def
/tr {translate} bind def
/tnt {dup dup currentrgbcolor
  4 -2 roll dup 1 exch sub 3 -1 roll mul add
  4 -2 roll dup 1 exch sub 3 -1 roll mul add
  4 -2 roll dup 1 exch sub 3 -1 roll mul add srgb}
  bind def
/shd {dup dup currentrgbcolor 4 -2 roll mul 4 -2 roll mul
  4 -2 roll mul srgb} bind def
/reencdict 12 dict def /ReEncode { reencdict begin
/newcodesandnames exch def /newfontname exch def /basefontname exch def
/basefontdict basefontname findfont def /newfont basefontdict maxlength dict def
basefontdict { exch dup /FID ne { dup /Encoding eq
{ exch dup length array copy newfont 3 1 roll put }
{ exch newfont 3 1 roll put } ifelse } { pop pop } ifelse } forall
newfont /FontName newfontname put newcodesandnames aload pop
128 1 255 { newfont /Encoding get exch /.notdef put } for
newcodesandnames length 2 idiv { newfont /Encoding get 3 1 roll put } repeat
newfontname newfont definefont pop end } def
/isovec [
8#055 /minus 8#200 /grave 8#201 /acute 8#202 /circumflex 8#203 /tilde
8#204 /macron 8#205 /breve 8#206 /dotaccent 8#207 /dieresis
8#210 /ring 8#211 /cedilla 8#212 /hungarumlaut 8#213 /ogonek 8#214 /caron
8#220 /dotlessi 8#230 /oe 8#231 /OE
8#240 /space 8#241 /exclamdown 8#242 /cent 8#243 /sterling
8#244 /currency 8#245 /yen 8#246 /brokenbar 8#247 /section 8#250 /dieresis
8#251 /copyright 8#252 /ordfeminine 8#253 /guillemotleft 8#254 /logicalnot
8#255 /hyphen 8#256 /registered 8#257 /macron 8#260 /degree 8#261 /plusminus
8#262 /twosuperior 8#263 /threesuperior 8#264 /acute 8#265 /mu 8#266 /paragraph
8#267 /periodcentered 8#270 /cedilla 8#271 /onesuperior 8#272 /ordmasculine
8#273 /guillemotright 8#274 /onequarter 8#275 /onehalf
8#276 /threequarters 8#277 /questiondown 8#300 /Agrave 8#301 /Aacute
8#302 /Acircumflex 8#303 /Atilde 8#304 /Adieresis 8#305 /Aring
8#306 /AE 8#307 /Ccedilla 8#310 /Egrave 8#311 /Eacute
8#312 /Ecircumflex 8#313 /Edieresis 8#314 /Igrave 8#315 /Iacute
8#316 /Icircumflex 8#317 /Idieresis 8#320 /Eth 8#321 /Ntilde 8#322 /Ograve
8#323 /Oacute 8#324 /Ocircumflex 8#325 /Otilde 8#326 /Odieresis 8#327 /multiply
8#330 /Oslash 8#331 /Ugrave 8#332 /Uacute 8#333 /Ucircumflex
8#334 /Udieresis 8#335 /Yacute 8#336 /Thorn 8#337 /germandbls 8#340 /agrave
8#341 /aacute 8#342 /acircumflex 8#343 /atilde 8#344 /adieresis 8#345 /aring
8#346 /ae 8#347 /ccedilla 8#350 /egrave 8#351 /eacute
8#352 /ecircumflex 8#353 /edieresis 8#354 /igrave 8#355 /iacute
8#356 /icircumflex 8#357 /idieresis 8#360 /eth 8#361 /ntilde 8#362 /ograve
8#363 /oacute 8#364 /ocircumflex 8#365 /otilde 8#366 /odieresis 8#367 /divide
8#370 /oslash 8#371 /ugrave 8#372 /uacute 8#373 /ucircumflex
8#374 /udieresis 8#375 /yacute 8#376 /thorn 8#377 /ydieresis] def
/Times-BoldItalic /Times-BoldItalic-iso isovec ReEncode
/Times-Roman /Times-Roman-iso isovec ReEncode
 /DrawEllipse {
	/endangle exch def
	/startangle exch def
	/yrad exch def
	/xrad exch def
	/y exch def
	/x exch def
	/savematrix mtrx currentmatrix def
	x y tr xrad yrad sc 0 0 1 startangle endangle arc
	closepath
	savematrix setmatrix
	} def

/$F2psBegin {$F2psDict begin /$F2psEnteredState save def} def
/$F2psEnd {$F2psEnteredState restore end} def

$F2psBegin
10 setmiterlimit
0 slj 0 slc
 0.06000 0.06000 sc
%
% Fig objects follow
%
% 
% here starts figure with depth 50
/Symbol ff 270.00 scf sf
7875 6000 m
gs 1 -1 sc (S,_,_) col0 sh gr
/Symbol ff 270.00 scf sf
5250 3675 m
gs 1 -1 sc (---) col0 sh gr
/Times-BoldItalic-iso ff 270.00 scf sf
5025 2775 m
gs 1 -1 sc (E,E,EE) col0 sh gr
/Symbol ff 270.00 scf sf
5250 3075 m
gs 1 -1 sc (-) col0 sh gr
/Times-BoldItalic-iso ff 270.00 scf sf
5025 3090 m
gs 1 -1 sc (E,  E,EE) col0 sh gr
/Times-BoldItalic-iso ff 270.00 scf sf
5025 3405 m
gs 1 -1 sc (E,    E,EE) col0 sh gr
/Symbol ff 270.00 scf sf
5250 3375 m
gs 1 -1 sc (--) col0 sh gr
/Symbol ff 270.00 scf sf
7050 2700 m
gs 1 -1 sc (-,_,-) col0 sh gr
/Symbol ff 270.00 scf sf
7050 3075 m
gs 1 -1 sc (e) col0 sh gr
/Times-BoldItalic-iso ff 270.00 scf sf
7050 3075 m
gs 1 -1 sc (  ,EEEI,_) col0 sh gr
/Times-BoldItalic-iso ff 270.00 scf sf
7050 3390 m
gs 1 -1 sc (  ,        E,_) col0 sh gr
/Symbol ff 270.00 scf sf
7050 3375 m
gs 1 -1 sc (e) col0 sh gr
/Symbol ff 270.00 scf sf
7275 3375 m
gs 1 -1 sc (----) col0 sh gr
/Symbol ff 270.00 scf sf
7200 4050 m
gs 1 -1 sc (----) col0 sh gr
/Symbol ff 270.00 scf sf
6975 4050 m
gs 1 -1 sc (e) col0 sh gr
/Times-BoldItalic-iso ff 270.00 scf sf
6975 4065 m
gs 1 -1 sc (  ,        I,_) col0 sh gr
/Times-BoldItalic-iso ff 270.00 scf sf
6750 4976 m
gs 1 -1 sc  270.0 rot (Z) col0 sh gr
/Symbol ff 270.00 scf sf
6750 4750 m
gs 1 -1 sc  270.0 rot (e,   ,_) col0 sh gr
% Ellipse
15.000 slw
n 6600 6000 212 212 0 360 DrawEllipse gs col0 s gr

% Ellipse
n 6600 6000 270 270 0 360 DrawEllipse gs col0 s gr

/Times-Roman-iso ff 270.00 scf sf
6525 6075 m
gs 1 -1 sc (3) col0 sh gr
% Ellipse
n 3607 4207 212 212 0 360 DrawEllipse gs col0 s gr

% Ellipse
n 1776 4208 212 212 0 360 DrawEllipse gs col0 s gr

% Ellipse
n 6600 4200 212 212 0 360 DrawEllipse gs col0 s gr

% Ellipse
n 8550 4200 212 212 0 360 DrawEllipse gs col0 s gr

% Polyline
gs  clippath
3390 4260 m 3390 4140 l 3102 4140 l 3342 4200 l 3102 4260 l cp
eoclip
n 1950 4200 m
 3375 4200 l gs col0 s gr gr

% arrowhead
n 3102 4260 m 3342 4200 l 3102 4140 l  col0 s
% Polyline
gs  clippath
6390 4260 m 6390 4140 l 6102 4140 l 6342 4200 l 6102 4260 l cp
eoclip
n 3825 4200 m
 6375 4200 l gs col0 s gr gr

% arrowhead
n 6102 4260 m 6342 4200 l 6102 4140 l  col0 s
% Polyline
n 1425 4050 m 1575 4200 l
 1425 4350 l gs col0 s gr 
% Polyline
gs  clippath
8340 4260 m 8340 4140 l 8052 4140 l 8292 4200 l 8052 4260 l cp
eoclip
n 6825 4200 m
 8325 4200 l gs col0 s gr gr

% arrowhead
n 8052 4260 m 8292 4200 l 8052 4140 l  col0 s
% Polyline
gs  clippath
6540 5715 m 6660 5715 l 6660 5427 l 6600 5667 l 6540 5427 l cp
eoclip
n 6600 4425 m
 6600 5700 l gs col0 s gr gr

% arrowhead
n 6540 5427 m 6600 5667 l 6660 5427 l  col0 s
% Polyline
2 slj
gs  clippath
3689 4037 m 3797 4089 l 3921 3829 l 3764 4020 l 3813 3777 l cp
eoclip
n 3450 4050 m 3449 4048 l 3447 4045 l 3443 4038 l 3437 4029 l 3429 4015 l
 3420 3999 l 3409 3979 l 3396 3956 l 3383 3931 l 3370 3905 l
 3357 3877 l 3345 3848 l 3333 3817 l 3322 3786 l 3313 3754 l
 3305 3720 l 3299 3684 l 3295 3646 l 3293 3607 l 3295 3566 l
 3300 3525 l 3308 3485 l 3319 3448 l 3331 3414 l 3343 3385 l
 3355 3360 l 3366 3338 l 3376 3320 l 3386 3305 l 3395 3291 l
 3404 3280 l 3413 3269 l 3421 3259 l 3431 3248 l 3442 3238 l
 3454 3227 l 3468 3215 l 3484 3203 l 3502 3190 l 3523 3177 l
 3547 3165 l 3573 3156 l 3600 3150 l 3625 3149 l 3649 3152 l
 3671 3156 l 3691 3163 l 3709 3170 l 3725 3177 l 3738 3184 l
 3751 3192 l 3761 3198 l 3771 3205 l 3779 3212 l 3788 3219 l
 3795 3226 l 3803 3234 l 3812 3244 l 3820 3255 l 3829 3268 l
 3839 3284 l 3850 3303 l 3861 3325 l 3872 3351 l 3883 3380 l
 3892 3414 l 3900 3450 l 3905 3488 l 3907 3527 l 3906 3566 l
 3903 3603 l 3898 3640 l 3891 3676 l 3883 3710 l 3874 3744 l
 3864 3777 l 3853 3810 l 3842 3841 l 3830 3872 l 3818 3901 l
 3806 3929 l 3794 3955 l 3784 3979 l 3774 3999 l 3767 4016 l
 3760 4029 l
 3750 4050 l gs col0 s gr gr

% arrowhead
0 slj
n 3813 3777 m 3764 4020 l 3921 3829 l  col0 s
% Polyline
2 slj
gs  clippath
6689 4039 m 6798 4087 l 6914 3824 l 6763 4020 l 6804 3776 l cp
eoclip
n 6450 4050 m 6450 4049 l 6448 4046 l 6446 4041 l 6443 4034 l 6439 4023 l
 6434 4009 l 6427 3992 l 6419 3972 l 6411 3948 l 6402 3922 l
 6392 3894 l 6382 3864 l 6372 3832 l 6362 3798 l 6352 3764 l
 6342 3727 l 6334 3690 l 6325 3651 l 6318 3611 l 6311 3569 l
 6306 3524 l 6302 3478 l 6299 3429 l 6297 3377 l 6297 3323 l
 6300 3268 l 6304 3211 l 6311 3155 l 6319 3100 l 6328 3049 l
 6337 3001 l 6347 2957 l 6356 2917 l 6365 2881 l 6374 2849 l
 6382 2819 l 6389 2792 l 6396 2768 l 6403 2745 l 6410 2724 l
 6417 2704 l 6424 2684 l 6431 2664 l 6439 2645 l 6447 2625 l
 6457 2605 l 6467 2585 l 6479 2565 l 6493 2544 l 6508 2524 l
 6524 2505 l 6542 2488 l 6562 2474 l 6583 2465 l 6604 2461 l
 6625 2465 l 6646 2474 l 6666 2488 l 6684 2505 l 6700 2524 l
 6715 2544 l 6729 2565 l 6741 2585 l 6751 2605 l 6761 2625 l
 6770 2645 l 6777 2664 l 6785 2684 l 6792 2704 l 6799 2724 l
 6805 2745 l 6812 2768 l 6820 2792 l 6827 2819 l 6835 2849 l
 6844 2881 l 6853 2917 l 6862 2957 l 6872 3001 l 6881 3049 l
 6890 3100 l 6898 3155 l 6904 3211 l 6908 3268 l 6910 3323 l
 6910 3377 l 6908 3429 l 6905 3478 l 6900 3524 l 6894 3569 l
 6887 3611 l 6879 3651 l 6871 3690 l 6862 3727 l 6852 3764 l
 6842 3798 l 6831 3832 l 6821 3864 l 6810 3894 l 6800 3922 l
 6790 3948 l 6782 3972 l 6774 3992 l 6767 4009 l 6761 4023 l
 6757 4034 l
 6750 4050 l gs col0 s gr gr

% arrowhead
0 slj
n 6804 3776 m 6763 4020 l 6914 3824 l  col0 s
% Polyline
2 slj
gs  clippath
8712 4289 m 8660 4397 l 8920 4521 l 8730 4364 l 8972 4413 l cp
eoclip
n 8700 4050 m 8702 4049 l 8705 4047 l 8712 4043 l 8721 4037 l 8735 4029 l
 8751 4020 l 8771 4009 l 8794 3996 l 8819 3983 l 8845 3970 l
 8873 3957 l 8902 3945 l 8933 3933 l 8964 3922 l 8996 3913 l
 9030 3905 l 9066 3899 l 9104 3895 l 9143 3893 l 9184 3895 l
 9225 3900 l 9265 3908 l 9302 3919 l 9336 3931 l 9365 3943 l
 9390 3955 l 9412 3966 l 9430 3976 l 9445 3986 l 9459 3995 l
 9470 4004 l 9481 4013 l 9491 4021 l 9502 4031 l 9512 4042 l
 9523 4054 l 9535 4068 l 9547 4084 l 9560 4102 l 9573 4123 l
 9585 4147 l 9594 4173 l 9600 4200 l 9601 4225 l 9598 4249 l
 9594 4271 l 9587 4291 l 9580 4309 l 9573 4325 l 9566 4338 l
 9558 4351 l 9552 4361 l 9545 4371 l 9538 4379 l 9531 4388 l
 9524 4395 l 9516 4403 l 9506 4412 l 9495 4420 l 9482 4429 l
 9466 4439 l 9447 4450 l 9425 4461 l 9399 4472 l 9370 4483 l
 9336 4492 l 9300 4500 l 9262 4505 l 9223 4507 l 9184 4506 l
 9147 4503 l 9110 4498 l 9074 4491 l 9040 4483 l 9006 4474 l
 8973 4464 l 8940 4453 l 8909 4442 l 8878 4430 l 8849 4418 l
 8821 4406 l 8795 4394 l 8771 4384 l 8751 4374 l 8734 4367 l
 8721 4360 l
 8700 4350 l gs col0 s gr gr

% arrowhead
0 slj
n 8972 4413 m 8730 4364 l 8920 4521 l  col0 s
% Polyline
2 slj
gs  clippath
6912 6089 m 6860 6197 l 7120 6321 l 6930 6164 l 7172 6213 l cp
eoclip
n 6900 5850 m 6902 5849 l 6905 5847 l 6912 5843 l 6921 5837 l 6935 5829 l
 6951 5820 l 6971 5809 l 6994 5796 l 7019 5783 l 7045 5770 l
 7073 5757 l 7102 5745 l 7133 5733 l 7164 5722 l 7196 5713 l
 7230 5705 l 7266 5699 l 7304 5695 l 7343 5693 l 7384 5695 l
 7425 5700 l 7465 5708 l 7502 5719 l 7536 5731 l 7565 5743 l
 7590 5755 l 7612 5766 l 7630 5776 l 7645 5786 l 7659 5795 l
 7670 5804 l 7681 5813 l 7691 5821 l 7702 5831 l 7712 5842 l
 7723 5854 l 7735 5868 l 7747 5884 l 7760 5902 l 7773 5923 l
 7785 5947 l 7794 5973 l 7800 6000 l 7801 6025 l 7798 6049 l
 7794 6071 l 7787 6091 l 7780 6109 l 7773 6125 l 7766 6138 l
 7758 6151 l 7752 6161 l 7745 6171 l 7738 6179 l 7731 6188 l
 7724 6195 l 7716 6203 l 7706 6212 l 7695 6220 l 7682 6229 l
 7666 6239 l 7647 6250 l 7625 6261 l 7599 6272 l 7570 6283 l
 7536 6292 l 7500 6300 l 7462 6305 l 7423 6307 l 7384 6306 l
 7347 6303 l 7310 6298 l 7274 6291 l 7240 6283 l 7206 6274 l
 7173 6264 l 7140 6253 l 7109 6242 l 7078 6230 l 7049 6218 l
 7021 6206 l 6995 6194 l 6971 6184 l 6951 6174 l 6934 6167 l
 6921 6160 l
 6900 6150 l gs col0 s gr gr

% arrowhead
0 slj
n 7172 6213 m 6930 6164 l 7120 6321 l  col0 s
/Symbol ff 270.00 scf sf
2175 4050 m
gs 1 -1 sc (e,_,) col0 sh gr
/Times-BoldItalic-iso ff 270.00 scf sf
2625 4050 m
gs 1 -1 sc (Z) col0 sh gr
/Times-BoldItalic-iso ff 270.00 scf sf
3450 3075 m
gs 1 -1 sc (I,_,I) col0 sh gr
/Times-Roman-iso ff 270.00 scf sf
1725 4350 m
gs 1 -1 sc (0) col0 sh gr
/Times-Roman-iso ff 270.00 scf sf
3525 4350 m
gs 1 -1 sc (1) col0 sh gr
/Times-Roman-iso ff 270.00 scf sf
6525 4275 m
gs 1 -1 sc (2) col0 sh gr
/Symbol ff 270.00 scf sf
4125 4050 m
gs 1 -1 sc (e,_,_) col0 sh gr
/Times-Roman-iso ff 270.00 scf sf
8475 4275 m
gs 1 -1 sc (8) col0 sh gr
/Symbol ff 270.00 scf sf
9000 3750 m
gs 1 -1 sc (S,_,_) col0 sh gr
/Times-BoldItalic-iso ff 270.00 scf sf
5025 3675 m
gs 1 -1 sc (E,      E,EE) col0 sh gr
% here ends figure;
$F2psEnd
rs
showpage
