%!PS-Adobe-2.0 EPSF-2.0
%%Title: p3a.fig
%%Creator: fig2dev Version 3.2 Patchlevel 4
%%CreationDate: Tue Oct  6 19:09:01 2009
%%For: raparede@niches-dhcp-wireless-172.17.49.124.in.utalca.cl (Rodrigo Paredes)
%%BoundingBox: 0 0 514 242
%%Magnification: 1.0000
%%EndComments
/$F2psDict 200 dict def
$F2psDict begin
$F2psDict /mtrx matrix put
/col-1 {0 setgray} bind def
/col0 {0.000 0.000 0.000 srgb} bind def
/col1 {0.000 0.000 1.000 srgb} bind def
/col2 {0.000 1.000 0.000 srgb} bind def
/col3 {0.000 1.000 1.000 srgb} bind def
/col4 {1.000 0.000 0.000 srgb} bind def
/col5 {1.000 0.000 1.000 srgb} bind def
/col6 {1.000 1.000 0.000 srgb} bind def
/col7 {1.000 1.000 1.000 srgb} bind def
/col8 {0.000 0.000 0.560 srgb} bind def
/col9 {0.000 0.000 0.690 srgb} bind def
/col10 {0.000 0.000 0.820 srgb} bind def
/col11 {0.530 0.810 1.000 srgb} bind def
/col12 {0.000 0.560 0.000 srgb} bind def
/col13 {0.000 0.690 0.000 srgb} bind def
/col14 {0.000 0.820 0.000 srgb} bind def
/col15 {0.000 0.560 0.560 srgb} bind def
/col16 {0.000 0.690 0.690 srgb} bind def
/col17 {0.000 0.820 0.820 srgb} bind def
/col18 {0.560 0.000 0.000 srgb} bind def
/col19 {0.690 0.000 0.000 srgb} bind def
/col20 {0.820 0.000 0.000 srgb} bind def
/col21 {0.560 0.000 0.560 srgb} bind def
/col22 {0.690 0.000 0.690 srgb} bind def
/col23 {0.820 0.000 0.820 srgb} bind def
/col24 {0.500 0.190 0.000 srgb} bind def
/col25 {0.630 0.250 0.000 srgb} bind def
/col26 {0.750 0.380 0.000 srgb} bind def
/col27 {1.000 0.500 0.500 srgb} bind def
/col28 {1.000 0.630 0.630 srgb} bind def
/col29 {1.000 0.750 0.750 srgb} bind def
/col30 {1.000 0.880 0.880 srgb} bind def
/col31 {1.000 0.840 0.000 srgb} bind def
/col32 {0.496 0.496 0.496 srgb} bind def

end
save
newpath 0 242 moveto 0 0 lineto 514 0 lineto 514 242 lineto closepath clip newpath
-151.7 253.3 translate
1 -1 scale

/cp {closepath} bind def
/ef {eofill} bind def
/gr {grestore} bind def
/gs {gsave} bind def
/sa {save} bind def
/rs {restore} bind def
/l {lineto} bind def
/m {moveto} bind def
/rm {rmoveto} bind def
/n {newpath} bind def
/s {stroke} bind def
/sh {show} bind def
/slc {setlinecap} bind def
/slj {setlinejoin} bind def
/slw {setlinewidth} bind def
/srgb {setrgbcolor} bind def
/rot {rotate} bind def
/sc {scale} bind def
/sd {setdash} bind def
/ff {findfont} bind def
/sf {setfont} bind def
/scf {scalefont} bind def
/sw {stringwidth} bind def
/tr {translate} bind def
/tnt {dup dup currentrgbcolor
  4 -2 roll dup 1 exch sub 3 -1 roll mul add
  4 -2 roll dup 1 exch sub 3 -1 roll mul add
  4 -2 roll dup 1 exch sub 3 -1 roll mul add srgb}
  bind def
/shd {dup dup currentrgbcolor 4 -2 roll mul 4 -2 roll mul
  4 -2 roll mul srgb} bind def
 /DrawEllipse {
	/endangle exch def
	/startangle exch def
	/yrad exch def
	/xrad exch def
	/y exch def
	/x exch def
	/savematrix mtrx currentmatrix def
	x y tr xrad yrad sc 0 0 1 startangle endangle arc
	closepath
	savematrix setmatrix
	} def

/$F2psBegin {$F2psDict begin /$F2psEnteredState save def} def
/$F2psEnd {$F2psEnteredState restore end} def

$F2psBegin
10 setmiterlimit
0 slj 0 slc
 0.06000 0.06000 sc
%
% Fig objects follow
%
% 
% here starts figure with depth 50
/Symbol ff 240.00 scf sf
7350 2700 m
gs 1 -1 sc (e) col0 sh gr
/Times-Italic ff 240.00 scf sf
7725 1350 m
gs 1 -1 sc (aa) col0 sh gr
/Symbol ff 240.00 scf sf
8625 1200 m
gs 1 -1 sc (e|) col0 sh gr
/Times-Italic ff 240.00 scf sf
8775 1200 m
gs 1 -1 sc (aa) col0 sh gr
/Times-Italic ff 240.00 scf sf
8550 1200 m
gs 1 -1 sc (\(      \)b) col0 sh gr
/Symbol ff 240.00 scf sf
9000 525 m
gs 1 -1 sc (e|) col0 sh gr
/Times-Italic ff 240.00 scf sf
9150 525 m
gs 1 -1 sc (aa) col0 sh gr
/Times-Italic ff 240.00 scf sf
8925 525 m
gs 1 -1 sc (\(      \)b) col0 sh gr
/Times-Italic ff 180.00 scf sf
9690 454 m
gs 1 -1 sc (*) col0 sh gr
/Times-Italic ff 240.00 scf sf
8850 525 m
gs 1 -1 sc (\(           \)) col0 sh gr
% Arc
15.000 slw
gs  clippath
3541 1855 m 3642 1919 l 3796 1675 l 3618 1847 l 3694 1611 l cp
eoclip
n 6300.0 3401.8 3101.8 -29.5 -150.5 arcn
gs col0 s gr
 gr

% arrowhead
n 3694 1611 m 3618 1847 l 3796 1675 l  col0 s
% Ellipse
n 3600 2100 212 212 0 360 DrawEllipse gs col0 s gr

% Ellipse
n 7800 2100 212 212 0 360 DrawEllipse gs col0 s gr

% Ellipse
n 9000 2100 212 212 0 360 DrawEllipse gs col0 s gr

% Ellipse
n 3000 3900 212 212 0 360 DrawEllipse gs col0 s gr

% Ellipse
n 9600 3900 212 212 0 360 DrawEllipse gs col0 s gr

% Ellipse
n 10800 3900 212 212 0 360 DrawEllipse gs col0 s gr

% Ellipse
n 10800 3900 270 270 0 360 DrawEllipse gs col0 s gr

% Ellipse
n 5100 1500 212 212 0 360 DrawEllipse gs col0 s gr

% Ellipse
n 6300 1500 212 212 0 360 DrawEllipse gs col0 s gr

% Ellipse
n 4500 2700 212 212 0 360 DrawEllipse gs col0 s gr

% Ellipse
n 5700 2700 212 212 0 360 DrawEllipse gs col0 s gr

% Ellipse
n 6900 2700 212 212 0 360 DrawEllipse gs col0 s gr

% Polyline
gs  clippath
9390 3960 m 9390 3840 l 9102 3840 l 9342 3900 l 9102 3960 l cp
eoclip
n 3225 3900 m
 9375 3900 l gs col0 s gr gr

% arrowhead
n 9102 3960 m 9342 3900 l 9102 3840 l  col0 s
% Polyline
gs  clippath
10590 3960 m 10590 3840 l 10302 3840 l 10542 3900 l 10302 3960 l cp
eoclip
n 9825 3900 m
 10575 3900 l gs col0 s gr gr

% arrowhead
n 10302 3960 m 10542 3900 l 10302 3840 l  col0 s
% Polyline
gs  clippath
3511 2253 m 3397 2217 l 3310 2492 l 3440 2282 l 3424 2528 l cp
eoclip
n 3000 3675 m
 3450 2250 l gs col0 s gr gr

% arrowhead
n 3424 2528 m 3440 2282 l 3310 2492 l  col0 s
% Polyline
gs  clippath
4908 1627 m 4870 1513 l 4597 1603 l 4844 1585 l 4635 1717 l cp
eoclip
n 3750 1950 m
 4875 1575 l gs col0 s gr gr

% arrowhead
n 4635 1717 m 4844 1585 l 4597 1603 l  col0 s
% Polyline
gs  clippath
7639 2085 m 7687 1976 l 7424 1860 l 7620 2012 l 7376 1970 l cp
eoclip
n 6450 1500 m
 7650 2025 l gs col0 s gr gr

% arrowhead
n 7376 1970 m 7620 2012 l 7424 1860 l  col0 s
% Polyline
gs  clippath
8790 2160 m 8790 2040 l 8502 2040 l 8742 2100 l 8502 2160 l cp
eoclip
n 8025 2100 m
 8775 2100 l gs col0 s gr gr

% arrowhead
n 8502 2160 m 8742 2100 l 8502 2040 l  col0 s
% Polyline
gs  clippath
9472 3782 m 9586 3746 l 9499 3471 l 9515 3718 l 9385 3507 l cp
eoclip
n 9075 2325 m
 9525 3750 l gs col0 s gr gr

% arrowhead
n 9385 3507 m 9515 3718 l 9499 3471 l  col0 s
% Polyline
gs  clippath
4247 2755 m 4325 2664 l 4106 2476 l 4250 2678 l 4028 2567 l cp
eoclip
n 3750 2250 m
 4275 2700 l gs col0 s gr gr

% arrowhead
n 4028 2567 m 4250 2678 l 4106 2476 l  col0 s
% Polyline
gs  clippath
6090 1560 m 6090 1440 l 5802 1440 l 6042 1500 l 5802 1560 l cp
eoclip
n 5325 1500 m
 6075 1500 l gs col0 s gr gr

% arrowhead
n 5802 1560 m 6042 1500 l 5802 1440 l  col0 s
% Polyline
gs  clippath
5490 2760 m 5490 2640 l 5202 2640 l 5442 2700 l 5202 2760 l cp
eoclip
n 4725 2700 m
 5475 2700 l gs col0 s gr gr

% arrowhead
n 5202 2760 m 5442 2700 l 5202 2640 l  col0 s
% Polyline
gs  clippath
6690 2760 m 6690 2640 l 6402 2640 l 6642 2700 l 6402 2760 l cp
eoclip
n 5925 2700 m
 6675 2700 l gs col0 s gr gr

% arrowhead
n 6402 2760 m 6642 2700 l 6402 2640 l  col0 s
% Polyline
gs  clippath
7700 2285 m 7622 2194 l 7403 2382 l 7625 2272 l 7481 2473 l cp
eoclip
n 7125 2700 m
 7650 2250 l gs col0 s gr gr

% arrowhead
n 7481 2473 m 7625 2272 l 7403 2382 l  col0 s
% Polyline
n 2625 3750 m 2775 3900 l
 2625 4050 l gs col0 s gr 
% Polyline
 [90] 0 sd
n 2655 225 m 2550 225 2550 4095 105 arcto 4 {pop} repeat
  2550 4200 9795 4200 105 arcto 4 {pop} repeat
  9900 4200 9900 330 105 arcto 4 {pop} repeat
  9900 225 2655 225 105 arcto 4 {pop} repeat
 cp gs col32 s gr  [] 0 sd
% Polyline
 [90] 0 sd
n 3330 900 m 3225 900 3225 3045 105 arcto 4 {pop} repeat
  3225 3150 9195 3150 105 arcto 4 {pop} repeat
  9300 3150 9300 1005 105 arcto 4 {pop} repeat
  9300 900 3330 900 105 arcto 4 {pop} repeat
 cp gs col32 s gr  [] 0 sd
% Polyline
 [90] 0 sd
n 3405 1050 m 3300 1050 3300 2970 105 arcto 4 {pop} repeat
  3300 3075 7995 3075 105 arcto 4 {pop} repeat
  8100 3075 8100 1155 105 arcto 4 {pop} repeat
  8100 1050 3405 1050 105 arcto 4 {pop} repeat
 cp gs col32 s gr  [] 0 sd
% Polyline
 [90] 0 sd
n 4305 2400 m 4200 2400 4200 2895 105 arcto 4 {pop} repeat
  4200 3000 7095 3000 105 arcto 4 {pop} repeat
  7200 3000 7200 2505 105 arcto 4 {pop} repeat
  7200 2400 4305 2400 105 arcto 4 {pop} repeat
 cp gs col32 s gr  [] 0 sd
% Polyline
 [90] 0 sd
n 4905 1200 m 4800 1200 4800 1695 105 arcto 4 {pop} repeat
  4800 1800 6495 1800 105 arcto 4 {pop} repeat
  6600 1800 6600 1305 105 arcto 4 {pop} repeat
  6600 1200 4905 1200 105 arcto 4 {pop} repeat
 cp gs col32 s gr  [] 0 sd
/Courier ff 240.00 scf sf
2925 3975 m
gs 1 -1 sc (0) col0 sh gr
/Courier ff 240.00 scf sf
10650 3975 m
gs 1 -1 sc (10) col0 sh gr
/Courier ff 240.00 scf sf
9525 3975 m
gs 1 -1 sc (9) col0 sh gr
/Courier ff 240.00 scf sf
3525 2175 m
gs 1 -1 sc (1) col0 sh gr
/Courier ff 240.00 scf sf
7725 2175 m
gs 1 -1 sc (7) col0 sh gr
/Courier ff 240.00 scf sf
8925 2175 m
gs 1 -1 sc (8) col0 sh gr
/Symbol ff 240.00 scf sf
6150 4125 m
gs 1 -1 sc (e) col0 sh gr
/Symbol ff 240.00 scf sf
3000 3150 m
gs 1 -1 sc (e) col0 sh gr
/Symbol ff 240.00 scf sf
3975 2400 m
gs 1 -1 sc (e) col0 sh gr
/Symbol ff 240.00 scf sf
6300 525 m
gs 1 -1 sc (e) col0 sh gr
/Symbol ff 240.00 scf sf
9375 3000 m
gs 1 -1 sc (e) col0 sh gr
/Times-Italic ff 240.00 scf sf
10050 4050 m
gs 1 -1 sc (a) col0 sh gr
/Times-Italic ff 240.00 scf sf
8250 2325 m
gs 1 -1 sc (b) col0 sh gr
/Courier ff 240.00 scf sf
5025 1575 m
gs 1 -1 sc (2) col0 sh gr
/Courier ff 240.00 scf sf
6225 1575 m
gs 1 -1 sc (3) col0 sh gr
/Symbol ff 240.00 scf sf
5550 1425 m
gs 1 -1 sc (e) col0 sh gr
/Symbol ff 240.00 scf sf
4275 1650 m
gs 1 -1 sc (e) col0 sh gr
/Symbol ff 240.00 scf sf
7050 1725 m
gs 1 -1 sc (e) col0 sh gr
/Courier ff 240.00 scf sf
4425 2775 m
gs 1 -1 sc (4) col0 sh gr
/Courier ff 240.00 scf sf
5625 2775 m
gs 1 -1 sc (5) col0 sh gr
/Courier ff 240.00 scf sf
6825 2775 m
gs 1 -1 sc (6) col0 sh gr
/Times-Italic ff 240.00 scf sf
4875 2925 m
gs 1 -1 sc (a) col0 sh gr
/Times-Italic ff 240.00 scf sf
6150 2850 m
gs 1 -1 sc (a) col0 sh gr
/Symbol ff 240.00 scf sf
7575 1350 m
gs 1 -1 sc (e|) col0 sh gr
% here ends figure;
$F2psEnd
rs
showpage
