%!PS-Adobe-2.0 EPSF-2.0
%%Title: p3b.fig
%%Creator: fig2dev Version 3.2 Patchlevel 4
%%CreationDate: Tue Oct  6 19:15:25 2009
%%For: raparede@niches-dhcp-wireless-172.17.49.124.in.utalca.cl (Rodrigo Paredes)
%%BoundingBox: 0 0 458 128
%%Magnification: 1.0000
%%EndComments
/$F2psDict 200 dict def
$F2psDict begin
$F2psDict /mtrx matrix put
/col-1 {0 setgray} bind def
/col0 {0.000 0.000 0.000 srgb} bind def
/col1 {0.000 0.000 1.000 srgb} bind def
/col2 {0.000 1.000 0.000 srgb} bind def
/col3 {0.000 1.000 1.000 srgb} bind def
/col4 {1.000 0.000 0.000 srgb} bind def
/col5 {1.000 0.000 1.000 srgb} bind def
/col6 {1.000 1.000 0.000 srgb} bind def
/col7 {1.000 1.000 1.000 srgb} bind def
/col8 {0.000 0.000 0.560 srgb} bind def
/col9 {0.000 0.000 0.690 srgb} bind def
/col10 {0.000 0.000 0.820 srgb} bind def
/col11 {0.530 0.810 1.000 srgb} bind def
/col12 {0.000 0.560 0.000 srgb} bind def
/col13 {0.000 0.690 0.000 srgb} bind def
/col14 {0.000 0.820 0.000 srgb} bind def
/col15 {0.000 0.560 0.560 srgb} bind def
/col16 {0.000 0.690 0.690 srgb} bind def
/col17 {0.000 0.820 0.820 srgb} bind def
/col18 {0.560 0.000 0.000 srgb} bind def
/col19 {0.690 0.000 0.000 srgb} bind def
/col20 {0.820 0.000 0.000 srgb} bind def
/col21 {0.560 0.000 0.560 srgb} bind def
/col22 {0.690 0.000 0.690 srgb} bind def
/col23 {0.820 0.000 0.820 srgb} bind def
/col24 {0.500 0.190 0.000 srgb} bind def
/col25 {0.630 0.250 0.000 srgb} bind def
/col26 {0.750 0.380 0.000 srgb} bind def
/col27 {1.000 0.500 0.500 srgb} bind def
/col28 {1.000 0.630 0.630 srgb} bind def
/col29 {1.000 0.750 0.750 srgb} bind def
/col30 {1.000 0.880 0.880 srgb} bind def
/col31 {1.000 0.840 0.000 srgb} bind def

end
save
newpath 0 128 moveto 0 0 lineto 458 0 lineto 458 128 lineto closepath clip newpath
-156.2 468.8 translate
1 -1 scale

/cp {closepath} bind def
/ef {eofill} bind def
/gr {grestore} bind def
/gs {gsave} bind def
/sa {save} bind def
/rs {restore} bind def
/l {lineto} bind def
/m {moveto} bind def
/rm {rmoveto} bind def
/n {newpath} bind def
/s {stroke} bind def
/sh {show} bind def
/slc {setlinecap} bind def
/slj {setlinejoin} bind def
/slw {setlinewidth} bind def
/srgb {setrgbcolor} bind def
/rot {rotate} bind def
/sc {scale} bind def
/sd {setdash} bind def
/ff {findfont} bind def
/sf {setfont} bind def
/scf {scalefont} bind def
/sw {stringwidth} bind def
/tr {translate} bind def
/tnt {dup dup currentrgbcolor
  4 -2 roll dup 1 exch sub 3 -1 roll mul add
  4 -2 roll dup 1 exch sub 3 -1 roll mul add
  4 -2 roll dup 1 exch sub 3 -1 roll mul add srgb}
  bind def
/shd {dup dup currentrgbcolor 4 -2 roll mul 4 -2 roll mul
  4 -2 roll mul srgb} bind def
 /DrawEllipse {
	/endangle exch def
	/startangle exch def
	/yrad exch def
	/xrad exch def
	/y exch def
	/x exch def
	/savematrix mtrx currentmatrix def
	x y tr xrad yrad sc 0 0 1 startangle endangle arc
	closepath
	savematrix setmatrix
	} def

/$F2psBegin {$F2psDict begin /$F2psEnteredState save def} def
/$F2psEnd {$F2psEnteredState restore end} def

$F2psBegin
10 setmiterlimit
0 slj 0 slc
 0.06000 0.06000 sc
%
% Fig objects follow
%
% 
% here starts figure with depth 50
/Times-Italic ff 240.00 scf sf
6900 6675 m
gs 1 -1 sc (a) col0 sh gr
% Ellipse
15.000 slw
n 7650 7500 450 300 0 360 DrawEllipse gs col0 s gr

% Ellipse
n 9308 7524 212 212 0 360 DrawEllipse gs col0 s gr

% Ellipse
n 3900 7500 1125 225 0 360 DrawEllipse gs col0 s gr

% Ellipse
n 9424 5983 375 225 0 360 DrawEllipse gs col0 s gr

% Ellipse
n 6300 6000 1125 300 0 360 DrawEllipse gs col0 s gr

% Polyline
n 2625 7350 m 2775 7500 l
 2625 7650 l gs col0 s gr 
% Polyline
gs  clippath
7215 7560 m 7215 7440 l 6927 7440 l 7167 7500 l 6927 7560 l cp
eoclip
n 5025 7500 m
 7200 7500 l gs col0 s gr gr

% arrowhead
n 6927 7560 m 7167 7500 l 6927 7440 l  col0 s
% Polyline
gs  clippath
5449 6186 m 5373 6094 l 5152 6278 l 5375 6171 l 5229 6370 l cp
eoclip
n 4050 7275 m
 5400 6150 l gs col0 s gr gr

% arrowhead
n 5229 6370 m 5375 6171 l 5152 6278 l  col0 s
% Polyline
gs  clippath
9201 6183 m 9119 6095 l 8909 6293 l 9126 6173 l 8991 6380 l cp
eoclip
n 7950 7275 m
 9150 6150 l gs col0 s gr gr

% arrowhead
n 8991 6380 m 9126 6173 l 8909 6293 l  col0 s
% Polyline
gs  clippath
9090 7559 m 9089 7439 l 8801 7443 l 9042 7500 l 8802 7563 l cp
eoclip
n 8080 7514 m
 9075 7500 l gs col0 s gr gr

% arrowhead
n 8802 7563 m 9042 7500 l 8801 7443 l  col0 s
% Polyline
gs  clippath
9240 7290 m 9360 7290 l 9360 7002 l 9300 7242 l 9240 7002 l cp
eoclip
n 9300 6225 m
 9300 7275 l gs col0 s gr gr

% arrowhead
n 9240 7002 m 9300 7242 l 9360 7002 l  col0 s
% Polyline
gs  clippath
7410 5940 m 7410 6060 l 7698 6060 l 7458 6000 l 7698 5940 l cp
eoclip
n 9075 6000 m
 7425 6000 l gs col0 s gr gr

% arrowhead
n 7698 5940 m 7458 6000 l 7698 6060 l  col0 s
% Polyline
gs  clippath
7313 7325 m 7405 7247 l 7219 7028 l 7329 7250 l 7128 7105 l cp
eoclip
n 6525 6300 m
 7350 7275 l gs col0 s gr gr

% arrowhead
n 7128 7105 m 7329 7250 l 7219 7028 l  col0 s
% Polyline
2 slj
gs  clippath
5208 6153 m 5203 6033 l 4916 6043 l 5158 6095 l 4920 6163 l cp
eoclip
n 5165 5945 m 5163 5945 l 5158 5944 l 5150 5943 l 5138 5941 l 5121 5939 l
 5100 5937 l 5076 5934 l 5049 5931 l 5019 5927 l 4988 5924 l
 4956 5921 l 4924 5918 l 4891 5916 l 4859 5914 l 4827 5913 l
 4795 5912 l 4764 5912 l 4733 5914 l 4703 5916 l 4675 5920 l
 4650 5925 l 4636 5929 l 4623 5934 l 4612 5938 l 4603 5943 l
 4595 5948 l 4588 5953 l 4583 5958 l 4578 5962 l 4574 5967 l
 4571 5971 l 4569 5975 l 4567 5979 l 4565 5983 l 4564 5986 l
 4563 5990 l 4562 5993 l 4562 5997 l 4562 6000 l 4562 6004 l
 4563 6007 l 4564 6011 l 4565 6015 l 4567 6019 l 4569 6023 l
 4572 6028 l 4575 6032 l 4580 6037 l 4586 6042 l 4593 6048 l
 4601 6053 l 4611 6059 l 4622 6064 l 4635 6070 l 4650 6075 l
 4677 6082 l 4706 6088 l 4737 6093 l 4769 6096 l 4802 6099 l
 4836 6101 l 4869 6102 l 4903 6103 l 4937 6103 l 4971 6102 l
 5005 6102 l 5038 6101 l 5069 6100 l 5098 6098 l 5123 6097 l
 5145 6096 l 5162 6095 l
 5191 6094 l gs col0 s gr gr

% arrowhead
0 slj
n 4920 6163 m 5158 6095 l 4916 6043 l  col0 s
% Polyline
2 slj
gs  clippath
9486 7376 m 9535 7485 l 9798 7369 l 9555 7412 l 9749 7259 l cp
eoclip
n 9450 7350 m 9451 7348 l 9453 7343 l 9457 7335 l 9462 7323 l 9470 7306 l
 9479 7285 l 9490 7261 l 9503 7234 l 9517 7204 l 9532 7174 l
 9548 7143 l 9564 7113 l 9582 7083 l 9599 7054 l 9618 7025 l
 9638 6999 l 9658 6974 l 9680 6951 l 9702 6930 l 9726 6913 l
 9750 6900 l 9772 6893 l 9792 6890 l 9811 6890 l 9829 6892 l
 9845 6897 l 9859 6902 l 9872 6909 l 9885 6917 l 9896 6924 l
 9906 6933 l 9916 6941 l 9925 6950 l 9934 6959 l 9942 6969 l
 9951 6979 l 9958 6990 l 9966 7003 l 9973 7016 l 9978 7030 l
 9983 7046 l 9985 7064 l 9985 7083 l 9982 7103 l 9975 7125 l
 9962 7149 l 9945 7173 l 9924 7195 l 9901 7217 l 9876 7237 l
 9850 7257 l 9821 7276 l 9792 7293 l 9762 7311 l 9732 7327 l
 9701 7343 l 9671 7358 l 9641 7372 l 9614 7385 l 9590 7396 l
 9569 7405 l 9552 7413 l
 9525 7425 l gs col0 s gr gr

% arrowhead
0 slj
n 9749 7259 m 9555 7412 l 9798 7369 l  col0 s
/Times-Italic ff 240.00 scf sf
5625 7725 m
gs 1 -1 sc (a) col0 sh gr
/Times-Italic ff 240.00 scf sf
4350 6075 m
gs 1 -1 sc (b) col0 sh gr
/Times-Italic ff 240.00 scf sf
8475 6675 m
gs 1 -1 sc (a) col0 sh gr
/Times-Italic ff 240.00 scf sf
9900 6825 m
gs 1 -1 sc  320.0 rot (a,b) col0 sh gr
/Times-Italic ff 240.00 scf sf
8625 7800 m
gs 1 -1 sc (b) col0 sh gr
/Times-Italic ff 240.00 scf sf
9375 6825 m
gs 1 -1 sc (a) col0 sh gr
/Times-Italic ff 240.00 scf sf
7950 6225 m
gs 1 -1 sc (b) col0 sh gr
/Courier ff 240.00 scf sf
2925 7575 m
gs 1 -1 sc (0,1,2,3,7,4,9) col0 sh gr
/Courier ff 240.00 scf sf
7350 7575 m
gs 1 -1 sc (5,10) col0 sh gr
/Courier ff 240.00 scf sf
9225 6075 m
gs 1 -1 sc (6,7) col0 sh gr
/Courier ff 240.00 scf sf
5325 6075 m
gs 1 -1 sc (8,9,1,2,3,7,4) col0 sh gr
/Times-Italic ff 240.00 scf sf
4575 6750 m
gs 1 -1 sc (b) col0 sh gr
% Ellipse
n 7650 7500 375 225 0 360 DrawEllipse gs col0 s gr

% here ends figure;
$F2psEnd
rs
showpage
