%!PS-Adobe-2.0 EPSF-2.0
%%Title: p3.4.fig
%%Creator: fig2dev Version 3.2 Patchlevel 5
%%CreationDate: Wed Dec 21 17:48:22 2011
%%For: raparede@rayen.local (Rodrigo Paredes)
%%BoundingBox: 0 0 217 153
%Magnification: 1.0000
%%EndComments
/$F2psDict 200 dict def
$F2psDict begin
$F2psDict /mtrx matrix put
/col-1 {0 setgray} bind def
/col0 {0.000 0.000 0.000 srgb} bind def
/col1 {0.000 0.000 1.000 srgb} bind def
/col2 {0.000 1.000 0.000 srgb} bind def
/col3 {0.000 1.000 1.000 srgb} bind def
/col4 {1.000 0.000 0.000 srgb} bind def
/col5 {1.000 0.000 1.000 srgb} bind def
/col6 {1.000 1.000 0.000 srgb} bind def
/col7 {1.000 1.000 1.000 srgb} bind def
/col8 {0.000 0.000 0.560 srgb} bind def
/col9 {0.000 0.000 0.690 srgb} bind def
/col10 {0.000 0.000 0.820 srgb} bind def
/col11 {0.530 0.810 1.000 srgb} bind def
/col12 {0.000 0.560 0.000 srgb} bind def
/col13 {0.000 0.690 0.000 srgb} bind def
/col14 {0.000 0.820 0.000 srgb} bind def
/col15 {0.000 0.560 0.560 srgb} bind def
/col16 {0.000 0.690 0.690 srgb} bind def
/col17 {0.000 0.820 0.820 srgb} bind def
/col18 {0.560 0.000 0.000 srgb} bind def
/col19 {0.690 0.000 0.000 srgb} bind def
/col20 {0.820 0.000 0.000 srgb} bind def
/col21 {0.560 0.000 0.560 srgb} bind def
/col22 {0.690 0.000 0.690 srgb} bind def
/col23 {0.820 0.000 0.820 srgb} bind def
/col24 {0.500 0.190 0.000 srgb} bind def
/col25 {0.630 0.250 0.000 srgb} bind def
/col26 {0.750 0.380 0.000 srgb} bind def
/col27 {1.000 0.500 0.500 srgb} bind def
/col28 {1.000 0.630 0.630 srgb} bind def
/col29 {1.000 0.750 0.750 srgb} bind def
/col30 {1.000 0.880 0.880 srgb} bind def
/col31 {1.000 0.840 0.000 srgb} bind def

end
save
newpath 0 153 moveto 0 0 lineto 217 0 lineto 217 153 lineto closepath clip newpath
-133.7 371.8 translate
1 -1 scale

/cp {closepath} bind def
/ef {eofill} bind def
/gr {grestore} bind def
/gs {gsave} bind def
/sa {save} bind def
/rs {restore} bind def
/l {lineto} bind def
/m {moveto} bind def
/rm {rmoveto} bind def
/n {newpath} bind def
/s {stroke} bind def
/sh {show} bind def
/slc {setlinecap} bind def
/slj {setlinejoin} bind def
/slw {setlinewidth} bind def
/srgb {setrgbcolor} bind def
/rot {rotate} bind def
/sc {scale} bind def
/sd {setdash} bind def
/ff {findfont} bind def
/sf {setfont} bind def
/scf {scalefont} bind def
/sw {stringwidth} bind def
/tr {translate} bind def
/tnt {dup dup currentrgbcolor
  4 -2 roll dup 1 exch sub 3 -1 roll mul add
  4 -2 roll dup 1 exch sub 3 -1 roll mul add
  4 -2 roll dup 1 exch sub 3 -1 roll mul add srgb}
  bind def
/shd {dup dup currentrgbcolor 4 -2 roll mul 4 -2 roll mul
  4 -2 roll mul srgb} bind def
 /DrawEllipse {
	/endangle exch def
	/startangle exch def
	/yrad exch def
	/xrad exch def
	/y exch def
	/x exch def
	/savematrix mtrx currentmatrix def
	x y tr xrad yrad sc 0 0 1 startangle endangle arc
	closepath
	savematrix setmatrix
	} def

/$F2psBegin {$F2psDict begin /$F2psEnteredState save def} def
/$F2psEnd {$F2psEnteredState restore end} def

$F2psBegin
10 setmiterlimit
0 slj 0 slc
 0.06000 0.06000 sc
%
% Fig objects follow
%
% 
% here starts figure with depth 50
/Symbol ff 333.33 scf sf
4275 5025 m
gs 1 -1 sc (e) col0 sh gr
% Ellipse
15.000 slw
n 2757 4332 237 237 0 360 DrawEllipse gs col0 s gr

% Ellipse
n 5550 4350 168 168 0 360 DrawEllipse gs col0 s gr

% Ellipse
n 5550 4350 270 270 0 360 DrawEllipse gs col0 s gr

% Ellipse
n 4204 5814 237 237 0 360 DrawEllipse gs col0 s gr

% Ellipse
n 5550 5850 168 168 0 360 DrawEllipse gs col0 s gr

% Ellipse
n 5550 5850 270 270 0 360 DrawEllipse gs col0 s gr

% Polyline
0 slj
0 slc
gs  clippath
3722 4395 m 3915 4395 l 3915 4305 l 3722 4305 l 3722 4305 l 3872 4350 l 3722 4395 l cp
eoclip
n 3000 4350 m
 3900 4350 l gs col0 s gr gr

% arrowhead
n 3722 4395 m 3872 4350 l 3722 4305 l  col0 s
% Polyline
gs  clippath
5147 4395 m 5340 4395 l 5340 4305 l 5147 4305 l 5147 4305 l 5297 4350 l 5147 4395 l cp
eoclip
n 4425 4350 m
 5325 4350 l gs col0 s gr gr

% arrowhead
n 5147 4395 m 5297 4350 l 5147 4305 l  col0 s
% Polyline
gs  clippath
4155 5372 m 4155 5565 l 4245 5565 l 4245 5372 l 4245 5372 l 4200 5522 l 4155 5372 l cp
eoclip
n 4200 4575 m
 4200 5550 l gs col0 s gr gr

% arrowhead
n 4155 5372 m 4200 5522 l 4245 5372 l  col0 s
% Polyline
gs  clippath
5147 5895 m 5340 5895 l 5340 5805 l 5147 5805 l 5147 5805 l 5297 5850 l 5147 5895 l cp
eoclip
n 4425 5850 m
 5325 5850 l gs col0 s gr gr

% arrowhead
n 5147 5895 m 5297 5850 l 5147 5805 l  col0 s
% Polyline
n 2250 4125 m 2550 4350 l
 2250 4575 l gs col0 s gr 
% Polyline
2 slj
gs  clippath
3875 4067 m 4038 4171 l 4086 4095 l 3923 3991 l 3923 3991 l 4026 4110 l 3875 4067 l cp
eoclip
n 4350 4125 m 4352 4124 l 4358 4122 l 4367 4117 l 4380 4111 l 4398 4103 l
 4418 4093 l 4440 4081 l 4463 4069 l 4485 4055 l 4507 4040 l
 4527 4025 l 4545 4008 l 4560 3990 l 4571 3970 l 4578 3948 l
 4580 3925 l 4575 3900 l 4566 3880 l 4554 3860 l 4540 3842 l
 4525 3826 l 4510 3811 l 4495 3798 l 4481 3786 l 4468 3776 l
 4456 3767 l 4443 3758 l 4431 3750 l 4419 3742 l 4405 3734 l
 4391 3727 l 4375 3719 l 4357 3711 l 4337 3703 l 4314 3695 l
 4289 3687 l 4261 3681 l 4231 3677 l 4200 3675 l 4167 3677 l
 4136 3682 l 4109 3689 l 4086 3698 l 4066 3707 l 4050 3715 l
 4036 3724 l 4025 3733 l 4015 3741 l 4006 3750 l 3998 3759 l
 3989 3769 l 3980 3779 l 3970 3791 l 3959 3804 l 3947 3820 l
 3934 3837 l 3921 3856 l 3909 3878 l 3900 3900 l 3894 3925 l
 3894 3948 l 3897 3970 l 3904 3990 l 3914 4008 l 3926 4025 l
 3939 4040 l 3954 4055 l 3970 4069 l 3986 4081 l 4002 4093 l
 4016 4103 l 4028 4111 l
 4050 4125 l gs col0 s gr gr

% arrowhead
0 slj
n 3875 4067 m 4026 4110 l 3923 3991 l  col0 s
% Polyline
2 slj
gs  clippath
3917 6174 m 4021 6011 l 3945 5963 l 3841 6126 l 3841 6126 l 3960 6024 l 3917 6174 l cp
eoclip
n 3975 5700 m 3974 5698 l 3972 5692 l 3967 5683 l 3961 5670 l 3953 5652 l
 3943 5632 l 3931 5610 l 3919 5587 l 3905 5565 l 3890 5543 l
 3875 5523 l 3858 5505 l 3840 5490 l 3820 5479 l 3798 5472 l
 3775 5470 l 3750 5475 l 3730 5484 l 3710 5496 l 3692 5510 l
 3676 5525 l 3661 5540 l 3648 5555 l 3636 5569 l 3626 5582 l
 3617 5594 l 3608 5607 l 3600 5619 l 3592 5631 l 3584 5645 l
 3577 5659 l 3569 5675 l 3561 5693 l 3553 5713 l 3545 5736 l
 3537 5761 l 3531 5789 l 3527 5819 l 3525 5850 l 3527 5883 l
 3532 5914 l 3539 5941 l 3548 5964 l 3557 5984 l 3565 6000 l
 3574 6014 l 3583 6025 l 3591 6035 l 3600 6044 l 3609 6052 l
 3619 6061 l 3629 6070 l 3641 6080 l 3654 6091 l 3670 6103 l
 3687 6116 l 3706 6129 l 3728 6141 l 3750 6150 l 3775 6156 l
 3798 6156 l 3820 6153 l 3840 6146 l 3858 6136 l 3875 6124 l
 3890 6111 l 3905 6096 l 3919 6080 l 3931 6064 l 3943 6048 l
 3953 6034 l 3961 6022 l
 3975 6000 l gs col0 s gr gr

% arrowhead
0 slj
n 3917 6174 m 3960 6024 l 3841 6126 l  col0 s
/Times-BoldItalic ff 333.33 scf sf
3300 5850 m
gs 1 -1 sc (b) col0 sh gr
/Times-BoldItalic ff 333.33 scf sf
4800 5775 m
gs 1 -1 sc (a) col0 sh gr
/Times-BoldItalic ff 333.33 scf sf
3300 4275 m
gs 1 -1 sc (b) col0 sh gr
/Times-BoldItalic ff 333.33 scf sf
3675 3975 m
gs 1 -1 sc (b) col0 sh gr
/Times-BoldItalic ff 333.33 scf sf
4725 4275 m
gs 1 -1 sc (b) col0 sh gr
% Ellipse
n 4200 4350 237 237 0 360 DrawEllipse gs col0 s gr

% here ends figure;
$F2psEnd
rs
showpage
%%Trailer
%EOF
