%!PS-Adobe-2.0 EPSF-2.0
%%Title: ap3-1.fig
%%Creator: fig2dev Version 3.2 Patchlevel 4
%%CreationDate: Sun Dec  6 04:03:32 2009
%%For: raparede@rayen.local (Rodrigo Paredes)
%%BoundingBox: 0 0 285 194
%%Magnification: 1.0000
%%EndComments
/$F2psDict 200 dict def
$F2psDict begin
$F2psDict /mtrx matrix put
/col-1 {0 setgray} bind def
/col0 {0.000 0.000 0.000 srgb} bind def
/col1 {0.000 0.000 1.000 srgb} bind def
/col2 {0.000 1.000 0.000 srgb} bind def
/col3 {0.000 1.000 1.000 srgb} bind def
/col4 {1.000 0.000 0.000 srgb} bind def
/col5 {1.000 0.000 1.000 srgb} bind def
/col6 {1.000 1.000 0.000 srgb} bind def
/col7 {1.000 1.000 1.000 srgb} bind def
/col8 {0.000 0.000 0.560 srgb} bind def
/col9 {0.000 0.000 0.690 srgb} bind def
/col10 {0.000 0.000 0.820 srgb} bind def
/col11 {0.530 0.810 1.000 srgb} bind def
/col12 {0.000 0.560 0.000 srgb} bind def
/col13 {0.000 0.690 0.000 srgb} bind def
/col14 {0.000 0.820 0.000 srgb} bind def
/col15 {0.000 0.560 0.560 srgb} bind def
/col16 {0.000 0.690 0.690 srgb} bind def
/col17 {0.000 0.820 0.820 srgb} bind def
/col18 {0.560 0.000 0.000 srgb} bind def
/col19 {0.690 0.000 0.000 srgb} bind def
/col20 {0.820 0.000 0.000 srgb} bind def
/col21 {0.560 0.000 0.560 srgb} bind def
/col22 {0.690 0.000 0.690 srgb} bind def
/col23 {0.820 0.000 0.820 srgb} bind def
/col24 {0.500 0.190 0.000 srgb} bind def
/col25 {0.630 0.250 0.000 srgb} bind def
/col26 {0.750 0.380 0.000 srgb} bind def
/col27 {1.000 0.500 0.500 srgb} bind def
/col28 {1.000 0.630 0.630 srgb} bind def
/col29 {1.000 0.750 0.750 srgb} bind def
/col30 {1.000 0.880 0.880 srgb} bind def
/col31 {1.000 0.840 0.000 srgb} bind def

end
save
newpath 0 194 moveto 0 0 lineto 285 0 lineto 285 194 lineto closepath clip newpath
-160.7 421.1 translate
1 -1 scale

/cp {closepath} bind def
/ef {eofill} bind def
/gr {grestore} bind def
/gs {gsave} bind def
/sa {save} bind def
/rs {restore} bind def
/l {lineto} bind def
/m {moveto} bind def
/rm {rmoveto} bind def
/n {newpath} bind def
/s {stroke} bind def
/sh {show} bind def
/slc {setlinecap} bind def
/slj {setlinejoin} bind def
/slw {setlinewidth} bind def
/srgb {setrgbcolor} bind def
/rot {rotate} bind def
/sc {scale} bind def
/sd {setdash} bind def
/ff {findfont} bind def
/sf {setfont} bind def
/scf {scalefont} bind def
/sw {stringwidth} bind def
/tr {translate} bind def
/tnt {dup dup currentrgbcolor
  4 -2 roll dup 1 exch sub 3 -1 roll mul add
  4 -2 roll dup 1 exch sub 3 -1 roll mul add
  4 -2 roll dup 1 exch sub 3 -1 roll mul add srgb}
  bind def
/shd {dup dup currentrgbcolor 4 -2 roll mul 4 -2 roll mul
  4 -2 roll mul srgb} bind def
 /DrawEllipse {
	/endangle exch def
	/startangle exch def
	/yrad exch def
	/xrad exch def
	/y exch def
	/x exch def
	/savematrix mtrx currentmatrix def
	x y tr xrad yrad sc 0 0 1 startangle endangle arc
	closepath
	savematrix setmatrix
	} def

/$F2psBegin {$F2psDict begin /$F2psEnteredState save def} def
/$F2psEnd {$F2psEnteredState restore end} def

$F2psBegin
10 setmiterlimit
0 slj 0 slc
 0.06000 0.06000 sc
%
% Fig objects follow
%
% 
% here starts figure with depth 50
/Times-Roman ff 270.00 scf sf
3675 5250 m
gs 1 -1 sc (_,E) col0 sh gr
% Ellipse
15.000 slw
n 6000 5400 212 212 0 360 DrawEllipse gs col0 s gr

% Ellipse
n 6000 5400 270 270 0 360 DrawEllipse gs col0 s gr

% Polyline
gs  clippath
5715 5460 m 5715 5340 l 5427 5340 l 5667 5400 l 5427 5460 l cp
eoclip
n 3225 5400 m
 5700 5400 l gs col0 s gr gr

% arrowhead
n 5427 5460 m 5667 5400 l 5427 5340 l  col0 s
% Polyline
n 2700 5250 m 2775 5400 l
 2700 5550 l gs col0 s gr 
% Polyline
2 slj
gs  clippath
6089 5163 m 6197 5214 l 6320 4953 l 6164 5145 l 6211 4902 l cp
eoclip
n 5850 5175 m 5849 5174 l 5848 5171 l 5846 5166 l 5842 5158 l 5837 5147 l
 5831 5132 l 5823 5114 l 5813 5093 l 5803 5068 l 5791 5041 l
 5778 5011 l 5765 4978 l 5752 4944 l 5738 4909 l 5724 4872 l
 5711 4835 l 5698 4796 l 5686 4757 l 5674 4717 l 5663 4677 l
 5653 4636 l 5644 4594 l 5636 4550 l 5630 4506 l 5625 4461 l
 5622 4415 l 5620 4368 l 5621 4321 l 5625 4275 l 5632 4228 l
 5640 4184 l 5650 4144 l 5661 4108 l 5672 4076 l 5684 4049 l
 5694 4025 l 5705 4005 l 5715 3988 l 5724 3973 l 5733 3960 l
 5742 3949 l 5750 3940 l 5759 3931 l 5768 3923 l 5777 3915 l
 5787 3907 l 5798 3898 l 5810 3890 l 5823 3880 l 5838 3870 l
 5855 3860 l 5874 3850 l 5895 3839 l 5917 3830 l 5942 3822 l
 5967 3816 l 5994 3814 l 6021 3816 l 6047 3822 l 6071 3830 l
 6094 3839 l 6115 3850 l 6134 3860 l 6152 3870 l 6167 3880 l
 6181 3890 l 6193 3898 l 6205 3907 l 6215 3915 l 6225 3923 l
 6234 3931 l 6243 3940 l 6252 3949 l 6261 3960 l 6271 3973 l
 6281 3988 l 6291 4005 l 6302 4025 l 6313 4049 l 6325 4076 l
 6337 4108 l 6348 4144 l 6359 4184 l 6368 4228 l 6375 4275 l
 6379 4321 l 6380 4368 l 6379 4415 l 6376 4461 l 6372 4506 l
 6365 4550 l 6358 4594 l 6349 4636 l 6339 4677 l 6328 4717 l
 6316 4757 l 6303 4796 l 6290 4835 l 6277 4872 l 6263 4909 l
 6249 4944 l 6236 4978 l 6222 5011 l 6210 5041 l 6198 5068 l
 6187 5093 l 6178 5114 l 6170 5132 l 6163 5147 l 6158 5158 l

 6150 5175 l gs col0 s gr gr

% arrowhead
0 slj
n 6211 4902 m 6164 5145 l 6320 4953 l  col0 s
% Polyline
2 slj
gs  clippath
6221 5565 m 6113 5616 l 6235 5877 l 6188 5635 l 6344 5826 l cp
eoclip
n 5874 5605 m 5873 5606 l 5872 5609 l 5870 5614 l 5866 5622 l 5861 5633 l
 5855 5647 l 5847 5665 l 5837 5686 l 5827 5711 l 5815 5738 l
 5802 5768 l 5789 5800 l 5776 5834 l 5762 5869 l 5748 5906 l
 5735 5943 l 5722 5981 l 5709 6020 l 5698 6060 l 5687 6100 l
 5677 6141 l 5668 6184 l 5660 6227 l 5653 6271 l 5649 6317 l
 5645 6363 l 5644 6411 l 5645 6458 l 5649 6505 l 5656 6553 l
 5664 6598 l 5675 6639 l 5686 6676 l 5697 6709 l 5708 6737 l
 5719 6762 l 5729 6783 l 5739 6801 l 5749 6817 l 5758 6830 l
 5767 6842 l 5775 6852 l 5784 6862 l 5793 6871 l 5802 6880 l
 5813 6889 l 5823 6898 l 5836 6907 l 5849 6917 l 5864 6928 l
 5881 6939 l 5900 6950 l 5920 6961 l 5943 6971 l 5968 6980 l
 5993 6986 l 6020 6988 l 6047 6986 l 6073 6980 l 6097 6971 l
 6120 6961 l 6141 6950 l 6160 6939 l 6177 6928 l 6193 6917 l
 6206 6907 l 6219 6898 l 6230 6889 l 6240 6880 l 6250 6871 l
 6259 6862 l 6268 6852 l 6277 6842 l 6286 6830 l 6296 6817 l
 6305 6801 l 6316 6783 l 6327 6762 l 6338 6737 l 6349 6709 l
 6361 6676 l 6372 6639 l 6383 6598 l 6392 6553 l 6399 6505 l
 6403 6458 l 6404 6411 l 6403 6363 l 6400 6317 l 6395 6271 l
 6389 6227 l 6381 6184 l 6372 6141 l 6362 6100 l 6351 6060 l
 6340 6020 l 6327 5981 l 6314 5943 l 6301 5906 l 6287 5869 l
 6273 5834 l 6259 5800 l 6246 5768 l 6234 5738 l 6222 5711 l
 6211 5686 l 6202 5665 l 6193 5647 l 6187 5633 l 6182 5622 l

 6174 5605 l gs col0 s gr gr

% arrowhead
0 slj
n 6344 5826 m 6188 5635 l 6235 5877 l  col0 s
/Times-Roman ff 270.00 scf sf
4875 4125 m
gs 1 -1 sc (^,^,_) col0 sh gr
/Times-Roman ff 270.00 scf sf
4875 4755 m
gs 1 -1 sc (\(,\(,_) col0 sh gr
/Helvetica ff 270.00 scf sf
4875 4440 m
gs 1 -1 sc (v,v,_) col0 sh gr
/Times-Roman ff 270.00 scf sf
6600 4095 m
gs 1 -1 sc (\),\),_) col0 sh gr
/Times-Roman ff 270.00 scf sf
6600 4725 m
gs 1 -1 sc (1,1,_) col0 sh gr
/Times-Roman ff 270.00 scf sf
6600 4410 m
gs 1 -1 sc (0,0,_) col0 sh gr
/Symbol ff 270.00 scf sf
4547 6564 m
gs 1 -1 sc (e,) col0 sh gr
/Symbol ff 270.00 scf sf
4547 6189 m
gs 1 -1 sc (e,) col0 sh gr
/Times-Roman ff 270.00 scf sf
4772 6189 m
gs 1 -1 sc (E,E^E) col0 sh gr
/Times-Roman ff 270.00 scf sf
4772 6564 m
gs 1 -1 sc (E,E   E) col0 sh gr
/Helvetica ff 270.00 scf sf
5216 6564 m
gs 1 -1 sc (v) col0 sh gr
/Times-Roman ff 270.00 scf sf
6812 6196 m
gs 1 -1 sc (E,\(E\)) col0 sh gr
/Symbol ff 270.00 scf sf
6587 6196 m
gs 1 -1 sc (e,) col0 sh gr
/Symbol ff 270.00 scf sf
6587 6571 m
gs 1 -1 sc (e,) col0 sh gr
/Symbol ff 270.00 scf sf
6587 6946 m
gs 1 -1 sc (e,) col0 sh gr
/Times-Roman ff 270.00 scf sf
6812 6571 m
gs 1 -1 sc (E,0) col0 sh gr
/Times-Roman ff 270.00 scf sf
6812 6946 m
gs 1 -1 sc (E,1) col0 sh gr
/Times-Roman ff 270.00 scf sf
2954 5481 m
gs 1 -1 sc (s) col0 sh gr
/Times-Roman ff 270.00 scf sf
5960 5496 m
gs 1 -1 sc (f) col0 sh gr
/Symbol ff 270.00 scf sf
3525 5250 m
gs 1 -1 sc (e,) col0 sh gr
% Ellipse
n 3000 5400 212 212 0 360 DrawEllipse gs col0 s gr

% here ends figure;
$F2psEnd
rs
showpage
