aws_ami,AWS.EC2.EncryptionandKeyManagement.Medium.0688
aws_ami_launch_permission,AWS.AMI.NS.Medium.1040
aws_api_gateway_method,AWS.APGM.IS.LOW.0056
aws_api_gateway_rest_api,AWS.APIGateway.Medium.0568
aws_api_gateway_rest_api_policy,AWS.APGRAP.IAM.HIGH.0064
aws_apigatewayv2_api,AWS.ApiGatewayV2Api.AccessControl.0630
aws_apigatewayv2_stage,AWS.ApiGatewayV2Stage.Logging.0630
aws_athena_database,AWS.ADB.DP.MEDIUM.016
aws_cloudformation_stack,AWS.CloudFormation.Medium.0599
aws_cloudformation_stack,AWS.CloudFormation.Medium.0603
aws_cloudformation_stack,AWS.CloudFormation.Medium.0604
aws_cloudformation_stack,AWS.CloudFormation.Medium.0605
aws_cloudfront_distribution,AC-AW-IS-CD-M-0026
aws_cloudfront_distribution,AC-AW-IS-CD-M-1186
aws_cloudfront_distribution,AWS.CloudFront.EncryptionandKeyManagement.High.0407
aws_cloudfront_distribution,AWS.CloudFront.EncryptionandKeyManagement.High.0408
aws_cloudfront_distribution,AWS.CloudFront.Logging.Medium.0567
aws_cloudtrail,AWS.CloudTrail.LM.MEDIUM.0087
aws_cloudtrail,AWS.CloudTrail.Logging.High.0399
aws_cloudtrail,AWS.CloudTrail.Logging.Low.009
aws_cloudtrail,AWS.CloudTrail.Logging.Low.0559
aws_cloudtrail,AWS.CloudTrail.Logging.Medium.004
aws_cloudtrail,AWS.CloudTrail.Logging.Medium.008
aws_cloudtrail,AWS.CloudTrail.Logging.Medium.0460
aws_cloudtrail,AWS.Config.Logging.Medium.0590
aws_cloudwatch,AWS.CloudWatch.EncryptionandKeyManagement.High.0632
aws_cloudwatch,AWS.CloudWatch.Logging.Medium.0631
aws_cloudwatch_log_group,AWS.ACLG.LM.MEDIUM.0068
aws_config,AWS.Config.EncryptionandKeyManagement.Medium.0660
aws_config_configuration_aggregator,AWS.Config.Logging.HIGH.0590
aws_dax_cluster,AWS.ADC.DP.MEDIUM.0021
aws_db_instance,AWS.ADI.LM.MEDIUM.0076
aws_db_instance,AWS.RDS.DataSecurity.High.0414
aws_db_instance,AWS.RDS.DataSecurity.High.0577
aws_db_instance,AWS.RDS.DS.High.1041
aws_db_instance,AWS.RDS.DS.High.1042
aws_db_instance,AWS.RDS.NS.High.0101
aws_db_security_group,AWS.RDS.NetworkSecurity.High.0101
aws_db_security_group,AWS.RDS.NetworkSecurity.High.0102
aws_db_security_group,AWS.RDS.NetworkSecurity.High.0103
aws_docdb_cluster,AWS.ADC.DP.MEDIUM.0022
aws_docdb_cluster,AWS.ADC.LM.MEDIUM.0069
aws_dynamodb_table,AWS.ADT.DP.MEDIUM.0025
aws_dynamodb_table,AWS.DynamoDb.Logging.Medium.007
aws_ebs_encryption_by_default,AWS.EBS.DataSecurity.High.0580
aws_ebs_volume,AWS.EBS.EKM.Medium.0682
aws_ebs_volume,AWS.EcsCluster.EncryptionandKeyManagement.High.0413
aws_ecr_repository,AWS.AER.DP.MEDIUM.0026
aws_ecr_repository,AWS.AER.DP.MEDIUM.0058
aws_ecr_repository,AWS.ECR.DataSecurity.High.0578
aws_ecr_repository_policy,AWS.ECR.DataSecurity.High.0579
aws_ecs_service,AWS.ECS.High.0436
aws_ecs_task_definition,AWS.AETD.IS.MEDIUM.0043
aws_ecs_task_definition,AWS.EcsCluster.NetworkSecurity.High.0104
aws_ecs_task_definition,AWS.LaunchConfiguration.DataSecurity.High.0101
aws_efs_file_system,AWS.EFS.EncryptionandKeyManagement.High.0409
aws_efs_file_system,AWS.EFS.EncryptionandKeyManagement.High.0410
aws_efs_file_system_policy,AWS.AEFSP.IAM.HIGH.0059
aws_eks_cluster,AWS.AEC.LM.MEDIUM.0071
aws_elasticache_cluster,AWS.ElastiCache.DataSecurity.High.0424
aws_elasticache_cluster,AWS.ElastiCache.DataSecurity.High.0425
aws_elasticache_cluster,AWS.ElastiCache.HighAvailability.Medium.0757
aws_elasticcache_replication_group,AWS.AERG.DP.MEDIUM.0027
aws_elasticcache_replication_group,AWS.AERG.DP.MEDIUM.0044
aws_elasticsearch_domain,AWS.ElasticSearch.EKM.Medium.0768
aws_elasticsearch_domain,AWS.ElasticSearch.EKM.Medium.0778
aws_elasticsearch_domain,AWS.ElasticSearch.IS.MEDIUM.0045
aws_elasticsearch_domain,AWS.Elasticsearch.Logging.Medium.0573
aws_elasticsearch_domain_policy,AWS.AEDP.IAM.HIGH.0060
aws_elb,AWS.ELB.LM.MEDIUM.0072
aws_elb,AWS.ELB.NetworkPortsSecurity.Low.0563
aws_globalaccelerator_accelerator,AWS.AGA.LM.LOW.0073
aws_iam_access_key,AWS.IamUser.IAM.High.0390
aws_iam_access_key,AWS.IamUser.IAM.High.0391
aws_iam_account_password_policy,AWS.Iam.IAM.Low.0539
aws_iam_account_password_policy,AWS.Iam.IAM.Low.0540
aws_iam_account_password_policy,AWS.Iam.IAM.Medium.0454
aws_iam_account_password_policy,AWS.Iam.IAM.Medium.0455
aws_iam_account_password_policy,AWS.Iam.IAM.Medium.0456
aws_iam_account_password_policy,AWS.Iam.IAM.Medium.0457
aws_iam_account_password_policy,AWS.Iam.IAM.Medium.0458
aws_iam_account_password_policy,AWS.Iam.IAM.Medium.0495
aws_iam_group_policy,AC-AW-IA-H-0392
aws_iam_policy,AC-AW-IA-H-1187
aws_iam_role,AC-AW-IA-H-1188
aws_iam_role_policy,AC-AW-IA-H-1189
aws_iam_role_policy,AWS.AIRP.IAM.HIGH.0051
aws_iam_user_login_profile,AWS.Iam.IAM.High.0391
aws_iam_user_policy,AC-AW-IA-H-1190
aws_iam_user_policy_attachment,AWS.AIUPA.IAM.MEDIUM.0050
aws_iam_user_policy,AWS.AIUP.IAM.MEDIUM.0049
aws_iam_user_policy,AWS.IamUser.IAM.High.0387
aws_iam_user_policy,AWS.IamUser.IAM.High.0388
aws_iam_user_policy,AWS.IamUser.IAM.High.0389
aws_instance,AC-AW-IA-LC-H-0442
aws_instance,AC-AW-IS-LC-H-0443
aws_instance,AC-AW-IS-IN-M-0144
aws_instance,AC-AWS-NS-IN-M-1172
aws_instance,AWS.AI.LM.HIGH.0070
aws_kinesis_firehose_delivery_stream,AWS.Kinesis.EncryptionandKeyManagement.High.0411
aws_kinesis_stream,AWS.Kinesis.EncryptionandKeyManagement.High.0412
aws_kms_key,AWS.AKK.DP.HIGH.0012
aws_kms_key,AWS.AKK.IAM.HIGH.0012
aws_kms_key,AWS.AKK.IAM.HIGH.0082
aws_kms_key,AWS.KMS.NetworkSecurity.High.0566
aws_lambda_function,AWS.LambdaFunction.EncryptionandKeyManagement.0471
aws_lambda_function,AWS.LambdaFunction.LM.MEIDUM.0063
aws_lambda_function,AWS.LambdaFunction.Logging.0470
aws_lambda_function,AWS.LambdaFunction.Logging.0470
aws_lambda_function,AWS.LambdaFunction.Logging.0472
aws_launch_configuration,AC-AW-CA-LC-H-0439
aws_launch_configuration,AC-AW-IA-LC-H-0441
aws_launch_configuration,AC-AW-IS-LC-H-0438
aws_launch_configuration,AC-AW-LM-LC-M-0440
aws_launch_configuration,AWS.EcsCluster.EncryptionandKeyManagement.High.0413
aws_launch_configuration,AWS.LaunchConfiguration.DataSecurity.High.0101
aws_launch_configuration,AWS.LaunchConfiguration.DataSecurity.High.0102
aws_lb_listener,AWS.ALL.IS.MEDIUM.0046
aws_lb_target_group,AWS.ALTG.IS.MEDIUM.0042
aws_load_balancer_policy,AWS.ELB.EncryptionandKeyManagement.High.0401
aws_load_balancer_policy,AWS.ELB.EncryptionandKeyManagement.High.0403
aws_mq_broker,AWS.ElasticSearch.Logging.Medium.0885
aws_mq_broker,AWS.ElasticSearch.NetworkSecurity.Medium.0887
aws_neptune_cluster,AWS.ANC.DP.MEDIUM.0030
aws_neptune_cluster,AWS.ANC.LM.MEDIUM.0075
aws_rds_cluster,AWS.RDS.EncryptionandKeyManagement.High.0414
aws_rds_cluster,AWS.RDS.RE.MEDIUM.0013
aws_redshift_cluster,AWS.Redshift.EncryptionandKeyManagement.High.0415
aws_redshift_cluster,AWS.Redshift.Logging.Medium.0565
aws_redshift_cluster,AWS.Redshift.NetworkSecurity.HIGH.0564
aws_route53_record,AWS.Route53HostedZone.DNSManagement.High.0422
aws_s3_bucket,AWS.S3Bucket.DS.High.1043
aws_s3_bucket,AWS.S3Bucket.EncryptionandKeyManagement.High.0405
aws_s3_bucket,AWS.S3Bucket.IAM.HIGH.0065
aws_s3_bucket,AWS.S3Bucket.IAM.High.0370
aws_s3_bucket,AWS.S3Bucket.IAM.High.0377
aws_s3_bucket,AWS.S3Bucket.IAM.High.0378
aws_s3_bucket,AWS.S3Bucket.IAM.High.0379
aws_s3_bucket,AWS.S3Bucket.IAM.High.0381
aws_s3_bucket,AWS.S3Bucket.LM.MEDIUM.0078
aws_s3_bucket,AWS.S3Bucket.NetworkSecurity.High.0417
aws_s3_bucket_object,AWS.ASBO.DP.MEDIUM.0034
aws_s3_bucket_policy,AWS.IamPolicy.IAM.High.0373
aws_s3_bucket_policy,AWS.IamPolicy.IAM.High.0374
aws_s3_bucket_policy,AWS.IamPolicy.IAM.High.0375
aws_s3_bucket_policy,AWS.IamPolicy.IAM.High.0376
aws_s3_bucket_policy,AWS.S3Bucket.IAM.High.0371
aws_s3_bucket_policy,AWS.S3Bucket.IAM.High.0372
aws_sagemaker_notebook_instance,AWS.ASNI.DP.MEDIUM.0035
aws_secretsmanager_secret,AWS.SecretsManagerSecret.DP.MEDIUM.0036
aws_secretsmanager_secret_policy,AWS.ASSP.IAM.HIGH.0066
aws_security_group,AC_AWS_0227
aws_security_group,AC_AWS_0228
aws_security_group,AC_AWS_0229
aws_security_group,AC_AWS_0230
aws_security_group,AC_AWS_0231
aws_security_group,AC_AWS_0232
aws_security_group,AC_AWS_0233
aws_security_group,AC_AWS_0234
aws_security_group,AC_AWS_0235
aws_security_group,AC_AWS_0236
aws_security_group,AC_AWS_0237
aws_security_group,AC_AWS_0238
aws_security_group,AC_AWS_0239
aws_security_group,AC_AWS_0240
aws_security_group,AC_AWS_0241
aws_security_group,AC_AWS_0242
aws_security_group,AC_AWS_0243
aws_security_group,AC_AWS_0244
aws_security_group,AC_AWS_0245
aws_security_group,AC_AWS_0246
aws_security_group,AC_AWS_0247
aws_security_group,AC_AWS_0248
aws_security_group,AC_AWS_0249
aws_security_group,AC_AWS_0250
aws_security_group,AC_AWS_0251
aws_security_group,AC_AWS_0252
aws_security_group,AC_AWS_0253
aws_security_group,AC_AWS_0254
aws_security_group,AC_AWS_0255
aws_security_group,AC_AWS_0256
aws_security_group,AC_AWS_0257
aws_security_group,AC_AWS_0258
aws_security_group,AC_AWS_0259
aws_security_group,AC_AWS_0260
aws_security_group,AC_AWS_0261
aws_security_group,AC_AWS_0262
aws_security_group,AC_AWS_0263
aws_security_group,AC_AWS_0264
aws_security_group,AC_AWS_0265
aws_security_group,AC_AWS_0266
aws_security_group,AC_AWS_0267
aws_security_group,AC_AWS_0268
aws_security_group,AC_AWS_0269
aws_security_group,AC_AWS_0270
aws_security_group,AC_AWS_0271
aws_security_group,AC_AWS_0272
aws_security_group,AC_AWS_0273
aws_security_group,AC_AWS_0274
aws_security_group,AC_AWS_0275
aws_security_group,AC_AWS_0276
aws_security_group,AC_AWS_0277
aws_security_group,AC_AWS_0278
aws_security_group,AC_AWS_0279
aws_security_group,AC_AWS_0280
aws_security_group,AC_AWS_0281
aws_security_group,AC_AWS_0282
aws_security_group,AC_AWS_0283
aws_security_group,AC_AWS_0284
aws_security_group,AC_AWS_0285
aws_security_group,AC_AWS_0286
aws_security_group,AC_AWS_0287
aws_security_group,AC_AWS_0288
aws_security_group,AC_AWS_0289
aws_security_group,AC_AWS_0290
aws_security_group,AC_AWS_0291
aws_security_group,AC_AWS_0292
aws_security_group,AC_AWS_0293
aws_security_group,AC_AWS_0294
aws_security_group,AC_AWS_0295
aws_security_group,AC_AWS_0296
aws_security_group,AC_AWS_0297
aws_security_group,AC_AWS_0298
aws_security_group,AC_AWS_0299
aws_security_group,AC_AWS_0300
aws_security_group,AC_AWS_0301
aws_security_group,AC_AWS_0302
aws_security_group,AC_AWS_0303
aws_security_group,AC_AWS_0304
aws_security_group,AC_AWS_0305
aws_security_group,AC_AWS_0306
aws_security_group,AC_AWS_0307
aws_security_group,AC_AWS_0308
aws_security_group,AC_AWS_0309
aws_security_group,AC_AWS_0310
aws_security_group,AC_AWS_0311
aws_security_group,AC_AWS_0312
aws_security_group,AC_AWS_0313
aws_security_group,AC_AWS_0314
aws_security_group,AC_AWS_0315
aws_security_group,AC_AWS_0316
aws_security_group,AC_AWS_0317
aws_security_group,AC_AWS_0318
aws_security_group,AC_AWS_0319
aws_security_group,AC_AWS_0320
aws_security_group,AC_AWS_0321
aws_security_group,AC_AWS_0322
aws_security_group,AC_AWS_0323
aws_security_group,AC_AWS_0324
aws_security_group,AC_AWS_0325
aws_security_group,AC_AWS_0326
aws_security_group,AC_AWS_0327
aws_security_group,AC_AWS_0328
aws_security_group,AC_AWS_0329
aws_security_group,AC_AWS_0330
aws_security_group,AC_AWS_0331
aws_security_group,AC_AWS_0332
aws_security_group,AC_AWS_0333
aws_security_group,AC_AWS_0334
aws_security_group,AC_AWS_0335
aws_security_group,AC_AWS_0336
aws_security_group,AC_AWS_0337
aws_security_group,AC_AWS_0338
aws_security_group,AC_AWS_0339
aws_security_group,AC_AWS_0340
aws_security_group,AC_AWS_0341
aws_security_group,AC_AWS_0342
aws_security_group,AC_AWS_0343
aws_security_group,AC_AWS_0344
aws_security_group,AC_AWS_0345
aws_security_group,AC_AWS_0346
aws_security_group,AC_AWS_0347
aws_security_group,AC_AWS_0348
aws_security_group,AC_AWS_0349
aws_security_group,AC_AWS_0350
aws_security_group,AC_AWS_0351
aws_security_group,AC_AWS_0352
aws_security_group,AC_AWS_0353
aws_security_group,AC_AWS_0354
aws_security_group,AC_AWS_0355
aws_security_group,AC_AWS_0356
aws_security_group,AC_AWS_0357
aws_security_group,AC_AWS_0358
aws_security_group,AC_AWS_0359
aws_security_group,AC_AWS_0360
aws_security_group,AC_AWS_0361
aws_security_group,AC_AWS_0362
aws_security_group,AC_AWS_0363
aws_sns_topic,AWS.AST.DP.MEDIUM.0037
aws_sns_topic,AWS.SNS.NS.Medium.1044
aws_sqs_queue,AWS.SQS.NetworkSecurity.High.0569
aws_sqs_queue,AWS.SQS.NetworkSecurity.High.0570
aws_vpc,AWS.VPC.Logging.Medium.0470
aws_vpc,AWS.VPC.Logging.Medium.0471
aws_workspaces_workspace,AWS.AWW.DP.MEDIUM.040
aws_workspaces_workspace,AWS.AWW.DP.MEDIUM.041
