{
  "AWSEBDockerrunVersion": 2,
  "volumes": [
    {
      "name": "logs",
      "host": {
        "sourcePath": "/var/app/current/logs/pine-app-core-logs"
      }
    }
  ],
  "containerDefinitions": [
    {
      "name": "pine-app-core",
      "image": "registry.gitlab.com/the-pineapple-incident/services/app-core:latest",
      "essential": true,
      "memory": 512,
      "portMappings": [
        {
          "hostPort": 80,
          "containerPort": 3000
        }
      ],
      "mountPoints": [
        {
          "sourceVolume": "logs",
          "containerPath": "/app/logs"
        }
      ]
    }
  ]
}
