[{"idSentenciaPenal": "sentencia_penal_32", "idPersona": "ID-23901989", "expedientePenal": null, "fechaSentenciaPenal": null, "organoJudicialPenal": "3ER JUZGADO DE INVESTIGACION PREPARATORIA", "delitoPenal": "DIFAMACION", "falloPenal": "UN AÑO CON RESERVA DE FALLO", "modalidad": "RESERVA DE FALLO"},
{"idSentenciaPenal": "sentencia_penal_40", "idPersona": "ID-23017616", "expedientePenal": null, "fechaSentenciaPenal": null, "organoJudicialPenal": "4TO JUZGADO PENAL UNIPERSONAL -SEDE CENTRAL", "delitoPenal": "INCUMPLIMIENTO DE DEBERES FUNCIONALES", "falloPenal": "FALLO", "modalidad": "RESERVA DE FALLO"},
{"idSentenciaPenal": "sentencia_penal_142", "idPersona": "ID-25827856", "expedientePenal": null, "fechaSentenciaPenal": null, "organoJudicialPenal": "22 JUZGADO PENAL DE LIMA", "delitoPenal": "FALSEDAD", "falloPenal": "DOS AÑOS SUSPENDIDA", "modalidad": "SUSPENDIDA"},
{"idSentenciaPenal": "sentencia_penal_143", "idPersona": "ID-25827856", "expedientePenal": null, "fechaSentenciaPenal": null, "organoJudicialPenal": "OCTAVO JUZGADO DEL CALLAO", "delitoPenal": "CONTRA EL HONOR - DIFAMACION", "falloPenal": "RESERVA DEL FALLO 1 AÑO", "modalidad": "RESERVA DE FALLO"},
{"idSentenciaPenal": "sentencia_penal_171", "idPersona": "ID-42592969", "expedientePenal": null, "fechaSentenciaPenal": null, "organoJudicialPenal": "PRIMER JUZGADO UNIPERSONAL DE PAUCARPATA", "delitoPenal": "QUERELLA", "falloPenal": "REGLAS DE CONDUCTA Y MULTA", "modalidad": "RESERVA DE FALLO"},
{"idSentenciaPenal": "sentencia_penal_193", "idPersona": "ID-22462358", "expedientePenal": null, "fechaSentenciaPenal": null, "organoJudicialPenal": "TERCER JUZGADO PENAL HUANUCO", "delitoPenal": "CONTRA LA PAZ PUBLICA", "falloPenal": "FALLO RESERVANDO FALLO CONDENATORIO", "modalidad": "RESERVA DE FALLO"},
{"idSentenciaPenal": "sentencia_penal_253", "idPersona": "ID-15282252", "expedientePenal": null, "fechaSentenciaPenal": null, "organoJudicialPenal": "2 JUZGADO PENAL LIMA", "delitoPenal": "USURPACIÓN DE FUNCIONES", "falloPenal": "4 AÑOS CON LIBERTAD CONDICIONAL", "modalidad": "SUSPENDIDA"},
{"idSentenciaPenal": "sentencia_penal_281", "idPersona": "ID-00515099", "expedientePenal": null, "fechaSentenciaPenal": null, "organoJudicialPenal": "31 JUZGADO PENAL DE LIMA", "delitoPenal": "REBELION, SECUESTRO, SUSTRACCION", "falloPenal": "15 AÑOS", "modalidad": "EFECTIVA"},
{"idSentenciaPenal": "sentencia_penal_322", "idPersona": "ID-26689382", "expedientePenal": null, "fechaSentenciaPenal": null, "organoJudicialPenal": "JUZGADO PENAL DE CAJAMARCA", "delitoPenal": "OMISIÓN FAMILIAR", "falloPenal": "CONDENATORIA", "modalidad": "RESERVA DE FALLO"},
{"idSentenciaPenal": "sentencia_penal_345", "idPersona": "ID-07472882", "expedientePenal": null, "fechaSentenciaPenal": null, "organoJudicialPenal": "SEXTA SALA PENAL", "delitoPenal": "CONTRA EL PATRIMONIO", "falloPenal": "ABSUELTO", "modalidad": "ABSUELTO"},
{"idSentenciaPenal": "sentencia_penal_395", "idPersona": "ID-40861628", "expedientePenal": null, "fechaSentenciaPenal": null, "organoJudicialPenal": "JUZGADO PENAL DE LIMA", "delitoPenal": "DAÑO SIMPLE", "falloPenal": "2 AÑOS", "modalidad": "SUSPENDIDA"},
{"idSentenciaPenal": "sentencia_penal_396", "idPersona": "ID-44144875", "expedientePenal": null, "fechaSentenciaPenal": null, "organoJudicialPenal": "21 JUZGADO PENAL", "delitoPenal": "FALSIFICACIÓN DE DOCUMENTOS", "falloPenal": "3 AÑOS PENA PRIVATIVA LIBERTAD", "modalidad": "SUSPENDIDA"},
{"idSentenciaPenal": "sentencia_penal_408", "idPersona": "ID-10172924", "expedientePenal": null, "fechaSentenciaPenal": null, "organoJudicialPenal": "SEGUNDA FISCALIA PROVINCIAL DE OXAPAMPA", "delitoPenal": "ABUSO DE AUTORIDAD", "falloPenal": "SUSPENDIDA", "modalidad": "SUSPENDIDA"},
{"idSentenciaPenal": "sentencia_penal_468", "idPersona": "ID-28219445", "expedientePenal": null, "fechaSentenciaPenal": null, "organoJudicialPenal": "AYACUCHO", "delitoPenal": "LESIONES", "falloPenal": "PENA", "modalidad": "SUSPENDIDA"},
{"idSentenciaPenal": "sentencia_penal_549", "idPersona": "ID-42628319", "expedientePenal": null, "fechaSentenciaPenal": null, "organoJudicialPenal": "CUARTO JUZGADO PENAL LIQUIDADOR DE MAYNAS", "delitoPenal": "FALSIFICACION DE OCUMENTOS", "falloPenal": "03 AÑOS DE PENA PRIVATIVA DE LA LIBERTAD", "modalidad": "SUSPENDIDA"},
{"idSentenciaPenal": "sentencia_penal_550", "idPersona": "ID-42628319", "expedientePenal": null, "fechaSentenciaPenal": null, "organoJudicialPenal": "SEGUNDO JUZGADO DE INVESTIGACION PREPARATORIA DE MAYNAS", "delitoPenal": "FALSEDAD IDEOLOGICA", "falloPenal": "02 AÑOS DE PENA PRIVATIVA DE LA LIBERTAD", "modalidad": "SUSPENDIDA"},
{"idSentenciaPenal": "sentencia_penal_565", "idPersona": "ID-03676453", "expedientePenal": null, "fechaSentenciaPenal": null, "organoJudicialPenal": "PRIMER JUZGADO UNIPERSONAL DE SULLANA", "delitoPenal": "QUERELLA", "falloPenal": "2 AÑOS PENA SUSPENDIDA", "modalidad": "SUSPENDIDA"},
{"idSentenciaPenal": "sentencia_penal_566", "idPersona": "ID-03676453", "expedientePenal": null, "fechaSentenciaPenal": null, "organoJudicialPenal": "JUZGADO PENAL LIQUIDADOR TRANSITORIO - SEDE CENTRAL", "delitoPenal": "COMERCIALIZACION O TRAFICO DE PRODUCTOS", "falloPenal": "EXTINGUIDA LA ACCION PENAL POR PRESCRIPCION EXTRAORDINARIA", "modalidad": "PRESCRIPCION  EXTRAORDINARIA"},
{"idSentenciaPenal": "sentencia_penal_602", "idPersona": "ID-32408084", "expedientePenal": null, "fechaSentenciaPenal": null, "organoJudicialPenal": "JUZGADO PENAL DE CARAZ", "delitoPenal": "DIFAMACIÓN", "falloPenal": "UN AÑO DE PENA PRIVATIVA DE LIBERTAD", "modalidad": "SUSPENDIDA"},
{"idSentenciaPenal": "sentencia_penal_603", "idPersona": "ID-32408084", "expedientePenal": null, "fechaSentenciaPenal": null, "organoJudicialPenal": "JUZGADO PENAL DE CARAZ", "delitoPenal": "DIFAMACIÓN", "falloPenal": "UN AÑO DE PENA PRIVATIVA DE LIBERTAD", "modalidad": "SUSPENDIDA"},
{"idSentenciaPenal": "sentencia_penal_698", "idPersona": "ID-16683565", "expedientePenal": null, "fechaSentenciaPenal": null, "organoJudicialPenal": "JUZGADO MIXTO UNIPERSONAL DE CODORCANQUI", "delitoPenal": "DAÑO EN FORMA AGRAVADA", "falloPenal": "4 AÑOS DE PENA PRIVATIVA DE LA LIBERTAD SUSPENDIDA EN SU EJECUCIÓN", "modalidad": "SUSPENDIDA"},
{"idSentenciaPenal": "sentencia_penal_699", "idPersona": "ID-16683565", "expedientePenal": null, "fechaSentenciaPenal": null, "organoJudicialPenal": "JUZGADO PENAL DE INVESTIGACIÓN PREPARATORIA DE CONDORCANQUI", "delitoPenal": "USURPACIÓN DE FUNCIONES", "falloPenal": "2 AÑOS Y 7 MESES DE PENA PRIVATIVA DE LA LIBERTAD SUSPENDIDA EN SU EJECUCIÓN CON PERIODO DE PRUEBA DE 2 AÑOS", "modalidad": "SUSPENDIDA"},
{"idSentenciaPenal": "sentencia_penal_820", "idPersona": "ID-21543982", "expedientePenal": null, "fechaSentenciaPenal": null, "organoJudicialPenal": "JUZGADO UNIPERSONAL DE YARINACOCHA", "delitoPenal": "USURPACIÓN AGRAVADA PENA SUSPENDIDA", "falloPenal": "SUSPENDIDA", "modalidad": "SUSPENDIDA"},
{"idSentenciaPenal": "sentencia_penal_850", "idPersona": "ID-10765508", "expedientePenal": null, "fechaSentenciaPenal": null, "organoJudicialPenal": "4TO JUZGADO PENAL DE AYACUCHO", "delitoPenal": "OMISION DE ALIMENTOS", "falloPenal": "EFECTIVA 3 AÑOS CONVERTIDA A SERVICIOS COMUNITARIOS", "modalidad": "EFECTIVA3 AÑOS CONVERTIDA A SERVICIOS COMUNITA"},
{"idSentenciaPenal": "sentencia_penal_871", "idPersona": "ID-21465470", "expedientePenal": null, "fechaSentenciaPenal": null, "organoJudicialPenal": "SALA NACIONAL SUPERIOR", "delitoPenal": "DEFRAUDACION TRIBUTARIA", "falloPenal": "CUATRO AÑOS DE PENA SUSPENDIDA CONDICIONAL", "modalidad": "SUSPENDIDA"},
{"idSentenciaPenal": "sentencia_penal_872", "idPersona": "ID-21465470", "expedientePenal": null, "fechaSentenciaPenal": null, "organoJudicialPenal": "3 JUZGADO DE INVESTIGACION PREPARATORIA", "delitoPenal": "ESTAFA GENERICA", "falloPenal": "PAGO DE DEVOLUCION DE DINERO", "modalidad": "SUSPENDIDA"},
{"idSentenciaPenal": "sentencia_penal_877", "idPersona": "ID-44058502", "expedientePenal": null, "fechaSentenciaPenal": null, "organoJudicialPenal": "AYACUCHO", "delitoPenal": "USURPACION", "falloPenal": "2 AÑOS 6 MESES", "modalidad": "SUSPENDIDA"},
{"idSentenciaPenal": "sentencia_penal_942", "idPersona": "ID-43412864", "expedientePenal": null, "fechaSentenciaPenal": null, "organoJudicialPenal": "2° JUZGADO DE INVESTIGACION PREPARATORIA DE CASTILLA", "delitoPenal": "LESIONES LEVES / LESIONES LEVES VF", "falloPenal": "CRITERIO DE OPORTUNIDAD", "modalidad": "ARCHIVO DEFINITIVO - INVESTIGACION PREPARATORIA"},
{"idSentenciaPenal": "sentencia_penal_943", "idPersona": "ID-43412864", "expedientePenal": null, "fechaSentenciaPenal": null, "organoJudicialPenal": "2° JUZGADO DE INVESTIGACION PREPARATORIA DE CASTILLA", "delitoPenal": "LESIONES LEVES / LESIONES LEVES VF", "falloPenal": "CRITERIO DE OPORTUNIDAD", "modalidad": "ARCHIVO DEFINITIVO: INTERVENCION DE COMUNICACIONES"},
{"idSentenciaPenal": "sentencia_penal_944", "idPersona": "ID-43412864", "expedientePenal": null, "fechaSentenciaPenal": null, "organoJudicialPenal": "2° JUZGADO INVESTIGACION PREPARATORIA DE CASTILLA", "delitoPenal": "LESIONES LEVES / LESIONES", "falloPenal": "CRITERIO DE OPORTUNIDAD", "modalidad": "ARCHIVO DEFINITIVO: ACUSACION FISCAL"},
{"idSentenciaPenal": "sentencia_penal_964", "idPersona": "ID-09566510", "expedientePenal": null, "fechaSentenciaPenal": null, "organoJudicialPenal": "SALA PENAL \"C\" CORTE SUPREMA", "delitoPenal": "CONTRA ADMINISTRACION PUBLICA Y FE PUBLICA", "falloPenal": "2 AÑOS PENA PRIVATIVA SUSPENDIDA", "modalidad": "SUSPENDIDA"},
{"idSentenciaPenal": "sentencia_penal_982", "idPersona": "ID-31679159", "expedientePenal": null, "fechaSentenciaPenal": null, "organoJudicialPenal": "PRIMER JUZGADO PENAL DE INVESTIGACIÓN PREPARATORIA HUARAZ", "delitoPenal": "DIFAMACIÓN", "falloPenal": "SUSPENDIDA", "modalidad": "SUSPENDIDA"},
{"idSentenciaPenal": "sentencia_penal_987", "idPersona": "ID-29390992", "expedientePenal": null, "fechaSentenciaPenal": null, "organoJudicialPenal": "5TO JUZGADO PENAL UNIVERSAL", "delitoPenal": "LESIONES LEVES POR VIOLENCIA FAMILIAR", "falloPenal": "SENTENCIA CONFORMADA", "modalidad": "RESERVA DE FALLO"},
{"idSentenciaPenal": "sentencia_penal_1004", "idPersona": "ID-42024386", "expedientePenal": null, "fechaSentenciaPenal": null, "organoJudicialPenal": "JUSGADO MIXTO - CHUMBIVILCAS", "delitoPenal": "PECULADO SIMPLE", "falloPenal": "DOS AÑOS", "modalidad": "SUSPENDIDA"},
{"idSentenciaPenal": "sentencia_penal_1020", "idPersona": "ID-19226507", "expedientePenal": null, "fechaSentenciaPenal": null, "organoJudicialPenal": "JUZGADO PENAL LIQUIDADOR DE CHEPEN", "delitoPenal": "DAÑOS GRAVADOS", "falloPenal": "DOS AÑOS DE PENA PRIVATIVA DE LIBERTAD", "modalidad": "SUSPENDIDA"},
{"idSentenciaPenal": "sentencia_penal_1021", "idPersona": "ID-19226507", "expedientePenal": null, "fechaSentenciaPenal": null, "organoJudicialPenal": "PRIMER JUZGADO PENAL UNIPERSONAL DE CHEPEN", "delitoPenal": "DIFAMACIÓN AGRAVADA", "falloPenal": "UN AÑO  DE PENA PRIVATIVA DE LIBERTAD", "modalidad": "RESERVA DE FALLO"},
{"idSentenciaPenal": "sentencia_penal_1022", "idPersona": "ID-19226507", "expedientePenal": null, "fechaSentenciaPenal": null, "organoJudicialPenal": "TERCERA SALA PENAL  DE TRUJILLO", "delitoPenal": "DELITO DE DIFAMACIÓN AGRAVADA", "falloPenal": "MODIFICA SENTENCIA DE PRIMERA INSTANCIA DE EXPEDIENTE 580-2015", "modalidad": "SUSPENDIDA"},
{"idSentenciaPenal": "sentencia_penal_1023", "idPersona": "ID-19226507", "expedientePenal": null, "fechaSentenciaPenal": null, "organoJudicialPenal": "TERCERA SALA PENAL DE CHACHAPOYAS", "delitoPenal": "HABEAS CORPUS SENTENCIA POR DELITO DE DIFAMACIÓN AGRAVADA EN SEGUNDA INSTANCIA", "falloPenal": "NULIDAD DE SENTENCIA DEL EXPEDIENTE 231-206 (SEGUNDA INSTANCIA DEL EXPEDIENTE 58-2015)", "modalidad": "NULIDAD DE SETENCIA"},
{"idSentenciaPenal": "sentencia_penal_1025", "idPersona": "ID-17976278", "expedientePenal": null, "fechaSentenciaPenal": null, "organoJudicialPenal": "4° JP UNIPERSONAL DE TRUJILLO", "delitoPenal": "INCUMPLIMIENTO DE OBLIGACION ALIMENTARIA", "falloPenal": "2 AÑOS PPL CONDICIONAL", "modalidad": "SUSPENDIDA"},
{"idSentenciaPenal": "sentencia_penal_1085", "idPersona": "ID-25638183", "expedientePenal": null, "fechaSentenciaPenal": null, "organoJudicialPenal": "2 JUZGADO DE PAZ LETRADO (LURIGANCHO CHOSICA CHACLACALLO)", "delitoPenal": "FALTAS CONTRA LA PERSONA - LESIONES DOLOSAS", "falloPenal": "RESERVA DEL FALLO CONDENATORIO", "modalidad": "RESERVA DE FALLO"},
{"idSentenciaPenal": "sentencia_penal_1091", "idPersona": "ID-06191599", "expedientePenal": null, "fechaSentenciaPenal": null, "organoJudicialPenal": "CORTE SUPREMA DE JUSTICIA", "delitoPenal": "TERRORISMO", "falloPenal": "ABSOLUCION", "modalidad": "FUE ABSUELTO"},
{"idSentenciaPenal": "sentencia_penal_1136", "idPersona": "ID-18129921", "expedientePenal": null, "fechaSentenciaPenal": null, "organoJudicialPenal": "QUINTO JUZGADO UNIPERSONAL - CAJAMARCA", "delitoPenal": "DESOBEDIENCIA A LA AUTORIDAD", "falloPenal": "UN AÑO DE PENA PRIVATIVA DE LA LIBERTAD", "modalidad": "SUSPENDIDA"},
{"idSentenciaPenal": "sentencia_penal_1144", "idPersona": "ID-16616433", "expedientePenal": null, "fechaSentenciaPenal": null, "organoJudicialPenal": "CORTE SUPERIOR DE JUSTICIA DE LAMBAYEQUE", "delitoPenal": "LESIONES", "falloPenal": "RESERVA DE FALLO", "modalidad": "RESERVA DE FALLO"},
{"idSentenciaPenal": "sentencia_penal_1145", "idPersona": "ID-16616433", "expedientePenal": null, "fechaSentenciaPenal": null, "organoJudicialPenal": "CORTE SUPERIOR DE JUSTICIA DE LAMBAYEQUE", "delitoPenal": "ESTAFA", "falloPenal": "SUSPENDIDA", "modalidad": "SUSPENDIDA"},
{"idSentenciaPenal": "sentencia_penal_1172", "idPersona": "ID-09698287", "expedientePenal": null, "fechaSentenciaPenal": null, "organoJudicialPenal": "7 JUZGADO DE PAZ LETRADO DE SAN JUAN DE LURIGANCHO -CSJ LIMA ESTE", "delitoPenal": "FALTAS CONTRA LA PERSONA - LESIONES", "falloPenal": "CONDENA COMO AUTORA DE FALTAS CONTRA LA PERSONA LESIONES", "modalidad": "SUSPENDIDA"},
{"idSentenciaPenal": "sentencia_penal_1173", "idPersona": "ID-09698287", "expedientePenal": null, "fechaSentenciaPenal": null, "organoJudicialPenal": "2 JUZGADO PENAL CSJ LIMA ESTE", "delitoPenal": "QUERELLA", "falloPenal": "PRESCRIPCION", "modalidad": "PRESCRIPCION"},
{"idSentenciaPenal": "sentencia_penal_1196", "idPersona": "ID-02643304", "expedientePenal": null, "fechaSentenciaPenal": null, "organoJudicialPenal": "006 JUZGADO PENAL DE PIURA", "delitoPenal": "DAÑO SIMPLE ART. 205 PELIGRO POR MEDIO DE INCENDIO O EXPLOSION ART.273", "falloPenal": "PRIV.LIB.CONDICIONAL", "modalidad": "SUSPENDIDA"},
{"idSentenciaPenal": "sentencia_penal_1215", "idPersona": "ID-40487273", "expedientePenal": null, "fechaSentenciaPenal": null, "organoJudicialPenal": "OCTAVO JUZGADO PENAL DE LIMA", "delitoPenal": "LESIONES CULPOSAS POR CHOQUE", "falloPenal": "PENA DE 2 AÑOS SUSPENDIDA", "modalidad": "SUSPENDIDA"},
{"idSentenciaPenal": "sentencia_penal_1234", "idPersona": "ID-32817479", "expedientePenal": null, "fechaSentenciaPenal": null, "organoJudicialPenal": "SALA PENAL CORTE SUPERIOR DE JUSTICIA DE ANCASH", "delitoPenal": "ESTAFA GENERICA", "falloPenal": "6 MESES", "modalidad": "SUSPENDIDA"},
{"idSentenciaPenal": "sentencia_penal_1248", "idPersona": "ID-26692761", "expedientePenal": null, "fechaSentenciaPenal": null, "organoJudicialPenal": "1° JUZGADO PENAL", "delitoPenal": "DIFAMACION AGRAVADA", "falloPenal": "UN AÑO DE PENA PRIVATIVA DE LA LIBERTAD", "modalidad": "SUSPENDIDA"},
{"idSentenciaPenal": "sentencia_penal_1276", "idPersona": "ID-10728197", "expedientePenal": null, "fechaSentenciaPenal": null, "organoJudicialPenal": "6° JUZGADO PENAL DE LIMA", "delitoPenal": "INTIMIDACION O VIOLENCIA CONTRA AUTORIDAD", "falloPenal": "PENA PRIVATIVA DE LA LIBERTAD SUSPENDIDA", "modalidad": "SUSPENDIDA"},
{"idSentenciaPenal": "sentencia_penal_1277", "idPersona": "ID-10728197", "expedientePenal": null, "fechaSentenciaPenal": null, "organoJudicialPenal": "1° JUZGADO PENAL DE LIMA", "delitoPenal": "OMISION A LA ASISTENCIA  FAMILIAR", "falloPenal": "PENA PRIVATIVA DE LA LIBERTA SUSPENDIDA", "modalidad": "SUSPENDIDA"},
{"idSentenciaPenal": "sentencia_penal_1310", "idPersona": "ID-25456272", "expedientePenal": null, "fechaSentenciaPenal": null, "organoJudicialPenal": "10 JUZGADO PENAL", "delitoPenal": "OMISION DE ASISTENCIA FAMILIAR", "falloPenal": "COMPARECENCIA  (PRIVATIVA DE LIBERTAD)", "modalidad": "SUSPENDIDA"},
{"idSentenciaPenal": "sentencia_penal_1482", "idPersona": "ID-25568515", "expedientePenal": null, "fechaSentenciaPenal": null, "organoJudicialPenal": "028-JUZGADO PENAL DE LIMA", "delitoPenal": "RECEPTACIÓN", "falloPenal": "PRESCRITA", "modalidad": "MULTA"},
{"idSentenciaPenal": "sentencia_penal_1492", "idPersona": "ID-16655831", "expedientePenal": null, "fechaSentenciaPenal": null, "organoJudicialPenal": "PRIMER JUZGADO PENAL DE UTCUBAMBA", "delitoPenal": "EJERCICIO ARBITRARIO DEL DERECHO POR PROPIA MANO", "falloPenal": "VEINTE JORNADAS DE PRESTACIÓN DE SERVICO COMUNITARIO", "modalidad": "PRESTACIÓN DE SERVICIO A LA COMUNIDAD"},
{"idSentenciaPenal": "sentencia_penal_1498", "idPersona": "ID-32264866", "expedientePenal": null, "fechaSentenciaPenal": null, "organoJudicialPenal": "SALA PENAL DE HUARAZ", "delitoPenal": "PECULADO", "falloPenal": "1 AÑO", "modalidad": "SUSPENDIDA"},
{"idSentenciaPenal": "sentencia_penal_1553", "idPersona": "ID-27280356", "expedientePenal": null, "fechaSentenciaPenal": null, "organoJudicialPenal": "SEGUNDO JUZGADO PENAL DE CHICLAYO", "delitoPenal": "ENTORPECIMIENTO AL FUNCIONAMIENTO DE SERVICIOS PÚBLICOS", "falloPenal": "4 AÑOS", "modalidad": "SUSPENDIDA"},
{"idSentenciaPenal": "sentencia_penal_1561", "idPersona": "ID-19920466", "expedientePenal": null, "fechaSentenciaPenal": null, "organoJudicialPenal": "21 JUZGADO PENAL DE LIMA", "delitoPenal": "CONTRA LA FE PUBLICA", "falloPenal": "3 AÑOS", "modalidad": "SUSPENDIDA"},
{"idSentenciaPenal": "sentencia_penal_1586", "idPersona": "ID-09065324", "expedientePenal": null, "fechaSentenciaPenal": null, "organoJudicialPenal": "SEGUNDO JUZGADO E. PENAL LIMA ESTE", "delitoPenal": "CONTRA EL PATRIMONIO - USURPACION", "falloPenal": "3 AÑOS", "modalidad": "SUSPENDIDA"},
{"idSentenciaPenal": "sentencia_penal_1587", "idPersona": "ID-09065324", "expedientePenal": null, "fechaSentenciaPenal": null, "organoJudicialPenal": "PRIMER JUZGADO PENAL LIMA ESTE", "delitoPenal": "CONTRA EL PATRIMONIO - USURPACIÓN", "falloPenal": "FALLO", "modalidad": "SOBRESEIMIENTO"},
{"idSentenciaPenal": "sentencia_penal_1626", "idPersona": "ID-07817028", "expedientePenal": null, "fechaSentenciaPenal": null, "organoJudicialPenal": "11° JUZGADO PENAL DEL CALLAO (17-1789 NUMERO ANTIGUO)", "delitoPenal": "QUERELLA POR DIFAMACION", "falloPenal": "REHABILITADO", "modalidad": "REHABILITADO"},
{"idSentenciaPenal": "sentencia_penal_1805", "idPersona": "ID-43863835", "expedientePenal": null, "fechaSentenciaPenal": null, "organoJudicialPenal": "17° JUZGADO PENAL", "delitoPenal": "DIFAMACIÓN AGRAVADA", "falloPenal": "1 AÑO DE PENA PRIVATIVA DE LIBERTAD Y EL PAGO A UNA REPARACIÓN CIVIL", "modalidad": "SUSPENDIDA"},
{"idSentenciaPenal": "sentencia_penal_1942", "idPersona": "ID-16721631", "expedientePenal": null, "fechaSentenciaPenal": null, "organoJudicialPenal": "SEGUNDO JUZGADO ESPECIALIZADO PENAL DE CHICLAYO", "delitoPenal": "INJURIA", "falloPenal": "PERÍODO DE PRUEBA DE UN AÑO", "modalidad": "RESERVA DE FALLO"},
{"idSentenciaPenal": "sentencia_penal_1989", "idPersona": "ID-04625296", "expedientePenal": null, "fechaSentenciaPenal": null, "organoJudicialPenal": "SEGUNDO JUZGADO PENAL DE CUSCO", "delitoPenal": "ESTAFA", "falloPenal": "4 AÑOS", "modalidad": "SUSPENDIDA"},
{"idSentenciaPenal": "sentencia_penal_1995", "idPersona": "ID-04204588", "expedientePenal": null, "fechaSentenciaPenal": null, "organoJudicialPenal": "PRIMER JUZGADO PENAL DE PASCO", "delitoPenal": "LESIONES LEVES POR VIOLENCIA FAMILIAR", "falloPenal": "JORNADA DE PRESTACION DE SERVICIOS COMUNITARIOS", "modalidad": "144 JORNADAS DE PRESTACION DE SERVICIOS COMUNITARI"},
{"idSentenciaPenal": "sentencia_penal_2038", "idPersona": "ID-32303412", "expedientePenal": null, "fechaSentenciaPenal": null, "organoJudicialPenal": "JUZGADO PENAL DE HUARI", "delitoPenal": "HURTO AGRAVADO", "falloPenal": "4 AÑOS DE PENA PRIVATIVA DE LIBERTAD", "modalidad": "EFECTIVA"},
{"idSentenciaPenal": "sentencia_penal_2045", "idPersona": "ID-29384343", "expedientePenal": null, "fechaSentenciaPenal": null, "organoJudicialPenal": "SEGUNDO JUZGADO PENAL UNIPERSONAL", "delitoPenal": "PELIGRO COMÚN", "falloPenal": "RESERVA DE FALLO 1 AÑO", "modalidad": "RESERVA DE FALLO"},
{"idSentenciaPenal": "sentencia_penal_2046", "idPersona": "ID-29384343", "expedientePenal": null, "fechaSentenciaPenal": null, "organoJudicialPenal": "SEGUNDO JUZGADO UNIPERSONAL", "delitoPenal": "NOMBRAMIENTO ILEGAL DE CARGO", "falloPenal": "PENA 77 DÍAS MULTA", "modalidad": "PENA 77 DIAS MULTA"},
{"idSentenciaPenal": "sentencia_penal_2057", "idPersona": "ID-40915371", "expedientePenal": null, "fechaSentenciaPenal": null, "organoJudicialPenal": "JUZGADO PROVINCIAL UNIPERSONAL - SAN IGNACIO", "delitoPenal": "OMISION A LA ASITENCIA FAMILIAR", "falloPenal": "DOS AÑOS DE PENA PRIVATIVA DE LA LIBERTAD SUSPENDIDA EN SU EJECUCION POR EL PERIODO DE UN AÑO", "modalidad": "SUSPENDIDA"},
{"idSentenciaPenal": "sentencia_penal_2080", "idPersona": "ID-19842728", "expedientePenal": null, "fechaSentenciaPenal": null, "organoJudicialPenal": "37 JUZGADO PENAL DE REOS LIBRES", "delitoPenal": "OMISION A LA ASISTENCIA FAMILIAR", "falloPenal": "1 AÑO REHABILITADO ARTICULO 69° DEL CODIGO PENAL", "modalidad": "SUSPENDIDA , ACTUALMENTE REHABILITADO 16/10/2019"},
{"idSentenciaPenal": "sentencia_penal_2112", "idPersona": "ID-29678923", "expedientePenal": null, "fechaSentenciaPenal": null, "organoJudicialPenal": "TERCER JUZGADO PENAL HUARAZ", "delitoPenal": "CONTRA LA CONFIANZA Y LA BUENA FE", "falloPenal": "UN AÑO", "modalidad": "SUSPENDIDA"},
{"idSentenciaPenal": "sentencia_penal_2212", "idPersona": "ID-15967007", "expedientePenal": null, "fechaSentenciaPenal": null, "organoJudicialPenal": "IV JUZGADO DE INVESTIGACION PREPARATORIA-ICA", "delitoPenal": "AVOCACION INDEBIDA DE PROCESOS EN TRAMITE", "falloPenal": "INHABILITACION POR UN AÑO", "modalidad": "SUSPENDIDA"},
{"idSentenciaPenal": "sentencia_penal_2213", "idPersona": "ID-25487752", "expedientePenal": null, "fechaSentenciaPenal": null, "organoJudicialPenal": "SEGUNDO JUZGADO PENAL HUANUCO", "delitoPenal": "CONTRA LA VOLUNTAD POPULAR", "falloPenal": "UN AÑO SUSPENDIDA", "modalidad": "SUSPENDIDA"},
{"idSentenciaPenal": "sentencia_penal_2216", "idPersona": "ID-21523361", "expedientePenal": null, "fechaSentenciaPenal": null, "organoJudicialPenal": "SEGUNDO JUSGADO DE PAZ LETRADO", "delitoPenal": "DAR SUMA DE DINERO", "falloPenal": "DAR SUMA DE DINERO", "modalidad": "DAR SUMA DE DINERO"},
{"idSentenciaPenal": "sentencia_penal_2217", "idPersona": "ID-09533745", "expedientePenal": null, "fechaSentenciaPenal": null, "organoJudicialPenal": "14 JUZGADO PENAL CONO NORTE", "delitoPenal": "OMISIÓN A LA ASISTENCIA FAMILIAR", "falloPenal": "1 AÑO", "modalidad": "EFECTIVA"},
{"idSentenciaPenal": "sentencia_penal_2246", "idPersona": "ID-07412350", "expedientePenal": null, "fechaSentenciaPenal": null, "organoJudicialPenal": "PODER JUDICIAL", "delitoPenal": "LIBRAMIENTO INDEBIDO", "falloPenal": "1 AÑO DE PENA PRIVATIVA DE LIBERTAD CONDICIONAL - REHABILITADO", "modalidad": "SUSPENDIDA"},
{"idSentenciaPenal": "sentencia_penal_2247", "idPersona": "ID-07412350", "expedientePenal": null, "fechaSentenciaPenal": null, "organoJudicialPenal": "PODER JUDICIAL", "delitoPenal": "LIBRAMIENTO INDEBIDO", "falloPenal": "2 AÑOS DE PENA PRIVATIVA DE LIBERTAD CONDICIONAL - REHABILITADO", "modalidad": "SUSPENDIDA"},
{"idSentenciaPenal": "sentencia_penal_2278", "idPersona": "ID-04047340", "expedientePenal": null, "fechaSentenciaPenal": null, "organoJudicialPenal": "TERCER JUZGADO PENAL", "delitoPenal": "OMISIÓN SIMPLE", "falloPenal": "7 AÑOS", "modalidad": "EFECTIVA"},
{"idSentenciaPenal": "sentencia_penal_2282", "idPersona": "ID-03888720", "expedientePenal": null, "fechaSentenciaPenal": null, "organoJudicialPenal": "PRIMER JUZGADO UNIPERSONAL DE TALARA", "delitoPenal": "DIFAMACION", "falloPenal": "1 AÑO", "modalidad": "SUSPENDIDA"},
{"idSentenciaPenal": "sentencia_penal_2284", "idPersona": "ID-03647401", "expedientePenal": null, "fechaSentenciaPenal": null, "organoJudicialPenal": "PRIMER JUZGADO UNIPERSONAL PENAL TUMBES", "delitoPenal": "OMISION ASISTENCIA FAMILIAR", "falloPenal": "RESERTVA", "modalidad": "RESERVA DE FALLO"},
{"idSentenciaPenal": "sentencia_penal_2290", "idPersona": "ID-01545223", "expedientePenal": null, "fechaSentenciaPenal": null, "organoJudicialPenal": "2DO JUZGADO PENAL UNIPERSONAL DE LA PROVINCIA DE SAN ROMAN", "delitoPenal": "RECEPTACION", "falloPenal": "3 AÑOS Y 6 MESES.", "modalidad": "SUSPENDIDA"},
{"idSentenciaPenal": "sentencia_penal_2291", "idPersona": "ID-29712019", "expedientePenal": null, "fechaSentenciaPenal": null, "organoJudicialPenal": "SALA PENAL DE REOS EN CARCEL DE LIMA", "delitoPenal": "SECUESTRO ART. 152 CODIGO PENAL", "falloPenal": "9 AÑOS", "modalidad": "EFECTIVA"},
{"idSentenciaPenal": "sentencia_penal_2292", "idPersona": "ID-29712019", "expedientePenal": null, "fechaSentenciaPenal": null, "organoJudicialPenal": "JUZGADO PENAL DE LA PROVINCIA DE LAMPA", "delitoPenal": "LESIONES LEVES", "falloPenal": "1 AÑO", "modalidad": "RESERVA DE FALLO"},
{"idSentenciaPenal": "sentencia_penal_2294", "idPersona": "ID-02367232", "expedientePenal": null, "fechaSentenciaPenal": null, "organoJudicialPenal": "JUZGADO LIQUIDADOR TRANSITORIO DE JULIACA", "delitoPenal": "RESISTENCIA A LA AUTORIDAD", "falloPenal": "4 AÑOS", "modalidad": "SUSPENDIDA"},
{"idSentenciaPenal": "sentencia_penal_2297", "idPersona": "ID-00974279", "expedientePenal": null, "fechaSentenciaPenal": null, "organoJudicialPenal": "JUZGADO UNIPERSONAL MARISCAL CACERES", "delitoPenal": "OMISION A LA ASISTENCIA FAMILIAR", "falloPenal": "FALLO: SUSPENDIDA", "modalidad": "RESERVA DE FALLO"},
{"idSentenciaPenal": "sentencia_penal_2301", "idPersona": "ID-80678856", "expedientePenal": null, "fechaSentenciaPenal": null, "organoJudicialPenal": "38 JUZGADO PENAL - LIMA", "delitoPenal": "REBELIÓN", "falloPenal": "9 AÑOS", "modalidad": "EFECTIVA"},
{"idSentenciaPenal": "sentencia_penal_2311", "idPersona": "ID-00078860", "expedientePenal": null, "fechaSentenciaPenal": null, "organoJudicialPenal": "PODER JUDICIAL DE UCAYALI", "delitoPenal": "ESTAFA", "falloPenal": "UNA AÑO", "modalidad": "SUSPENDIDA"},
{"idSentenciaPenal": "sentencia_penal_2330", "idPersona": "ID-29708571", "expedientePenal": null, "fechaSentenciaPenal": null, "organoJudicialPenal": "39 JUZGADO PENAL DE LIMA", "delitoPenal": "REBELION Y OTROS", "falloPenal": "15 AÑOS DE PENA PREVENTIVA", "modalidad": "EFECTIVA"}]
