{"idRenuncia": "renuncia_1", "idPersona": "ID-17903382", "idPartidoPolitico": "2843", "fechaRenuncia": 2016}
{"idRenuncia": "renuncia_2", "idPersona": "ID-17903382", "idPartidoPolitico": "2844", "fechaRenuncia": 2011}
{"idRenuncia": "renuncia_3", "idPersona": "ID-10308752", "idPartidoPolitico": "2845", "fechaRenuncia": 2016}
{"idRenuncia": "renuncia_4", "idPersona": "ID-10308752", "idPartidoPolitico": "2846", "fechaRenuncia": 2007}
{"idRenuncia": "renuncia_5", "idPersona": "ID-08194883", "idPartidoPolitico": "2844", "fechaRenuncia": 2011}
{"idRenuncia": "renuncia_6", "idPersona": "ID-08194883", "idPartidoPolitico": "2847", "fechaRenuncia": 2005}
{"idRenuncia": "renuncia_7", "idPersona": "ID-44951035", "idPartidoPolitico": "179", "fechaRenuncia": 2019}
{"idRenuncia": "renuncia_8", "idPersona": "ID-33433109", "idPartidoPolitico": "4", "fechaRenuncia": 2013}
{"idRenuncia": "renuncia_9", "idPersona": "ID-33588709", "idPartidoPolitico": "2849", "fechaRenuncia": 2007}
{"idRenuncia": "renuncia_10", "idPersona": "ID-32907853", "idPartidoPolitico": "14", "fechaRenuncia": 2014}
{"idRenuncia": "renuncia_11", "idPersona": "ID-31649145", "idPartidoPolitico": "2850", "fechaRenuncia": 2014}
{"idRenuncia": "renuncia_12", "idPersona": "ID-31171595", "idPartidoPolitico": "2852", "fechaRenuncia": 2015}
{"idRenuncia": "renuncia_13", "idPersona": "ID-41728966", "idPartidoPolitico": "2854", "fechaRenuncia": 2010}
{"idRenuncia": "renuncia_14", "idPersona": "ID-41728966", "idPartidoPolitico": "2853", "fechaRenuncia": 2015}
{"idRenuncia": "renuncia_15", "idPersona": "ID-29668031", "idPartidoPolitico": "2855", "fechaRenuncia": 2019}
{"idRenuncia": "renuncia_16", "idPersona": "ID-29542484", "idPartidoPolitico": "2845", "fechaRenuncia": 2015}
{"idRenuncia": "renuncia_17", "idPersona": "ID-42419177", "idPartidoPolitico": "2859", "fechaRenuncia": 2011}
{"idRenuncia": "renuncia_18", "idPersona": "ID-42050939", "idPartidoPolitico": "15", "fechaRenuncia": 2014}
{"idRenuncia": "renuncia_19", "idPersona": "ID-42487476", "idPartidoPolitico": "179", "fechaRenuncia": 2015}
{"idRenuncia": "renuncia_20", "idPersona": "ID-41135433", "idPartidoPolitico": "2867", "fechaRenuncia": 2020}
{"idRenuncia": "renuncia_21", "idPersona": "ID-45606049", "idPartidoPolitico": "2867", "fechaRenuncia": 2020}
{"idRenuncia": "renuncia_22", "idPersona": "ID-23017616", "idPartidoPolitico": "14", "fechaRenuncia": 2012}
{"idRenuncia": "renuncia_23", "idPersona": "ID-43037712", "idPartidoPolitico": "179", "fechaRenuncia": 2015}
{"idRenuncia": "renuncia_24", "idPersona": "ID-22410354", "idPartidoPolitico": "179", "fechaRenuncia": 2016}
{"idRenuncia": "renuncia_25", "idPersona": "ID-07763387", "idPartidoPolitico": "179", "fechaRenuncia": 2015}
{"idRenuncia": "renuncia_26", "idPersona": "ID-01034980", "idPartidoPolitico": "2843", "fechaRenuncia": 2016}
{"idRenuncia": "renuncia_27", "idPersona": "ID-18099367", "idPartidoPolitico": "1257", "fechaRenuncia": 2007}
{"idRenuncia": "renuncia_28", "idPersona": "ID-18032382", "idPartidoPolitico": "2873", "fechaRenuncia": 2010}
{"idRenuncia": "renuncia_29", "idPersona": "ID-19562625", "idPartidoPolitico": "1257", "fechaRenuncia": 2006}
{"idRenuncia": "renuncia_30", "idPersona": "ID-07827893", "idPartidoPolitico": "179", "fechaRenuncia": 2016}
{"idRenuncia": "renuncia_31", "idPersona": "ID-09739945", "idPartidoPolitico": "2842", "fechaRenuncia": 2015}
{"idRenuncia": "renuncia_32", "idPersona": "ID-06707373", "idPartidoPolitico": "2845", "fechaRenuncia": 2017}
{"idRenuncia": "renuncia_33", "idPersona": "ID-10600955", "idPartidoPolitico": "2842", "fechaRenuncia": 2017}
{"idRenuncia": "renuncia_34", "idPersona": "ID-10600955", "idPartidoPolitico": "14", "fechaRenuncia": 2014}
{"idRenuncia": "renuncia_35", "idPersona": "ID-43576154", "idPartidoPolitico": "2879", "fechaRenuncia": 2011}
{"idRenuncia": "renuncia_36", "idPersona": "ID-09861385", "idPartidoPolitico": "2842", "fechaRenuncia": 2017}
{"idRenuncia": "renuncia_37", "idPersona": "ID-06656244", "idPartidoPolitico": "2845", "fechaRenuncia": 2007}
{"idRenuncia": "renuncia_38", "idPersona": "ID-06656244", "idPartidoPolitico": "179", "fechaRenuncia": 2015}
{"idRenuncia": "renuncia_39", "idPersona": "ID-45546626", "idPartidoPolitico": "2842", "fechaRenuncia": 2017}
{"idRenuncia": "renuncia_40", "idPersona": "ID-41360498", "idPartidoPolitico": "14", "fechaRenuncia": 2019}
{"idRenuncia": "renuncia_41", "idPersona": "ID-09080415", "idPartidoPolitico": "2235", "fechaRenuncia": 2020}
{"idRenuncia": "renuncia_42", "idPersona": "ID-09080415", "idPartidoPolitico": "2880", "fechaRenuncia": 2011}
{"idRenuncia": "renuncia_43", "idPersona": "ID-07494412", "idPartidoPolitico": "179", "fechaRenuncia": 2015}
{"idRenuncia": "renuncia_44", "idPersona": "ID-47676437", "idPartidoPolitico": "15", "fechaRenuncia": 2018}
{"idRenuncia": "renuncia_45", "idPersona": "ID-06731880", "idPartidoPolitico": "2845", "fechaRenuncia": 2013}
{"idRenuncia": "renuncia_46", "idPersona": "ID-40231227", "idPartidoPolitico": "2235", "fechaRenuncia": 2019}
{"idRenuncia": "renuncia_47", "idPersona": "ID-06591795", "idPartidoPolitico": "2842", "fechaRenuncia": 2018}
{"idRenuncia": "renuncia_48", "idPersona": "ID-06591795", "idPartidoPolitico": "2842", "fechaRenuncia": 2011}
{"idRenuncia": "renuncia_49", "idPersona": "ID-06435263", "idPartidoPolitico": "179", "fechaRenuncia": 2017}
{"idRenuncia": "renuncia_50", "idPersona": "ID-15614981", "idPartidoPolitico": "2882", "fechaRenuncia": 2012}
{"idRenuncia": "renuncia_51", "idPersona": "ID-09997336", "idPartidoPolitico": "2883", "fechaRenuncia": 2005}
{"idRenuncia": "renuncia_52", "idPersona": "ID-16012643", "idPartidoPolitico": "2845", "fechaRenuncia": 2017}
{"idRenuncia": "renuncia_53", "idPersona": "ID-05618705", "idPartidoPolitico": "2884", "fechaRenuncia": 2020}
{"idRenuncia": "renuncia_54", "idPersona": "ID-05394833", "idPartidoPolitico": "2842", "fechaRenuncia": 2013}
{"idRenuncia": "renuncia_55", "idPersona": "ID-05394833", "idPartidoPolitico": "2885", "fechaRenuncia": 2019}
{"idRenuncia": "renuncia_56", "idPersona": "ID-05374315", "idPartidoPolitico": "2887", "fechaRenuncia": 2018}
{"idRenuncia": "renuncia_57", "idPersona": "ID-05374315", "idPartidoPolitico": "2886", "fechaRenuncia": 2006}
{"idRenuncia": "renuncia_58", "idPersona": "ID-04809967", "idPartidoPolitico": "2888", "fechaRenuncia": 2011}
{"idRenuncia": "renuncia_59", "idPersona": "ID-05070188", "idPartidoPolitico": "2845", "fechaRenuncia": 2015}
{"idRenuncia": "renuncia_60", "idPersona": "ID-04402087", "idPartidoPolitico": "2892", "fechaRenuncia": 2011}
{"idRenuncia": "renuncia_61", "idPersona": "ID-04402087", "idPartidoPolitico": "1257", "fechaRenuncia": 2007}
{"idRenuncia": "renuncia_62", "idPersona": "ID-04648244", "idPartidoPolitico": "2893", "fechaRenuncia": 2012}
{"idRenuncia": "renuncia_63", "idPersona": "ID-02653616", "idPartidoPolitico": "2895", "fechaRenuncia": 2012}
{"idRenuncia": "renuncia_64", "idPersona": "ID-42335591", "idPartidoPolitico": "1257", "fechaRenuncia": 2017}
{"idRenuncia": "renuncia_65", "idPersona": "ID-03243625", "idPartidoPolitico": "47", "fechaRenuncia": 2009}
{"idRenuncia": "renuncia_66", "idPersona": "ID-03130342", "idPartidoPolitico": "2873", "fechaRenuncia": 2017}
{"idRenuncia": "renuncia_67", "idPersona": "ID-03130342", "idPartidoPolitico": "2898", "fechaRenuncia": 2018}
{"idRenuncia": "renuncia_68", "idPersona": "ID-02811430", "idPartidoPolitico": "2901", "fechaRenuncia": 2019}
{"idRenuncia": "renuncia_69", "idPersona": "ID-02446803", "idPartidoPolitico": "1257", "fechaRenuncia": 2017}
{"idRenuncia": "renuncia_70", "idPersona": "ID-00869829", "idPartidoPolitico": "15", "fechaRenuncia": 2010}
{"idRenuncia": "renuncia_71", "idPersona": "ID-00795315", "idPartidoPolitico": "2905", "fechaRenuncia": 2020}
{"idRenuncia": "renuncia_72", "idPersona": "ID-41322808", "idPartidoPolitico": "2907", "fechaRenuncia": 2011}
{"idRenuncia": "renuncia_73", "idPersona": "ID-41322808", "idPartidoPolitico": "2908", "fechaRenuncia": 2007}
{"idRenuncia": "renuncia_74", "idPersona": "ID-44853012", "idPartidoPolitico": "2909", "fechaRenuncia": 2011}
{"idRenuncia": "renuncia_75", "idPersona": "ID-44853012", "idPartidoPolitico": "2910", "fechaRenuncia": 2014}
{"idRenuncia": "renuncia_76", "idPersona": "ID-40241837", "idPartidoPolitico": "2911", "fechaRenuncia": 2020}
{"idRenuncia": "renuncia_77", "idPersona": "ID-40241837", "idPartidoPolitico": "2912", "fechaRenuncia": 2014}
{"idRenuncia": "renuncia_78", "idPersona": "ID-41343263", "idPartidoPolitico": "2913", "fechaRenuncia": 2015}
{"idRenuncia": "renuncia_79", "idPersona": "ID-25638420", "idPartidoPolitico": "15", "fechaRenuncia": 2019}
{"idRenuncia": "renuncia_80", "idPersona": "ID-00104988", "idPartidoPolitico": "2873", "fechaRenuncia": 2009}
{"idRenuncia": "renuncia_81", "idPersona": "ID-21140532", "idPartidoPolitico": "2916", "fechaRenuncia": 2015}
{"idRenuncia": "renuncia_82", "idPersona": "ID-21140532", "idPartidoPolitico": "2915", "fechaRenuncia": 2011}
{"idRenuncia": "renuncia_83", "idPersona": "ID-00074723", "idPartidoPolitico": "2917", "fechaRenuncia": 2011}
{"idRenuncia": "renuncia_84", "idPersona": "ID-06529088", "idPartidoPolitico": "2883", "fechaRenuncia": 2019}
{"idRenuncia": "renuncia_85", "idPersona": "ID-40765768", "idPartidoPolitico": "179", "fechaRenuncia": 2012}
{"idRenuncia": "renuncia_86", "idPersona": "ID-07886231", "idPartidoPolitico": "2160", "fechaRenuncia": 2016}
{"idRenuncia": "renuncia_87", "idPersona": "ID-16606653", "idPartidoPolitico": "2919", "fechaRenuncia": 2014}
{"idRenuncia": "renuncia_88", "idPersona": "ID-41833844", "idPartidoPolitico": "2920", "fechaRenuncia": 2019}
{"idRenuncia": "renuncia_89", "idPersona": "ID-33432958", "idPartidoPolitico": "2921", "fechaRenuncia": 2020}
{"idRenuncia": "renuncia_90", "idPersona": "ID-32869200", "idPartidoPolitico": "179", "fechaRenuncia": 2017}
{"idRenuncia": "renuncia_91", "idPersona": "ID-32800254", "idPartidoPolitico": "2873", "fechaRenuncia": 2016}
{"idRenuncia": "renuncia_92", "idPersona": "ID-31042921", "idPartidoPolitico": "15", "fechaRenuncia": 2011}
{"idRenuncia": "renuncia_93", "idPersona": "ID-31042921", "idPartidoPolitico": "47", "fechaRenuncia": 2018}
{"idRenuncia": "renuncia_94", "idPersona": "ID-31013661", "idPartidoPolitico": "2922", "fechaRenuncia": 2012}
{"idRenuncia": "renuncia_95", "idPersona": "ID-31013661", "idPartidoPolitico": "2922", "fechaRenuncia": 2007}
{"idRenuncia": "renuncia_96", "idPersona": "ID-29292723", "idPartidoPolitico": "2922", "fechaRenuncia": 2012}
{"idRenuncia": "renuncia_97", "idPersona": "ID-29292723", "idPartidoPolitico": "2922", "fechaRenuncia": 2007}
{"idRenuncia": "renuncia_98", "idPersona": "ID-27848107", "idPartidoPolitico": "179", "fechaRenuncia": 2015}
{"idRenuncia": "renuncia_99", "idPersona": "ID-27729213", "idPartidoPolitico": "179", "fechaRenuncia": 2014}
{"idRenuncia": "renuncia_100", "idPersona": "ID-23800640", "idPartidoPolitico": "2922", "fechaRenuncia": 2007}
{"idRenuncia": "renuncia_101", "idPersona": "ID-24286987", "idPartidoPolitico": "47", "fechaRenuncia": 2010}
{"idRenuncia": "renuncia_102", "idPersona": "ID-24286987", "idPartidoPolitico": "1257", "fechaRenuncia": 2019}
{"idRenuncia": "renuncia_103", "idPersona": "ID-22482738", "idPartidoPolitico": "2873", "fechaRenuncia": 2009}
{"idRenuncia": "renuncia_104", "idPersona": "ID-44607512", "idPartidoPolitico": "179", "fechaRenuncia": 2015}
{"idRenuncia": "renuncia_105", "idPersona": "ID-21459438", "idPartidoPolitico": "179", "fechaRenuncia": 2013}
{"idRenuncia": "renuncia_106", "idPersona": "ID-21459438", "idPartidoPolitico": "2926", "fechaRenuncia": 2011}
{"idRenuncia": "renuncia_107", "idPersona": "ID-22268904", "idPartidoPolitico": "2845", "fechaRenuncia": 2014}
{"idRenuncia": "renuncia_108", "idPersona": "ID-19877916", "idPartidoPolitico": "2928", "fechaRenuncia": 2019}
{"idRenuncia": "renuncia_109", "idPersona": "ID-19877916", "idPartidoPolitico": "2929", "fechaRenuncia": 2011}
{"idRenuncia": "renuncia_110", "idPersona": "ID-20099784", "idPartidoPolitico": "179", "fechaRenuncia": 2016}
{"idRenuncia": "renuncia_111", "idPersona": "ID-17928896", "idPartidoPolitico": "2930", "fechaRenuncia": 2007}
{"idRenuncia": "renuncia_112", "idPersona": "ID-09933376", "idPartidoPolitico": "179", "fechaRenuncia": 2017}
{"idRenuncia": "renuncia_113", "idPersona": "ID-16408684", "idPartidoPolitico": "4", "fechaRenuncia": 2017}
{"idRenuncia": "renuncia_114", "idPersona": "ID-16406601", "idPartidoPolitico": "2931", "fechaRenuncia": 2011}
{"idRenuncia": "renuncia_115", "idPersona": "ID-16639622", "idPartidoPolitico": "2873", "fechaRenuncia": 2010}
{"idRenuncia": "renuncia_116", "idPersona": "ID-16002918", "idPartidoPolitico": "2930", "fechaRenuncia": 2007}
{"idRenuncia": "renuncia_117", "idPersona": "ID-40855980", "idPartidoPolitico": "179", "fechaRenuncia": 2014}
{"idRenuncia": "renuncia_118", "idPersona": "ID-40855980", "idPartidoPolitico": "2930", "fechaRenuncia": 2007}
{"idRenuncia": "renuncia_119", "idPersona": "ID-40750540", "idPartidoPolitico": "179", "fechaRenuncia": 2015}
{"idRenuncia": "renuncia_120", "idPersona": "ID-08648855", "idPartidoPolitico": "179", "fechaRenuncia": 2013}
{"idRenuncia": "renuncia_121", "idPersona": "ID-45484726", "idPartidoPolitico": "179", "fechaRenuncia": 2016}
{"idRenuncia": "renuncia_122", "idPersona": "ID-06186181", "idPartidoPolitico": "2160", "fechaRenuncia": 2017}
{"idRenuncia": "renuncia_123", "idPersona": "ID-06186181", "idPartidoPolitico": "2845", "fechaRenuncia": 2007}
{"idRenuncia": "renuncia_124", "idPersona": "ID-07246692", "idPartidoPolitico": "2160", "fechaRenuncia": 2018}
{"idRenuncia": "renuncia_125", "idPersona": "ID-43590204", "idPartidoPolitico": "179", "fechaRenuncia": 2013}
{"idRenuncia": "renuncia_126", "idPersona": "ID-02878466", "idPartidoPolitico": "2845", "fechaRenuncia": 2007}
{"idRenuncia": "renuncia_127", "idPersona": "ID-10035168", "idPartidoPolitico": "14", "fechaRenuncia": 2017}
{"idRenuncia": "renuncia_128", "idPersona": "ID-06842762", "idPartidoPolitico": "2173", "fechaRenuncia": 2019}
{"idRenuncia": "renuncia_129", "idPersona": "ID-06842762", "idPartidoPolitico": "2937", "fechaRenuncia": 2007}
{"idRenuncia": "renuncia_130", "idPersona": "ID-08859668", "idPartidoPolitico": "2160", "fechaRenuncia": 2017}
{"idRenuncia": "renuncia_131", "idPersona": "ID-42991816", "idPartidoPolitico": "2160", "fechaRenuncia": 2013}
{"idRenuncia": "renuncia_132", "idPersona": "ID-15282252", "idPartidoPolitico": "2940", "fechaRenuncia": 2015}
{"idRenuncia": "renuncia_133", "idPersona": "ID-15282252", "idPartidoPolitico": "2941", "fechaRenuncia": 2011}
{"idRenuncia": "renuncia_134", "idPersona": "ID-40934834", "idPartidoPolitico": "2922", "fechaRenuncia": 2007}
{"idRenuncia": "renuncia_135", "idPersona": "ID-80547275", "idPartidoPolitico": "2942", "fechaRenuncia": 2007}
{"idRenuncia": "renuncia_136", "idPersona": "ID-43211379", "idPartidoPolitico": "2901", "fechaRenuncia": 2020}
{"idRenuncia": "renuncia_137", "idPersona": "ID-03859940", "idPartidoPolitico": "2847", "fechaRenuncia": 2007}
{"idRenuncia": "renuncia_138", "idPersona": "ID-02886933", "idPartidoPolitico": "2945", "fechaRenuncia": 2011}
{"idRenuncia": "renuncia_139", "idPersona": "ID-02886933", "idPartidoPolitico": "2946", "fechaRenuncia": 2007}
{"idRenuncia": "renuncia_140", "idPersona": "ID-01214155", "idPartidoPolitico": "2855", "fechaRenuncia": 2010}
{"idRenuncia": "renuncia_141", "idPersona": "ID-40896107", "idPartidoPolitico": "2922", "fechaRenuncia": 2007}
{"idRenuncia": "renuncia_142", "idPersona": "ID-45685927", "idPartidoPolitico": "179", "fechaRenuncia": 2016}
{"idRenuncia": "renuncia_143", "idPersona": "ID-00452384", "idPartidoPolitico": "2942", "fechaRenuncia": 2007}
{"idRenuncia": "renuncia_144", "idPersona": "ID-06112972", "idPartidoPolitico": "2842", "fechaRenuncia": 2013}
{"idRenuncia": "renuncia_145", "idPersona": "ID-45021645", "idPartidoPolitico": "179", "fechaRenuncia": 2019}
{"idRenuncia": "renuncia_146", "idPersona": "ID-00206441", "idPartidoPolitico": "1257", "fechaRenuncia": 2017}
{"idRenuncia": "renuncia_147", "idPersona": "ID-00206441", "idPartidoPolitico": "47", "fechaRenuncia": 2009}
{"idRenuncia": "renuncia_148", "idPersona": "ID-16606653", "idPartidoPolitico": "2919", "fechaRenuncia": 2014}
{"idRenuncia": "renuncia_149", "idPersona": "ID-21141816", "idPartidoPolitico": "2917", "fechaRenuncia": 2011}
{"idRenuncia": "renuncia_150", "idPersona": "ID-21141816", "idPartidoPolitico": "2937", "fechaRenuncia": 2007}
{"idRenuncia": "renuncia_151", "idPersona": "ID-40756691", "idPartidoPolitico": "47", "fechaRenuncia": 2008}
{"idRenuncia": "renuncia_152", "idPersona": "ID-09537000", "idPartidoPolitico": "15", "fechaRenuncia": 2015}
{"idRenuncia": "renuncia_153", "idPersona": "ID-09537000", "idPartidoPolitico": "2958", "fechaRenuncia": 2009}
{"idRenuncia": "renuncia_154", "idPersona": "ID-07831436", "idPartidoPolitico": "2959", "fechaRenuncia": 2016}
{"idRenuncia": "renuncia_155", "idPersona": "ID-07831436", "idPartidoPolitico": "2960", "fechaRenuncia": 2011}
{"idRenuncia": "renuncia_156", "idPersona": "ID-33647428", "idPartidoPolitico": "2962", "fechaRenuncia": 2010}
{"idRenuncia": "renuncia_157", "idPersona": "ID-32959521", "idPartidoPolitico": "2963", "fechaRenuncia": 2015}
{"idRenuncia": "renuncia_158", "idPersona": "ID-31151251", "idPartidoPolitico": "2965", "fechaRenuncia": 2012}
{"idRenuncia": "renuncia_159", "idPersona": "ID-72203920", "idPartidoPolitico": "2970", "fechaRenuncia": 2020}
{"idRenuncia": "renuncia_160", "idPersona": "ID-26689382", "idPartidoPolitico": "2972", "fechaRenuncia": 2017}
{"idRenuncia": "renuncia_161", "idPersona": "ID-27077242", "idPartidoPolitico": "2974", "fechaRenuncia": 2011}
{"idRenuncia": "renuncia_162", "idPersona": "ID-10322765", "idPartidoPolitico": "14", "fechaRenuncia": 2011}
{"idRenuncia": "renuncia_163", "idPersona": "ID-03860886", "idPartidoPolitico": "4", "fechaRenuncia": 2019}
{"idRenuncia": "renuncia_164", "idPersona": "ID-22183232", "idPartidoPolitico": "2873", "fechaRenuncia": 2011}
{"idRenuncia": "renuncia_165", "idPersona": "ID-19994639", "idPartidoPolitico": "15", "fechaRenuncia": 2019}
{"idRenuncia": "renuncia_166", "idPersona": "ID-10792277", "idPartidoPolitico": "14", "fechaRenuncia": 2005}
{"idRenuncia": "renuncia_167", "idPersona": "ID-20709981", "idPartidoPolitico": "2975", "fechaRenuncia": 2011}
{"idRenuncia": "renuncia_168", "idPersona": "ID-19856757", "idPartidoPolitico": "4", "fechaRenuncia": 2012}
{"idRenuncia": "renuncia_169", "idPersona": "ID-18147173", "idPartidoPolitico": "1257", "fechaRenuncia": 2019}
{"idRenuncia": "renuncia_170", "idPersona": "ID-18147173", "idPartidoPolitico": "2977", "fechaRenuncia": 2007}
{"idRenuncia": "renuncia_171", "idPersona": "ID-27167110", "idPartidoPolitico": "2908", "fechaRenuncia": 2007}
{"idRenuncia": "renuncia_172", "idPersona": "ID-17537267", "idPartidoPolitico": "55", "fechaRenuncia": 2014}
{"idRenuncia": "renuncia_173", "idPersona": "ID-80347972", "idPartidoPolitico": "2873", "fechaRenuncia": 2009}
{"idRenuncia": "renuncia_174", "idPersona": "ID-07831436", "idPartidoPolitico": "2959", "fechaRenuncia": 2016}
{"idRenuncia": "renuncia_175", "idPersona": "ID-07831436", "idPartidoPolitico": "2960", "fechaRenuncia": 2011}
{"idRenuncia": "renuncia_176", "idPersona": "ID-08911520", "idPartidoPolitico": "2962", "fechaRenuncia": 2010}
{"idRenuncia": "renuncia_177", "idPersona": "ID-09304839", "idPartidoPolitico": "2979", "fechaRenuncia": 1994}
{"idRenuncia": "renuncia_178", "idPersona": "ID-08262491", "idPartidoPolitico": "2962", "fechaRenuncia": 2007}
{"idRenuncia": "renuncia_179", "idPersona": "ID-07889625", "idPartidoPolitico": "14", "fechaRenuncia": 2013}
{"idRenuncia": "renuncia_180", "idPersona": "ID-08676866", "idPartidoPolitico": "15", "fechaRenuncia": 2014}
{"idRenuncia": "renuncia_181", "idPersona": "ID-09039671", "idPartidoPolitico": "2842", "fechaRenuncia": 2014}
{"idRenuncia": "renuncia_182", "idPersona": "ID-09931723", "idPartidoPolitico": "15", "fechaRenuncia": 2014}
{"idRenuncia": "renuncia_183", "idPersona": "ID-09391698", "idPartidoPolitico": "15", "fechaRenuncia": 2013}
{"idRenuncia": "renuncia_184", "idPersona": "ID-15300817", "idPartidoPolitico": "55", "fechaRenuncia": 2010}
{"idRenuncia": "renuncia_185", "idPersona": "ID-15687126", "idPartidoPolitico": "2873", "fechaRenuncia": 2014}
{"idRenuncia": "renuncia_186", "idPersona": "ID-08868110", "idPartidoPolitico": "2981", "fechaRenuncia": 2017}
{"idRenuncia": "renuncia_187", "idPersona": "ID-22486517", "idPartidoPolitico": "2962", "fechaRenuncia": 2012}
{"idRenuncia": "renuncia_188", "idPersona": "ID-04432240", "idPartidoPolitico": "2873", "fechaRenuncia": 2010}
{"idRenuncia": "renuncia_189", "idPersona": "ID-02726999", "idPartidoPolitico": "2898", "fechaRenuncia": 2020}
{"idRenuncia": "renuncia_190", "idPersona": "ID-44275599", "idPartidoPolitico": "2898", "fechaRenuncia": 2019}
{"idRenuncia": "renuncia_191", "idPersona": "ID-02449363", "idPartidoPolitico": "2873", "fechaRenuncia": 2010}
{"idRenuncia": "renuncia_192", "idPersona": "ID-45382589", "idPartidoPolitico": "15", "fechaRenuncia": 2015}
{"idRenuncia": "renuncia_193", "idPersona": "ID-01330879", "idPartidoPolitico": "14", "fechaRenuncia": 2010}
{"idRenuncia": "renuncia_194", "idPersona": "ID-15631864", "idPartidoPolitico": "2982", "fechaRenuncia": 2020}
{"idRenuncia": "renuncia_195", "idPersona": "ID-40242430", "idPartidoPolitico": "2983", "fechaRenuncia": 2019}
{"idRenuncia": "renuncia_196", "idPersona": "ID-41799959", "idPartidoPolitico": "2984", "fechaRenuncia": 2007}
{"idRenuncia": "renuncia_197", "idPersona": "ID-07737110", "idPartidoPolitico": "2880", "fechaRenuncia": 2012}
{"idRenuncia": "renuncia_198", "idPersona": "ID-09980339", "idPartidoPolitico": "2883", "fechaRenuncia": 2014}
{"idRenuncia": "renuncia_199", "idPersona": "ID-06779497", "idPartidoPolitico": "2845", "fechaRenuncia": 2010}
{"idRenuncia": "renuncia_200", "idPersona": "ID-00032761", "idPartidoPolitico": "2873", "fechaRenuncia": 2010}
{"idRenuncia": "renuncia_201", "idPersona": "ID-08092611", "idPartidoPolitico": "55", "fechaRenuncia": 2013}
{"idRenuncia": "renuncia_202", "idPersona": "ID-18010708", "idPartidoPolitico": "1366", "fechaRenuncia": 2019}
{"idRenuncia": "renuncia_203", "idPersona": "ID-18010708", "idPartidoPolitico": "2873", "fechaRenuncia": 2014}
{"idRenuncia": "renuncia_204", "idPersona": "ID-40383269", "idPartidoPolitico": "2873", "fechaRenuncia": 2015}
{"idRenuncia": "renuncia_205", "idPersona": "ID-48594038", "idPartidoPolitico": "2987", "fechaRenuncia": 2014}
{"idRenuncia": "renuncia_206", "idPersona": "ID-29637880", "idPartidoPolitico": "2845", "fechaRenuncia": 2017}
{"idRenuncia": "renuncia_207", "idPersona": "ID-29424191", "idPartidoPolitico": "2235", "fechaRenuncia": 2019}
{"idRenuncia": "renuncia_208", "idPersona": "ID-29698656", "idPartidoPolitico": "2989", "fechaRenuncia": 2015}
{"idRenuncia": "renuncia_209", "idPersona": "ID-28219445", "idPartidoPolitico": "1257", "fechaRenuncia": 2016}
{"idRenuncia": "renuncia_210", "idPersona": "ID-28219445", "idPartidoPolitico": "2990", "fechaRenuncia": 2013}
{"idRenuncia": "renuncia_211", "idPersona": "ID-28576690", "idPartidoPolitico": "179", "fechaRenuncia": 2016}
{"idRenuncia": "renuncia_212", "idPersona": "ID-28576690", "idPartidoPolitico": "2991", "fechaRenuncia": 2012}
{"idRenuncia": "renuncia_213", "idPersona": "ID-16676736", "idPartidoPolitico": "2173", "fechaRenuncia": 2019}
{"idRenuncia": "renuncia_214", "idPersona": "ID-27058894", "idPartidoPolitico": "2873", "fechaRenuncia": 2013}
{"idRenuncia": "renuncia_215", "idPersona": "ID-27058894", "idPartidoPolitico": "2993", "fechaRenuncia": 2017}
{"idRenuncia": "renuncia_216", "idPersona": "ID-43507173", "idPartidoPolitico": "2994", "fechaRenuncia": 2019}
{"idRenuncia": "renuncia_217", "idPersona": "ID-40482085", "idPartidoPolitico": "2873", "fechaRenuncia": 2014}
{"idRenuncia": "renuncia_218", "idPersona": "ID-42816821", "idPartidoPolitico": "1257", "fechaRenuncia": 2019}
{"idRenuncia": "renuncia_219", "idPersona": "ID-20117146", "idPartidoPolitico": "4", "fechaRenuncia": 2015}
{"idRenuncia": "renuncia_220", "idPersona": "ID-40790654", "idPartidoPolitico": "2996", "fechaRenuncia": 2007}
{"idRenuncia": "renuncia_221", "idPersona": "ID-19098725", "idPartidoPolitico": "2997", "fechaRenuncia": 2014}
{"idRenuncia": "renuncia_222", "idPersona": "ID-32926390", "idPartidoPolitico": "2873", "fechaRenuncia": 2017}
{"idRenuncia": "renuncia_223", "idPersona": "ID-16674380", "idPartidoPolitico": "1257", "fechaRenuncia": 2012}
{"idRenuncia": "renuncia_224", "idPersona": "ID-16674380", "idPartidoPolitico": "1257", "fechaRenuncia": 2007}
{"idRenuncia": "renuncia_225", "idPersona": "ID-16586103", "idPartidoPolitico": "2873", "fechaRenuncia": 2009}
{"idRenuncia": "renuncia_226", "idPersona": "ID-45620655", "idPartidoPolitico": "2883", "fechaRenuncia": 2019}
{"idRenuncia": "renuncia_227", "idPersona": "ID-04412417", "idPartidoPolitico": "3001", "fechaRenuncia": 2015}
{"idRenuncia": "renuncia_228", "idPersona": "ID-44103082", "idPartidoPolitico": "2843", "fechaRenuncia": 2016}
{"idRenuncia": "renuncia_229", "idPersona": "ID-10762763", "idPartidoPolitico": "2958", "fechaRenuncia": 2017}
{"idRenuncia": "renuncia_230", "idPersona": "ID-10058164", "idPartidoPolitico": "2235", "fechaRenuncia": 2017}
{"idRenuncia": "renuncia_231", "idPersona": "ID-10058164", "idPartidoPolitico": "3002", "fechaRenuncia": 2007}
{"idRenuncia": "renuncia_232", "idPersona": "ID-07228130", "idPartidoPolitico": "2873", "fechaRenuncia": 2010}
{"idRenuncia": "renuncia_233", "idPersona": "ID-10862330", "idPartidoPolitico": "3003", "fechaRenuncia": 2014}
{"idRenuncia": "renuncia_234", "idPersona": "ID-10165373", "idPartidoPolitico": "15", "fechaRenuncia": 2013}
{"idRenuncia": "renuncia_235", "idPersona": "ID-09952318", "idPartidoPolitico": "2873", "fechaRenuncia": 2017}
{"idRenuncia": "renuncia_236", "idPersona": "ID-15648655", "idPartidoPolitico": "3005", "fechaRenuncia": 2015}
{"idRenuncia": "renuncia_237", "idPersona": "ID-07854556", "idPartidoPolitico": "2845", "fechaRenuncia": 2014}
{"idRenuncia": "renuncia_238", "idPersona": "ID-02644140", "idPartidoPolitico": "1257", "fechaRenuncia": 2017}
{"idRenuncia": "renuncia_239", "idPersona": "ID-02743658", "idPartidoPolitico": "3009", "fechaRenuncia": 2002}
{"idRenuncia": "renuncia_240", "idPersona": "ID-02743658", "idPartidoPolitico": "2930", "fechaRenuncia": 2014}
{"idRenuncia": "renuncia_241", "idPersona": "ID-41382700", "idPartidoPolitico": "3010", "fechaRenuncia": 2015}
{"idRenuncia": "renuncia_242", "idPersona": "ID-03676453", "idPartidoPolitico": "3013", "fechaRenuncia": 2018}
{"idRenuncia": "renuncia_243", "idPersona": "ID-03676453", "idPartidoPolitico": "14", "fechaRenuncia": 2015}
{"idRenuncia": "renuncia_244", "idPersona": "ID-47350392", "idPartidoPolitico": "1257", "fechaRenuncia": 2017}
{"idRenuncia": "renuncia_245", "idPersona": "ID-00242514", "idPartidoPolitico": "15", "fechaRenuncia": 2010}
{"idRenuncia": "renuncia_246", "idPersona": "ID-00242514", "idPartidoPolitico": "179", "fechaRenuncia": 2016}
{"idRenuncia": "renuncia_247", "idPersona": "ID-01234692", "idPartidoPolitico": "1257", "fechaRenuncia": 2019}
{"idRenuncia": "renuncia_248", "idPersona": "ID-25547628", "idPartidoPolitico": "1257", "fechaRenuncia": 2019}
{"idRenuncia": "renuncia_249", "idPersona": "ID-00102365", "idPartidoPolitico": "179", "fechaRenuncia": 2009}
{"idRenuncia": "renuncia_250", "idPersona": "ID-00102365", "idPartidoPolitico": "4", "fechaRenuncia": 2019}
{"idRenuncia": "renuncia_251", "idPersona": "ID-40538451", "idPartidoPolitico": "3017", "fechaRenuncia": 2007}
{"idRenuncia": "renuncia_252", "idPersona": "ID-23011814", "idPartidoPolitico": "2845", "fechaRenuncia": 2017}
{"idRenuncia": "renuncia_253", "idPersona": "ID-16422667", "idPartidoPolitico": "2845", "fechaRenuncia": 2006}
{"idRenuncia": "renuncia_254", "idPersona": "ID-05278708", "idPartidoPolitico": "15", "fechaRenuncia": 2020}
{"idRenuncia": "renuncia_255", "idPersona": "ID-05278708", "idPartidoPolitico": "2873", "fechaRenuncia": 2017}
{"idRenuncia": "renuncia_256", "idPersona": "ID-09679332", "idPartidoPolitico": "14", "fechaRenuncia": 2019}
{"idRenuncia": "renuncia_257", "idPersona": "ID-09679332", "idPartidoPolitico": "2873", "fechaRenuncia": 2010}
{"idRenuncia": "renuncia_258", "idPersona": "ID-01221126", "idPartidoPolitico": "2845", "fechaRenuncia": 2006}
{"idRenuncia": "renuncia_259", "idPersona": "ID-07232177", "idPartidoPolitico": "3020", "fechaRenuncia": 2020}
{"idRenuncia": "renuncia_260", "idPersona": "ID-10832073", "idPartidoPolitico": "3021", "fechaRenuncia": 2019}
{"idRenuncia": "renuncia_261", "idPersona": "ID-09396443", "idPartidoPolitico": "47", "fechaRenuncia": 1995}
{"idRenuncia": "renuncia_262", "idPersona": "ID-09396443", "idPartidoPolitico": "2866", "fechaRenuncia": 2011}
{"idRenuncia": "renuncia_263", "idPersona": "ID-32988032", "idPartidoPolitico": "2845", "fechaRenuncia": 2007}
{"idRenuncia": "renuncia_264", "idPersona": "ID-07260181", "idPartidoPolitico": "4", "fechaRenuncia": 2010}
{"idRenuncia": "renuncia_265", "idPersona": "ID-27373679", "idPartidoPolitico": "2845", "fechaRenuncia": 2017}
{"idRenuncia": "renuncia_266", "idPersona": "ID-41752429", "idPartidoPolitico": "3022", "fechaRenuncia": 2008}
{"idRenuncia": "renuncia_267", "idPersona": "ID-08486528", "idPartidoPolitico": "2924", "fechaRenuncia": 1990}
{"idRenuncia": "renuncia_268", "idPersona": "ID-08486528", "idPartidoPolitico": "47", "fechaRenuncia": 1999}
{"idRenuncia": "renuncia_269", "idPersona": "ID-17955822", "idPartidoPolitico": "2845", "fechaRenuncia": 2010}
{"idRenuncia": "renuncia_270", "idPersona": "ID-17540366", "idPartidoPolitico": "47", "fechaRenuncia": 2007}
{"idRenuncia": "renuncia_271", "idPersona": "ID-18166013", "idPartidoPolitico": "2855", "fechaRenuncia": 2013}
{"idRenuncia": "renuncia_272", "idPersona": "ID-10547874", "idPartidoPolitico": "47", "fechaRenuncia": 2009}
{"idRenuncia": "renuncia_273", "idPersona": "ID-09396443", "idPartidoPolitico": "47", "fechaRenuncia": 1995}
{"idRenuncia": "renuncia_274", "idPersona": "ID-09396443", "idPartidoPolitico": "2866", "fechaRenuncia": 2011}
{"idRenuncia": "renuncia_275", "idPersona": "ID-25439579", "idPartidoPolitico": "15", "fechaRenuncia": 2011}
{"idRenuncia": "renuncia_276", "idPersona": "ID-08707731", "idPartidoPolitico": "2845", "fechaRenuncia": 2010}
{"idRenuncia": "renuncia_277", "idPersona": "ID-09903125", "idPartidoPolitico": "15", "fechaRenuncia": 2007}
{"idRenuncia": "renuncia_278", "idPersona": "ID-09903125", "idPartidoPolitico": "47", "fechaRenuncia": 2017}
{"idRenuncia": "renuncia_279", "idPersona": "ID-41340219", "idPartidoPolitico": "2873", "fechaRenuncia": 2005}
{"idRenuncia": "renuncia_280", "idPersona": "ID-08615185", "idPartidoPolitico": "179", "fechaRenuncia": 2017}
{"idRenuncia": "renuncia_281", "idPersona": "ID-09546461", "idPartidoPolitico": "4", "fechaRenuncia": 2010}
{"idRenuncia": "renuncia_282", "idPersona": "ID-21536163", "idPartidoPolitico": "2855", "fechaRenuncia": 2005}
{"idRenuncia": "renuncia_283", "idPersona": "ID-04332384", "idPartidoPolitico": "3026", "fechaRenuncia": 2011}
{"idRenuncia": "renuncia_284", "idPersona": "ID-00869751", "idPartidoPolitico": "3028", "fechaRenuncia": 2014}
{"idRenuncia": "renuncia_285", "idPersona": "ID-29480753", "idPartidoPolitico": "2845", "fechaRenuncia": 2009}
{"idRenuncia": "renuncia_286", "idPersona": "ID-00240673", "idPartidoPolitico": "2845", "fechaRenuncia": 2011}
{"idRenuncia": "renuncia_287", "idPersona": "ID-06773079", "idPartidoPolitico": "3029", "fechaRenuncia": 2011}
{"idRenuncia": "renuncia_288", "idPersona": "ID-06773079", "idPartidoPolitico": "2873", "fechaRenuncia": 2008}
{"idRenuncia": "renuncia_289", "idPersona": "ID-25648800", "idPartidoPolitico": "3030", "fechaRenuncia": 2006}
{"idRenuncia": "renuncia_290", "idPersona": "ID-25648800", "idPartidoPolitico": "2845", "fechaRenuncia": 2007}
{"idRenuncia": "renuncia_291", "idPersona": "ID-00080642", "idPartidoPolitico": "2937", "fechaRenuncia": 2007}
{"idRenuncia": "renuncia_292", "idPersona": "ID-32921039", "idPartidoPolitico": "2873", "fechaRenuncia": 2009}
{"idRenuncia": "renuncia_293", "idPersona": "ID-32921039", "idPartidoPolitico": "2908", "fechaRenuncia": 2007}
{"idRenuncia": "renuncia_294", "idPersona": "ID-07901490", "idPartidoPolitico": "2845", "fechaRenuncia": 2017}
{"idRenuncia": "renuncia_295", "idPersona": "ID-10765508", "idPartidoPolitico": "3036", "fechaRenuncia": 2014}
{"idRenuncia": "renuncia_296", "idPersona": "ID-10765508", "idPartidoPolitico": "2873", "fechaRenuncia": 2006}
{"idRenuncia": "renuncia_297", "idPersona": "ID-27557657", "idPartidoPolitico": "3037", "fechaRenuncia": 2010}
{"idRenuncia": "renuncia_298", "idPersona": "ID-27557657", "idPartidoPolitico": "3038", "fechaRenuncia": 2017}
{"idRenuncia": "renuncia_299", "idPersona": "ID-46456215", "idPartidoPolitico": "3039", "fechaRenuncia": 2007}
{"idRenuncia": "renuncia_300", "idPersona": "ID-23944252", "idPartidoPolitico": "3042", "fechaRenuncia": 2019}
{"idRenuncia": "renuncia_301", "idPersona": "ID-23944252", "idPartidoPolitico": "3041", "fechaRenuncia": 2015}
{"idRenuncia": "renuncia_302", "idPersona": "ID-09438337", "idPartidoPolitico": "2235", "fechaRenuncia": 2015}
{"idRenuncia": "renuncia_303", "idPersona": "ID-09438337", "idPartidoPolitico": "3045", "fechaRenuncia": 2006}
{"idRenuncia": "renuncia_304", "idPersona": "ID-22664818", "idPartidoPolitico": "3048", "fechaRenuncia": 2017}
{"idRenuncia": "renuncia_305", "idPersona": "ID-22664818", "idPartidoPolitico": "3049", "fechaRenuncia": 2017}
{"idRenuncia": "renuncia_306", "idPersona": "ID-21465470", "idPartidoPolitico": "14", "fechaRenuncia": 2010}
{"idRenuncia": "renuncia_307", "idPersona": "ID-20719835", "idPartidoPolitico": "3051", "fechaRenuncia": 2020}
{"idRenuncia": "renuncia_308", "idPersona": "ID-18196788", "idPartidoPolitico": "2873", "fechaRenuncia": 2014}
{"idRenuncia": "renuncia_309", "idPersona": "ID-18175275", "idPartidoPolitico": "2873", "fechaRenuncia": 2018}
{"idRenuncia": "renuncia_310", "idPersona": "ID-09596796", "idPartidoPolitico": "3052", "fechaRenuncia": 2007}
{"idRenuncia": "renuncia_311", "idPersona": "ID-16671343", "idPartidoPolitico": "2845", "fechaRenuncia": 2015}
{"idRenuncia": "renuncia_312", "idPersona": "ID-40363539", "idPartidoPolitico": "14", "fechaRenuncia": 2014}
{"idRenuncia": "renuncia_313", "idPersona": "ID-10073191", "idPartidoPolitico": "14", "fechaRenuncia": 2020}
{"idRenuncia": "renuncia_314", "idPersona": "ID-44963545", "idPartidoPolitico": "47", "fechaRenuncia": 2019}
{"idRenuncia": "renuncia_315", "idPersona": "ID-44963545", "idPartidoPolitico": "3030", "fechaRenuncia": 2016}
{"idRenuncia": "renuncia_316", "idPersona": "ID-41456053", "idPartidoPolitico": "15", "fechaRenuncia": 2019}
{"idRenuncia": "renuncia_317", "idPersona": "ID-08649247", "idPartidoPolitico": "3053", "fechaRenuncia": 2006}
{"idRenuncia": "renuncia_318", "idPersona": "ID-09375576", "idPartidoPolitico": "2845", "fechaRenuncia": 2017}
{"idRenuncia": "renuncia_319", "idPersona": "ID-08386769", "idPartidoPolitico": "55", "fechaRenuncia": 2017}
{"idRenuncia": "renuncia_320", "idPersona": "ID-10181163", "idPartidoPolitico": "2873", "fechaRenuncia": 2010}
{"idRenuncia": "renuncia_321", "idPersona": "ID-40971548", "idPartidoPolitico": "2873", "fechaRenuncia": 2017}
{"idRenuncia": "renuncia_322", "idPersona": "ID-05372931", "idPartidoPolitico": "2887", "fechaRenuncia": 2020}
{"idRenuncia": "renuncia_323", "idPersona": "ID-05372931", "idPartidoPolitico": "2845", "fechaRenuncia": 2006}
{"idRenuncia": "renuncia_324", "idPersona": "ID-70840857", "idPartidoPolitico": "3056", "fechaRenuncia": 2017}
{"idRenuncia": "renuncia_325", "idPersona": "ID-18196637", "idPartidoPolitico": "3013", "fechaRenuncia": 2019}
{"idRenuncia": "renuncia_326", "idPersona": "ID-18196637", "idPartidoPolitico": "3057", "fechaRenuncia": 2009}
{"idRenuncia": "renuncia_327", "idPersona": "ID-03873045", "idPartidoPolitico": "3060", "fechaRenuncia": 2015}
{"idRenuncia": "renuncia_328", "idPersona": "ID-03873045", "idPartidoPolitico": "3061", "fechaRenuncia": 2012}
{"idRenuncia": "renuncia_329", "idPersona": "ID-02405858", "idPartidoPolitico": "3063", "fechaRenuncia": 2011}
{"idRenuncia": "renuncia_330", "idPersona": "ID-20076133", "idPartidoPolitico": "2895", "fechaRenuncia": 2015}
{"idRenuncia": "renuncia_331", "idPersona": "ID-07639210", "idPartidoPolitico": "1366", "fechaRenuncia": 2016}
{"idRenuncia": "renuncia_332", "idPersona": "ID-00326904", "idPartidoPolitico": "2962", "fechaRenuncia": 2007}
{"idRenuncia": "renuncia_333", "idPersona": "ID-00326904", "idPartidoPolitico": "2173", "fechaRenuncia": 2019}
{"idRenuncia": "renuncia_334", "idPersona": "ID-09566510", "idPartidoPolitico": "3067", "fechaRenuncia": 2019}
{"idRenuncia": "renuncia_335", "idPersona": "ID-09566510", "idPartidoPolitico": "3068", "fechaRenuncia": 2011}
{"idRenuncia": "renuncia_336", "idPersona": "ID-09894451", "idPartidoPolitico": "14", "fechaRenuncia": 2006}
{"idRenuncia": "renuncia_337", "idPersona": "ID-06453241", "idPartidoPolitico": "3069", "fechaRenuncia": 2020}
{"idRenuncia": "renuncia_338", "idPersona": "ID-06453241", "idPartidoPolitico": "2992", "fechaRenuncia": 2007}
{"idRenuncia": "renuncia_339", "idPersona": "ID-21144155", "idPartidoPolitico": "2915", "fechaRenuncia": 2011}
{"idRenuncia": "renuncia_340", "idPersona": "ID-08030064", "idPartidoPolitico": "2990", "fechaRenuncia": 2020}
{"idRenuncia": "renuncia_341", "idPersona": "ID-33569440", "idPartidoPolitico": "4", "fechaRenuncia": 2020}
{"idRenuncia": "renuncia_342", "idPersona": "ID-33569440", "idPartidoPolitico": "2845", "fechaRenuncia": 2009}
{"idRenuncia": "renuncia_343", "idPersona": "ID-08030064", "idPartidoPolitico": "2990", "fechaRenuncia": 2020}
{"idRenuncia": "renuncia_344", "idPersona": "ID-27280894", "idPartidoPolitico": "179", "fechaRenuncia": 2018}
{"idRenuncia": "renuncia_345", "idPersona": "ID-23928972", "idPartidoPolitico": "3072", "fechaRenuncia": 2011}
{"idRenuncia": "renuncia_346", "idPersona": "ID-23928972", "idPartidoPolitico": "3073", "fechaRenuncia": 2007}
{"idRenuncia": "renuncia_347", "idPersona": "ID-28286859", "idPartidoPolitico": "4", "fechaRenuncia": 2014}
{"idRenuncia": "renuncia_348", "idPersona": "ID-40170098", "idPartidoPolitico": "3075", "fechaRenuncia": 2015}
{"idRenuncia": "renuncia_349", "idPersona": "ID-21501326", "idPartidoPolitico": "47", "fechaRenuncia": 1997}
{"idRenuncia": "renuncia_350", "idPersona": "ID-21501326", "idPartidoPolitico": "3076", "fechaRenuncia": 2011}
{"idRenuncia": "renuncia_351", "idPersona": "ID-20042008", "idPartidoPolitico": "2845", "fechaRenuncia": 2011}
{"idRenuncia": "renuncia_352", "idPersona": "ID-19943962", "idPartidoPolitico": "2942", "fechaRenuncia": 2007}
{"idRenuncia": "renuncia_353", "idPersona": "ID-18092995", "idPartidoPolitico": "2873", "fechaRenuncia": 2009}
{"idRenuncia": "renuncia_354", "idPersona": "ID-17907365", "idPartidoPolitico": "2930", "fechaRenuncia": 2014}
{"idRenuncia": "renuncia_355", "idPersona": "ID-19210234", "idPartidoPolitico": "2173", "fechaRenuncia": 2018}
{"idRenuncia": "renuncia_356", "idPersona": "ID-07136053", "idPartidoPolitico": "2872", "fechaRenuncia": 2006}
{"idRenuncia": "renuncia_357", "idPersona": "ID-09553265", "idPartidoPolitico": "179", "fechaRenuncia": 2017}
{"idRenuncia": "renuncia_358", "idPersona": "ID-08478372", "idPartidoPolitico": "179", "fechaRenuncia": 2017}
{"idRenuncia": "renuncia_359", "idPersona": "ID-07172085", "idPartidoPolitico": "2845", "fechaRenuncia": 2017}
{"idRenuncia": "renuncia_360", "idPersona": "ID-04332358", "idPartidoPolitico": "3084", "fechaRenuncia": 2013}
{"idRenuncia": "renuncia_361", "idPersona": "ID-03891818", "idPartidoPolitico": "3085", "fechaRenuncia": 2011}
{"idRenuncia": "renuncia_362", "idPersona": "ID-40406225", "idPartidoPolitico": "2873", "fechaRenuncia": 2017}
{"idRenuncia": "renuncia_363", "idPersona": "ID-25638183", "idPartidoPolitico": "2922", "fechaRenuncia": 2008}
{"idRenuncia": "renuncia_364", "idPersona": "ID-25638183", "idPartidoPolitico": "47", "fechaRenuncia": 2000}
{"idRenuncia": "renuncia_365", "idPersona": "ID-25625931", "idPartidoPolitico": "2873", "fechaRenuncia": 2013}
{"idRenuncia": "renuncia_366", "idPersona": "ID-29385399", "idPartidoPolitico": "3090", "fechaRenuncia": 2015}
{"idRenuncia": "renuncia_367", "idPersona": "ID-29543525", "idPartidoPolitico": "4", "fechaRenuncia": 2019}
{"idRenuncia": "renuncia_368", "idPersona": "ID-29543525", "idPartidoPolitico": "2880", "fechaRenuncia": 2012}
{"idRenuncia": "renuncia_369", "idPersona": "ID-10381779", "idPartidoPolitico": "3091", "fechaRenuncia": 2020}
{"idRenuncia": "renuncia_370", "idPersona": "ID-17925698", "idPartidoPolitico": "2845", "fechaRenuncia": 2010}
{"idRenuncia": "renuncia_371", "idPersona": "ID-41665046", "idPartidoPolitico": "2855", "fechaRenuncia": 2018}
{"idRenuncia": "renuncia_372", "idPersona": "ID-24950470", "idPartidoPolitico": "3042", "fechaRenuncia": 2011}
{"idRenuncia": "renuncia_373", "idPersona": "ID-23816435", "idPartidoPolitico": "3093", "fechaRenuncia": 2014}
{"idRenuncia": "renuncia_374", "idPersona": "ID-23816435", "idPartidoPolitico": "2845", "fechaRenuncia": 2017}
{"idRenuncia": "renuncia_375", "idPersona": "ID-07641046", "idPartidoPolitico": "15", "fechaRenuncia": 2013}
{"idRenuncia": "renuncia_376", "idPersona": "ID-09579962", "idPartidoPolitico": "2962", "fechaRenuncia": 2010}
{"idRenuncia": "renuncia_377", "idPersona": "ID-20082579", "idPartidoPolitico": "15", "fechaRenuncia": 2019}
{"idRenuncia": "renuncia_378", "idPersona": "ID-43434182", "idPartidoPolitico": "2873", "fechaRenuncia": 2017}
{"idRenuncia": "renuncia_379", "idPersona": "ID-18225621", "idPartidoPolitico": "1257", "fechaRenuncia": 2007}
{"idRenuncia": "renuncia_380", "idPersona": "ID-16778984", "idPartidoPolitico": "14", "fechaRenuncia": 2008}
{"idRenuncia": "renuncia_381", "idPersona": "ID-16778984", "idPartidoPolitico": "179", "fechaRenuncia": 2010}
{"idRenuncia": "renuncia_382", "idPersona": "ID-44756974", "idPartidoPolitico": "2235", "fechaRenuncia": 2020}
{"idRenuncia": "renuncia_383", "idPersona": "ID-07700616", "idPartidoPolitico": "2173", "fechaRenuncia": 2007}
{"idRenuncia": "renuncia_384", "idPersona": "ID-06761932", "idPartidoPolitico": "2845", "fechaRenuncia": 2010}
{"idRenuncia": "renuncia_385", "idPersona": "ID-07958198", "idPartidoPolitico": "2883", "fechaRenuncia": 2018}
{"idRenuncia": "renuncia_386", "idPersona": "ID-07958198", "idPartidoPolitico": "5", "fechaRenuncia": 2014}
{"idRenuncia": "renuncia_387", "idPersona": "ID-07827187", "idPartidoPolitico": "3030", "fechaRenuncia": 2015}
{"idRenuncia": "renuncia_388", "idPersona": "ID-07827187", "idPartidoPolitico": "2962", "fechaRenuncia": 2006}
{"idRenuncia": "renuncia_389", "idPersona": "ID-06652770", "idPartidoPolitico": "2845", "fechaRenuncia": 2010}
{"idRenuncia": "renuncia_390", "idPersona": "ID-40671343", "idPartidoPolitico": "2845", "fechaRenuncia": 2017}
{"idRenuncia": "renuncia_391", "idPersona": "ID-31617680", "idPartidoPolitico": "179", "fechaRenuncia": 2010}
{"idRenuncia": "renuncia_392", "idPersona": "ID-10770288", "idPartidoPolitico": "2893", "fechaRenuncia": 2006}
{"idRenuncia": "renuncia_393", "idPersona": "ID-06263639", "idPartidoPolitico": "2845", "fechaRenuncia": 2017}
{"idRenuncia": "renuncia_394", "idPersona": "ID-01208105", "idPartidoPolitico": "2173", "fechaRenuncia": 2020}
{"idRenuncia": "renuncia_395", "idPersona": "ID-01208105", "idPartidoPolitico": "2845", "fechaRenuncia": 2013}
{"idRenuncia": "renuncia_396", "idPersona": "ID-40139245", "idPartidoPolitico": "2873", "fechaRenuncia": 2010}
{"idRenuncia": "renuncia_397", "idPersona": "ID-22518356", "idPartidoPolitico": "14", "fechaRenuncia": 2006}
{"idRenuncia": "renuncia_398", "idPersona": "ID-22518356", "idPartidoPolitico": "2910", "fechaRenuncia": 2014}
{"idRenuncia": "renuncia_399", "idPersona": "ID-40118808", "idPartidoPolitico": "3101", "fechaRenuncia": 2011}
{"idRenuncia": "renuncia_400", "idPersona": "ID-04749053", "idPartidoPolitico": "2996", "fechaRenuncia": 2007}
{"idRenuncia": "renuncia_401", "idPersona": "ID-02643304", "idPartidoPolitico": "179", "fechaRenuncia": 2014}
{"idRenuncia": "renuncia_402", "idPersona": "ID-02643304", "idPartidoPolitico": "14", "fechaRenuncia": 2010}
{"idRenuncia": "renuncia_403", "idPersona": "ID-44643881", "idPartidoPolitico": "3102", "fechaRenuncia": 2011}
{"idRenuncia": "renuncia_404", "idPersona": "ID-44675960", "idPartidoPolitico": "5", "fechaRenuncia": 2020}
{"idRenuncia": "renuncia_405", "idPersona": "ID-41989389", "idPartidoPolitico": "3020", "fechaRenuncia": 2020}
{"idRenuncia": "renuncia_406", "idPersona": "ID-00819168", "idPartidoPolitico": "2962", "fechaRenuncia": 2006}
{"idRenuncia": "renuncia_407", "idPersona": "ID-42169238", "idPartidoPolitico": "4", "fechaRenuncia": 2010}
{"idRenuncia": "renuncia_408", "idPersona": "ID-00478899", "idPartidoPolitico": "2873", "fechaRenuncia": 2010}
{"idRenuncia": "renuncia_409", "idPersona": "ID-10280036", "idPartidoPolitico": "4", "fechaRenuncia": 2019}
{"idRenuncia": "renuncia_410", "idPersona": "ID-10280036", "idPartidoPolitico": "3104", "fechaRenuncia": 2017}
{"idRenuncia": "renuncia_411", "idPersona": "ID-07896623", "idPartidoPolitico": "2160", "fechaRenuncia": 2014}
{"idRenuncia": "renuncia_412", "idPersona": "ID-07986196", "idPartidoPolitico": "2910", "fechaRenuncia": 2015}
{"idRenuncia": "renuncia_413", "idPersona": "ID-07986196", "idPartidoPolitico": "1366", "fechaRenuncia": 2011}
{"idRenuncia": "renuncia_414", "idPersona": "ID-06849217", "idPartidoPolitico": "47", "fechaRenuncia": 2015}
{"idRenuncia": "renuncia_415", "idPersona": "ID-06849217", "idPartidoPolitico": "2845", "fechaRenuncia": 2007}
{"idRenuncia": "renuncia_416", "idPersona": "ID-19669215", "idPartidoPolitico": "3022", "fechaRenuncia": 2011}
{"idRenuncia": "renuncia_417", "idPersona": "ID-09302945", "idPartidoPolitico": "3107", "fechaRenuncia": 2010}
{"idRenuncia": "renuncia_418", "idPersona": "ID-09302945", "idPartidoPolitico": "3108", "fechaRenuncia": 2007}
{"idRenuncia": "renuncia_419", "idPersona": "ID-07535593", "idPartidoPolitico": "179", "fechaRenuncia": 2013}
{"idRenuncia": "renuncia_420", "idPersona": "ID-32817479", "idPartidoPolitico": "2873", "fechaRenuncia": 2013}
{"idRenuncia": "renuncia_421", "idPersona": "ID-40679566", "idPartidoPolitico": "2965", "fechaRenuncia": 2017}
{"idRenuncia": "renuncia_422", "idPersona": "ID-24294050", "idPartidoPolitico": "2855", "fechaRenuncia": 2010}
{"idRenuncia": "renuncia_423", "idPersona": "ID-22424381", "idPartidoPolitico": "5", "fechaRenuncia": 2014}
{"idRenuncia": "renuncia_424", "idPersona": "ID-17897623", "idPartidoPolitico": "2842", "fechaRenuncia": 2011}
{"idRenuncia": "renuncia_425", "idPersona": "ID-18117360", "idPartidoPolitico": "2873", "fechaRenuncia": 2014}
{"idRenuncia": "renuncia_426", "idPersona": "ID-16415839", "idPartidoPolitico": "15", "fechaRenuncia": 2019}
{"idRenuncia": "renuncia_427", "idPersona": "ID-09302945", "idPartidoPolitico": "3107", "fechaRenuncia": 2010}
{"idRenuncia": "renuncia_428", "idPersona": "ID-09302945", "idPartidoPolitico": "3108", "fechaRenuncia": 2007}
{"idRenuncia": "renuncia_429", "idPersona": "ID-09535883", "idPartidoPolitico": "3022", "fechaRenuncia": 2011}
{"idRenuncia": "renuncia_430", "idPersona": "ID-00480715", "idPartidoPolitico": "1257", "fechaRenuncia": 2013}
{"idRenuncia": "renuncia_431", "idPersona": "ID-00480715", "idPartidoPolitico": "3113", "fechaRenuncia": 2007}
{"idRenuncia": "renuncia_432", "idPersona": "ID-10288238", "idPartidoPolitico": "3022", "fechaRenuncia": 2011}
{"idRenuncia": "renuncia_433", "idPersona": "ID-21407774", "idPartidoPolitico": "2845", "fechaRenuncia": 2017}
{"idRenuncia": "renuncia_434", "idPersona": "ID-09228683", "idPartidoPolitico": "3114", "fechaRenuncia": 2015}
{"idRenuncia": "renuncia_435", "idPersona": "ID-41242141", "idPartidoPolitico": "179", "fechaRenuncia": 2017}
{"idRenuncia": "renuncia_436", "idPersona": "ID-41242141", "idPartidoPolitico": "2840", "fechaRenuncia": 2019}
{"idRenuncia": "renuncia_437", "idPersona": "ID-10390651", "idPartidoPolitico": "2845", "fechaRenuncia": 2017}
{"idRenuncia": "renuncia_438", "idPersona": "ID-10390651", "idPartidoPolitico": "3108", "fechaRenuncia": 2007}
{"idRenuncia": "renuncia_439", "idPersona": "ID-08380530", "idPartidoPolitico": "179", "fechaRenuncia": 2015}
{"idRenuncia": "renuncia_440", "idPersona": "ID-40555947", "idPartidoPolitico": "179", "fechaRenuncia": 2015}
{"idRenuncia": "renuncia_441", "idPersona": "ID-40555947", "idPartidoPolitico": "1257", "fechaRenuncia": 2017}
{"idRenuncia": "renuncia_442", "idPersona": "ID-25456272", "idPartidoPolitico": "179", "fechaRenuncia": 2014}
{"idRenuncia": "renuncia_443", "idPersona": "ID-19669526", "idPartidoPolitico": "3022", "fechaRenuncia": 2011}
{"idRenuncia": "renuncia_444", "idPersona": "ID-42440839", "idPartidoPolitico": "2873", "fechaRenuncia": 2010}
{"idRenuncia": "renuncia_445", "idPersona": "ID-05231324", "idPartidoPolitico": "14", "fechaRenuncia": 2006}
{"idRenuncia": "renuncia_446", "idPersona": "ID-05231324", "idPartidoPolitico": "4", "fechaRenuncia": 2004}
{"idRenuncia": "renuncia_447", "idPersona": "ID-02607200", "idPartidoPolitico": "4", "fechaRenuncia": 2018}
{"idRenuncia": "renuncia_448", "idPersona": "ID-01077197", "idPartidoPolitico": "179", "fechaRenuncia": 2010}
{"idRenuncia": "renuncia_449", "idPersona": "ID-02833565", "idPartidoPolitico": "3116", "fechaRenuncia": 2011}
{"idRenuncia": "renuncia_450", "idPersona": "ID-40415167", "idPartidoPolitico": "3117", "fechaRenuncia": 2017}
{"idRenuncia": "renuncia_451", "idPersona": "ID-32403782", "idPartidoPolitico": "2910", "fechaRenuncia": 2015}
{"idRenuncia": "renuncia_452", "idPersona": "ID-32403782", "idPartidoPolitico": "1257", "fechaRenuncia": 2017}
{"idRenuncia": "renuncia_453", "idPersona": "ID-29423212", "idPartidoPolitico": "5", "fechaRenuncia": 2018}
{"idRenuncia": "renuncia_454", "idPersona": "ID-29423212", "idPartidoPolitico": "3119", "fechaRenuncia": 2015}
{"idRenuncia": "renuncia_455", "idPersona": "ID-44828928", "idPartidoPolitico": "2873", "fechaRenuncia": 2010}
{"idRenuncia": "renuncia_456", "idPersona": "ID-21257496", "idPartidoPolitico": "3108", "fechaRenuncia": 2010}
{"idRenuncia": "renuncia_457", "idPersona": "ID-40385563", "idPartidoPolitico": "3120", "fechaRenuncia": 2015}
{"idRenuncia": "renuncia_458", "idPersona": "ID-09326202", "idPartidoPolitico": "2845", "fechaRenuncia": 2011}
{"idRenuncia": "renuncia_459", "idPersona": "ID-21541464", "idPartidoPolitico": "179", "fechaRenuncia": 2016}
{"idRenuncia": "renuncia_460", "idPersona": "ID-23010131", "idPartidoPolitico": "2883", "fechaRenuncia": 2017}
{"idRenuncia": "renuncia_461", "idPersona": "ID-08245018", "idPartidoPolitico": "15", "fechaRenuncia": 2019}
{"idRenuncia": "renuncia_462", "idPersona": "ID-21289321", "idPartidoPolitico": "3122", "fechaRenuncia": 2011}
{"idRenuncia": "renuncia_463", "idPersona": "ID-21289321", "idPartidoPolitico": "3121", "fechaRenuncia": 2011}
{"idRenuncia": "renuncia_464", "idPersona": "ID-46847115", "idPartidoPolitico": "3123", "fechaRenuncia": 2017}
{"idRenuncia": "renuncia_465", "idPersona": "ID-17938789", "idPartidoPolitico": "3124", "fechaRenuncia": 2019}
{"idRenuncia": "renuncia_466", "idPersona": "ID-16452937", "idPartidoPolitico": "1257", "fechaRenuncia": 2007}
{"idRenuncia": "renuncia_467", "idPersona": "ID-25567150", "idPartidoPolitico": "2873", "fechaRenuncia": 2010}
{"idRenuncia": "renuncia_468", "idPersona": "ID-10806296", "idPartidoPolitico": "2842", "fechaRenuncia": 2014}
{"idRenuncia": "renuncia_469", "idPersona": "ID-41339983", "idPartidoPolitico": "3127", "fechaRenuncia": 2011}
{"idRenuncia": "renuncia_470", "idPersona": "ID-07613223", "idPartidoPolitico": "2842", "fechaRenuncia": 2015}
{"idRenuncia": "renuncia_471", "idPersona": "ID-10691398", "idPartidoPolitico": "2840", "fechaRenuncia": 2019}
{"idRenuncia": "renuncia_472", "idPersona": "ID-29703356", "idPartidoPolitico": "2873", "fechaRenuncia": 2018}
{"idRenuncia": "renuncia_473", "idPersona": "ID-06668764", "idPartidoPolitico": "2855", "fechaRenuncia": 2019}
{"idRenuncia": "renuncia_474", "idPersona": "ID-27427864", "idPartidoPolitico": "2845", "fechaRenuncia": 2017}
{"idRenuncia": "renuncia_475", "idPersona": "ID-32923902", "idPartidoPolitico": "179", "fechaRenuncia": 2019}
{"idRenuncia": "renuncia_476", "idPersona": "ID-06354697", "idPartidoPolitico": "179", "fechaRenuncia": 2015}
{"idRenuncia": "renuncia_477", "idPersona": "ID-80503059", "idPartidoPolitico": "3134", "fechaRenuncia": 2020}
{"idRenuncia": "renuncia_478", "idPersona": "ID-46517805", "idPartidoPolitico": "3135", "fechaRenuncia": 2015}
{"idRenuncia": "renuncia_479", "idPersona": "ID-42134579", "idPartidoPolitico": "4", "fechaRenuncia": 2019}
{"idRenuncia": "renuncia_480", "idPersona": "ID-27361499", "idPartidoPolitico": "2845", "fechaRenuncia": 2017}
{"idRenuncia": "renuncia_481", "idPersona": "ID-07193608", "idPartidoPolitico": "15", "fechaRenuncia": 2015}
{"idRenuncia": "renuncia_482", "idPersona": "ID-44649199", "idPartidoPolitico": "3040", "fechaRenuncia": 2015}
{"idRenuncia": "renuncia_483", "idPersona": "ID-42148701", "idPartidoPolitico": "3136", "fechaRenuncia": 2015}
{"idRenuncia": "renuncia_484", "idPersona": "ID-10211713", "idPartidoPolitico": "3136", "fechaRenuncia": 2015}
{"idRenuncia": "renuncia_485", "idPersona": "ID-40766298", "idPartidoPolitico": "3136", "fechaRenuncia": 2015}
{"idRenuncia": "renuncia_486", "idPersona": "ID-20051359", "idPartidoPolitico": "3137", "fechaRenuncia": 2015}
{"idRenuncia": "renuncia_487", "idPersona": "ID-21456255", "idPartidoPolitico": "179", "fechaRenuncia": 2019}
{"idRenuncia": "renuncia_488", "idPersona": "ID-22298600", "idPartidoPolitico": "2873", "fechaRenuncia": 2019}
{"idRenuncia": "renuncia_489", "idPersona": "ID-20036514", "idPartidoPolitico": "2942", "fechaRenuncia": 2007}
{"idRenuncia": "renuncia_490", "idPersona": "ID-10804834", "idPartidoPolitico": "1257", "fechaRenuncia": 2018}
{"idRenuncia": "renuncia_491", "idPersona": "ID-19180733", "idPartidoPolitico": "2996", "fechaRenuncia": 2007}
{"idRenuncia": "renuncia_492", "idPersona": "ID-16768077", "idPartidoPolitico": "2873", "fechaRenuncia": 2010}
{"idRenuncia": "renuncia_493", "idPersona": "ID-40119724", "idPartidoPolitico": "2883", "fechaRenuncia": 2019}
{"idRenuncia": "renuncia_494", "idPersona": "ID-40605824", "idPartidoPolitico": "2845", "fechaRenuncia": 2014}
{"idRenuncia": "renuncia_495", "idPersona": "ID-40605824", "idPartidoPolitico": "14", "fechaRenuncia": 2015}
{"idRenuncia": "renuncia_496", "idPersona": "ID-10131090", "idPartidoPolitico": "179", "fechaRenuncia": 2016}
{"idRenuncia": "renuncia_497", "idPersona": "ID-10416503", "idPartidoPolitico": "15", "fechaRenuncia": 2010}
{"idRenuncia": "renuncia_498", "idPersona": "ID-10416503", "idPartidoPolitico": "47", "fechaRenuncia": 2019}
{"idRenuncia": "renuncia_499", "idPersona": "ID-09747055", "idPartidoPolitico": "55", "fechaRenuncia": 2018}
{"idRenuncia": "renuncia_500", "idPersona": "ID-48240963", "idPartidoPolitico": "3139", "fechaRenuncia": 2019}
{"idRenuncia": "renuncia_501", "idPersona": "ID-07804014", "idPartidoPolitico": "2845", "fechaRenuncia": 2017}
{"idRenuncia": "renuncia_502", "idPersona": "ID-09336445", "idPartidoPolitico": "1257", "fechaRenuncia": 2017}
{"idRenuncia": "renuncia_503", "idPersona": "ID-07413665", "idPartidoPolitico": "179", "fechaRenuncia": 2015}
{"idRenuncia": "renuncia_504", "idPersona": "ID-09069367", "idPartidoPolitico": "3140", "fechaRenuncia": 2016}
{"idRenuncia": "renuncia_505", "idPersona": "ID-42225313", "idPartidoPolitico": "1264", "fechaRenuncia": 2019}
{"idRenuncia": "renuncia_506", "idPersona": "ID-42225313", "idPartidoPolitico": "2930", "fechaRenuncia": 2011}
{"idRenuncia": "renuncia_507", "idPersona": "ID-08615286", "idPartidoPolitico": "2845", "fechaRenuncia": 2017}
{"idRenuncia": "renuncia_508", "idPersona": "ID-21866823", "idPartidoPolitico": "2845", "fechaRenuncia": 2017}
{"idRenuncia": "renuncia_509", "idPersona": "ID-04413969", "idPartidoPolitico": "3141", "fechaRenuncia": 2011}
{"idRenuncia": "renuncia_510", "idPersona": "ID-20039322", "idPartidoPolitico": "3143", "fechaRenuncia": 2019}
{"idRenuncia": "renuncia_511", "idPersona": "ID-20039322", "idPartidoPolitico": "3144", "fechaRenuncia": 2008}
{"idRenuncia": "renuncia_512", "idPersona": "ID-01215490", "idPartidoPolitico": "3145", "fechaRenuncia": 2016}
{"idRenuncia": "renuncia_513", "idPersona": "ID-01088231", "idPartidoPolitico": "179", "fechaRenuncia": 2019}
{"idRenuncia": "renuncia_514", "idPersona": "ID-42915172", "idPartidoPolitico": "3146", "fechaRenuncia": 2007}
{"idRenuncia": "renuncia_515", "idPersona": "ID-41258762", "idPartidoPolitico": "2938", "fechaRenuncia": 2014}
{"idRenuncia": "renuncia_516", "idPersona": "ID-41258762", "idPartidoPolitico": "2845", "fechaRenuncia": 2003}
{"idRenuncia": "renuncia_517", "idPersona": "ID-00251132", "idPartidoPolitico": "179", "fechaRenuncia": 2010}
{"idRenuncia": "renuncia_518", "idPersona": "ID-00251132", "idPartidoPolitico": "2845", "fechaRenuncia": 2009}
{"idRenuncia": "renuncia_519", "idPersona": "ID-00250039", "idPartidoPolitico": "4", "fechaRenuncia": 2011}
{"idRenuncia": "renuncia_520", "idPersona": "ID-25739687", "idPartidoPolitico": "3149", "fechaRenuncia": 2011}
{"idRenuncia": "renuncia_521", "idPersona": "ID-25739687", "idPartidoPolitico": "2845", "fechaRenuncia": 2007}
{"idRenuncia": "renuncia_522", "idPersona": "ID-08769352", "idPartidoPolitico": "179", "fechaRenuncia": 2017}
{"idRenuncia": "renuncia_523", "idPersona": "ID-25569531", "idPartidoPolitico": "47", "fechaRenuncia": 2014}
{"idRenuncia": "renuncia_524", "idPersona": "ID-00062767", "idPartidoPolitico": "179", "fechaRenuncia": 2015}
{"idRenuncia": "renuncia_525", "idPersona": "ID-07817028", "idPartidoPolitico": "2845", "fechaRenuncia": 2013}
{"idRenuncia": "renuncia_526", "idPersona": "ID-07817028", "idPartidoPolitico": "2845", "fechaRenuncia": 2011}
{"idRenuncia": "renuncia_527", "idPersona": "ID-08670745", "idPartidoPolitico": "179", "fechaRenuncia": 2019}
{"idRenuncia": "renuncia_528", "idPersona": "ID-09427911", "idPartidoPolitico": "15", "fechaRenuncia": 2019}
{"idRenuncia": "renuncia_529", "idPersona": "ID-41462018", "idPartidoPolitico": "15", "fechaRenuncia": 2013}
{"idRenuncia": "renuncia_530", "idPersona": "ID-41033671", "idPartidoPolitico": "2873", "fechaRenuncia": 2010}
{"idRenuncia": "renuncia_531", "idPersona": "ID-07746302", "idPartidoPolitico": "1257", "fechaRenuncia": 2012}
{"idRenuncia": "renuncia_532", "idPersona": "ID-07746302", "idPartidoPolitico": "179", "fechaRenuncia": 2014}
{"idRenuncia": "renuncia_533", "idPersona": "ID-21791176", "idPartidoPolitico": "2847", "fechaRenuncia": 2007}
{"idRenuncia": "renuncia_534", "idPersona": "ID-45549786", "idPartidoPolitico": "3151", "fechaRenuncia": 2012}
{"idRenuncia": "renuncia_535", "idPersona": "ID-01332358", "idPartidoPolitico": "1257", "fechaRenuncia": 2019}
{"idRenuncia": "renuncia_536", "idPersona": "ID-01332358", "idPartidoPolitico": "3014", "fechaRenuncia": 2014}
{"idRenuncia": "renuncia_537", "idPersona": "ID-33402862", "idPartidoPolitico": "2873", "fechaRenuncia": 2017}
{"idRenuncia": "renuncia_538", "idPersona": "ID-10766494", "idPartidoPolitico": "2845", "fechaRenuncia": 2013}
{"idRenuncia": "renuncia_539", "idPersona": "ID-44043256", "idPartidoPolitico": "3152", "fechaRenuncia": 2011}
{"idRenuncia": "renuncia_540", "idPersona": "ID-32951349", "idPartidoPolitico": "2845", "fechaRenuncia": 2017}
{"idRenuncia": "renuncia_541", "idPersona": "ID-29520242", "idPartidoPolitico": "1257", "fechaRenuncia": 2016}
{"idRenuncia": "renuncia_542", "idPersona": "ID-29520242", "idPartidoPolitico": "3154", "fechaRenuncia": 2015}
{"idRenuncia": "renuncia_543", "idPersona": "ID-29732713", "idPartidoPolitico": "179", "fechaRenuncia": 2014}
{"idRenuncia": "renuncia_544", "idPersona": "ID-10154264", "idPartidoPolitico": "3091", "fechaRenuncia": 2017}
{"idRenuncia": "renuncia_545", "idPersona": "ID-16649432", "idPartidoPolitico": "14", "fechaRenuncia": 2018}
{"idRenuncia": "renuncia_546", "idPersona": "ID-40071472", "idPartidoPolitico": "3157", "fechaRenuncia": 2011}
{"idRenuncia": "renuncia_547", "idPersona": "ID-41532365", "idPartidoPolitico": "3159", "fechaRenuncia": 2020}
{"idRenuncia": "renuncia_548", "idPersona": "ID-41532365", "idPartidoPolitico": "2160", "fechaRenuncia": 2013}
{"idRenuncia": "renuncia_549", "idPersona": "ID-26686511", "idPartidoPolitico": "2731", "fechaRenuncia": 2019}
{"idRenuncia": "renuncia_550", "idPersona": "ID-21569935", "idPartidoPolitico": "1366", "fechaRenuncia": 2017}
{"idRenuncia": "renuncia_551", "idPersona": "ID-22076365", "idPartidoPolitico": "1366", "fechaRenuncia": 2017}
{"idRenuncia": "renuncia_552", "idPersona": "ID-42154670", "idPartidoPolitico": "3161", "fechaRenuncia": 2019}
{"idRenuncia": "renuncia_553", "idPersona": "ID-07246887", "idPartidoPolitico": "22", "fechaRenuncia": 2016}
{"idRenuncia": "renuncia_554", "idPersona": "ID-07246887", "idPartidoPolitico": "2959", "fechaRenuncia": 2016}
{"idRenuncia": "renuncia_555", "idPersona": "ID-32778633", "idPartidoPolitico": "2873", "fechaRenuncia": 2017}
{"idRenuncia": "renuncia_556", "idPersona": "ID-44449099", "idPartidoPolitico": "14", "fechaRenuncia": 2019}
{"idRenuncia": "renuncia_557", "idPersona": "ID-44177054", "idPartidoPolitico": "2235", "fechaRenuncia": 2015}
{"idRenuncia": "renuncia_558", "idPersona": "ID-45517997", "idPartidoPolitico": "15", "fechaRenuncia": 2012}
{"idRenuncia": "renuncia_559", "idPersona": "ID-45517997", "idPartidoPolitico": "2958", "fechaRenuncia": 2017}
{"idRenuncia": "renuncia_560", "idPersona": "ID-09337130", "idPartidoPolitico": "2883", "fechaRenuncia": 2017}
{"idRenuncia": "renuncia_561", "idPersona": "ID-40057693", "idPartidoPolitico": "2883", "fechaRenuncia": 2018}
{"idRenuncia": "renuncia_562", "idPersona": "ID-10027962", "idPartidoPolitico": "179", "fechaRenuncia": 2016}
{"idRenuncia": "renuncia_563", "idPersona": "ID-29723036", "idPartidoPolitico": "3164", "fechaRenuncia": 2016}
{"idRenuncia": "renuncia_564", "idPersona": "ID-29723036", "idPartidoPolitico": "3165", "fechaRenuncia": 2011}
{"idRenuncia": "renuncia_565", "idPersona": "ID-21452639", "idPartidoPolitico": "3166", "fechaRenuncia": 2010}
{"idRenuncia": "renuncia_566", "idPersona": "ID-10354720", "idPartidoPolitico": "2845", "fechaRenuncia": 2017}
{"idRenuncia": "renuncia_567", "idPersona": "ID-10354720", "idPartidoPolitico": "3168", "fechaRenuncia": 2011}
{"idRenuncia": "renuncia_568", "idPersona": "ID-41593474", "idPartidoPolitico": "2958", "fechaRenuncia": 2009}
{"idRenuncia": "renuncia_569", "idPersona": "ID-23254057", "idPartidoPolitico": "3169", "fechaRenuncia": 2014}
{"idRenuncia": "renuncia_570", "idPersona": "ID-40816522", "idPartidoPolitico": "2845", "fechaRenuncia": 2015}
{"idRenuncia": "renuncia_571", "idPersona": "ID-44436212", "idPartidoPolitico": "1257", "fechaRenuncia": 2018}
{"idRenuncia": "renuncia_572", "idPersona": "ID-17896699", "idPartidoPolitico": "15", "fechaRenuncia": 2019}
{"idRenuncia": "renuncia_573", "idPersona": "ID-19326977", "idPartidoPolitico": "3171", "fechaRenuncia": 2015}
{"idRenuncia": "renuncia_574", "idPersona": "ID-16546420", "idPartidoPolitico": "2845", "fechaRenuncia": 2010}
{"idRenuncia": "renuncia_575", "idPersona": "ID-45476222", "idPartidoPolitico": "2883", "fechaRenuncia": 2019}
{"idRenuncia": "renuncia_576", "idPersona": "ID-42425239", "idPartidoPolitico": "15", "fechaRenuncia": 2019}
{"idRenuncia": "renuncia_577", "idPersona": "ID-08185259", "idPartidoPolitico": "3173", "fechaRenuncia": 2019}
{"idRenuncia": "renuncia_578", "idPersona": "ID-08185259", "idPartidoPolitico": "2942", "fechaRenuncia": 2007}
{"idRenuncia": "renuncia_579", "idPersona": "ID-42979278", "idPartidoPolitico": "2883", "fechaRenuncia": 2017}
{"idRenuncia": "renuncia_580", "idPersona": "ID-09677079", "idPartidoPolitico": "2938", "fechaRenuncia": 2015}
{"idRenuncia": "renuncia_581", "idPersona": "ID-09677079", "idPartidoPolitico": "2160", "fechaRenuncia": 2013}
{"idRenuncia": "renuncia_582", "idPersona": "ID-10342732", "idPartidoPolitico": "1264", "fechaRenuncia": 2019}
{"idRenuncia": "renuncia_583", "idPersona": "ID-09742191", "idPartidoPolitico": "3175", "fechaRenuncia": 2019}
{"idRenuncia": "renuncia_584", "idPersona": "ID-09742191", "idPartidoPolitico": "3174", "fechaRenuncia": 2017}
{"idRenuncia": "renuncia_585", "idPersona": "ID-41600061", "idPartidoPolitico": "179", "fechaRenuncia": 2016}
{"idRenuncia": "renuncia_586", "idPersona": "ID-19256480", "idPartidoPolitico": "2845", "fechaRenuncia": 2017}
{"idRenuncia": "renuncia_587", "idPersona": "ID-10417514", "idPartidoPolitico": "2845", "fechaRenuncia": 2017}
{"idRenuncia": "renuncia_588", "idPersona": "ID-15982424", "idPartidoPolitico": "22", "fechaRenuncia": 2017}
{"idRenuncia": "renuncia_589", "idPersona": "ID-40095619", "idPartidoPolitico": "15", "fechaRenuncia": 2017}
{"idRenuncia": "renuncia_590", "idPersona": "ID-04800042", "idPartidoPolitico": "2962", "fechaRenuncia": 2007}
{"idRenuncia": "renuncia_591", "idPersona": "ID-04800042", "idPartidoPolitico": "1257", "fechaRenuncia": 2019}
{"idRenuncia": "renuncia_592", "idPersona": "ID-00498870", "idPartidoPolitico": "2883", "fechaRenuncia": 2019}
{"idRenuncia": "renuncia_593", "idPersona": "ID-00498870", "idPartidoPolitico": "2160", "fechaRenuncia": 2015}
{"idRenuncia": "renuncia_594", "idPersona": "ID-04625296", "idPartidoPolitico": "2845", "fechaRenuncia": 2009}
{"idRenuncia": "renuncia_595", "idPersona": "ID-02844298", "idPartidoPolitico": "22", "fechaRenuncia": 2019}
{"idRenuncia": "renuncia_596", "idPersona": "ID-02812189", "idPartidoPolitico": "3182", "fechaRenuncia": 2011}
{"idRenuncia": "renuncia_597", "idPersona": "ID-02812189", "idPartidoPolitico": "4", "fechaRenuncia": 2006}
{"idRenuncia": "renuncia_598", "idPersona": "ID-40484474", "idPartidoPolitico": "1257", "fechaRenuncia": 2007}
{"idRenuncia": "renuncia_599", "idPersona": "ID-72221286", "idPartidoPolitico": "3183", "fechaRenuncia": 2018}
{"idRenuncia": "renuncia_600", "idPersona": "ID-43415497", "idPartidoPolitico": "3184", "fechaRenuncia": 2006}
{"idRenuncia": "renuncia_601", "idPersona": "ID-00794984", "idPartidoPolitico": "2873", "fechaRenuncia": 2010}
{"idRenuncia": "renuncia_602", "idPersona": "ID-33588606", "idPartidoPolitico": "179", "fechaRenuncia": 2015}
{"idRenuncia": "renuncia_603", "idPersona": "ID-33588606", "idPartidoPolitico": "179", "fechaRenuncia": 2015}
{"idRenuncia": "renuncia_604", "idPersona": "ID-32905775", "idPartidoPolitico": "179", "fechaRenuncia": 2017}
{"idRenuncia": "renuncia_605", "idPersona": "ID-23977149", "idPartidoPolitico": "4", "fechaRenuncia": 2013}
{"idRenuncia": "renuncia_606", "idPersona": "ID-23977149", "idPartidoPolitico": "3187", "fechaRenuncia": 2015}
{"idRenuncia": "renuncia_607", "idPersona": "ID-25303433", "idPartidoPolitico": "3188", "fechaRenuncia": 2014}
{"idRenuncia": "renuncia_608", "idPersona": "ID-20041467", "idPartidoPolitico": "14", "fechaRenuncia": 2009}
{"idRenuncia": "renuncia_609", "idPersona": "ID-07483116", "idPartidoPolitico": "2842", "fechaRenuncia": 2016}
{"idRenuncia": "renuncia_610", "idPersona": "ID-07964629", "idPartidoPolitico": "2845", "fechaRenuncia": 2007}
{"idRenuncia": "renuncia_611", "idPersona": "ID-06812826", "idPartidoPolitico": "2842", "fechaRenuncia": 2010}
{"idRenuncia": "renuncia_612", "idPersona": "ID-41266872", "idPartidoPolitico": "15", "fechaRenuncia": 2010}
{"idRenuncia": "renuncia_613", "idPersona": "ID-01157063", "idPartidoPolitico": "2949", "fechaRenuncia": 2017}
{"idRenuncia": "renuncia_614", "idPersona": "ID-00239996", "idPartidoPolitico": "22", "fechaRenuncia": 2017}
{"idRenuncia": "renuncia_615", "idPersona": "ID-25420066", "idPartidoPolitico": "3029", "fechaRenuncia": 2010}
{"idRenuncia": "renuncia_616", "idPersona": "ID-07536090", "idPartidoPolitico": "1366", "fechaRenuncia": 2018}
{"idRenuncia": "renuncia_617", "idPersona": "ID-08330968", "idPartidoPolitico": "2959", "fechaRenuncia": 2016}
{"idRenuncia": "renuncia_618", "idPersona": "ID-08330968", "idPartidoPolitico": "2960", "fechaRenuncia": 2011}
{"idRenuncia": "renuncia_619", "idPersona": "ID-40157436", "idPartidoPolitico": "179", "fechaRenuncia": 2010}
{"idRenuncia": "renuncia_620", "idPersona": "ID-32987542", "idPartidoPolitico": "2845", "fechaRenuncia": 2017}
{"idRenuncia": "renuncia_621", "idPersona": "ID-32922090", "idPartidoPolitico": "2845", "fechaRenuncia": 2017}
{"idRenuncia": "renuncia_622", "idPersona": "ID-44527658", "idPartidoPolitico": "1257", "fechaRenuncia": 2016}
{"idRenuncia": "renuncia_623", "idPersona": "ID-24001571", "idPartidoPolitico": "3190", "fechaRenuncia": 2020}
{"idRenuncia": "renuncia_624", "idPersona": "ID-40022704", "idPartidoPolitico": "3042", "fechaRenuncia": 2020}
{"idRenuncia": "renuncia_625", "idPersona": "ID-40022704", "idPartidoPolitico": "3042", "fechaRenuncia": 2011}
{"idRenuncia": "renuncia_626", "idPersona": "ID-23916090", "idPartidoPolitico": "2930", "fechaRenuncia": 2007}
{"idRenuncia": "renuncia_627", "idPersona": "ID-23916090", "idPartidoPolitico": "179", "fechaRenuncia": 2010}
{"idRenuncia": "renuncia_628", "idPersona": "ID-24718051", "idPartidoPolitico": "179", "fechaRenuncia": 2016}
{"idRenuncia": "renuncia_629", "idPersona": "ID-23811792", "idPartidoPolitico": "179", "fechaRenuncia": 2014}
{"idRenuncia": "renuncia_630", "idPersona": "ID-23690913", "idPartidoPolitico": "179", "fechaRenuncia": 2014}
{"idRenuncia": "renuncia_631", "idPersona": "ID-15967007", "idPartidoPolitico": "2845", "fechaRenuncia": 2014}
{"idRenuncia": "renuncia_632", "idPersona": "ID-09533745", "idPartidoPolitico": "2873", "fechaRenuncia": 2019}
{"idRenuncia": "renuncia_633", "idPersona": "ID-10232050", "idPartidoPolitico": "4", "fechaRenuncia": 2019}
{"idRenuncia": "renuncia_634", "idPersona": "ID-44111396", "idPartidoPolitico": "179", "fechaRenuncia": 2014}
{"idRenuncia": "renuncia_635", "idPersona": "ID-18196575", "idPartidoPolitico": "1264", "fechaRenuncia": 2019}
{"idRenuncia": "renuncia_636", "idPersona": "ID-24884927", "idPartidoPolitico": "2840", "fechaRenuncia": 2019}
{"idRenuncia": "renuncia_637", "idPersona": "ID-24884927", "idPartidoPolitico": "2845", "fechaRenuncia": 2012}
{"idRenuncia": "renuncia_638", "idPersona": "ID-06873355", "idPartidoPolitico": "3042", "fechaRenuncia": 2020}
{"idRenuncia": "renuncia_639", "idPersona": "ID-06873355", "idPartidoPolitico": "3042", "fechaRenuncia": 2011}
{"idRenuncia": "renuncia_640", "idPersona": "ID-47415435", "idPartidoPolitico": "2959", "fechaRenuncia": 2016}
{"idRenuncia": "renuncia_641", "idPersona": "ID-42789879", "idPartidoPolitico": "15", "fechaRenuncia": 2019}
{"idRenuncia": "renuncia_642", "idPersona": "ID-08621131", "idPartidoPolitico": "15", "fechaRenuncia": 2015}
{"idRenuncia": "renuncia_643", "idPersona": "ID-40914719", "idPartidoPolitico": "179", "fechaRenuncia": 2017}
{"idRenuncia": "renuncia_644", "idPersona": "ID-40226037", "idPartidoPolitico": "2873", "fechaRenuncia": 2005}
{"idRenuncia": "renuncia_645", "idPersona": "ID-06804057", "idPartidoPolitico": "2873", "fechaRenuncia": 2015}
{"idRenuncia": "renuncia_646", "idPersona": "ID-21561335", "idPartidoPolitico": "3198", "fechaRenuncia": 2019}
{"idRenuncia": "renuncia_647", "idPersona": "ID-05329378", "idPartidoPolitico": "2885", "fechaRenuncia": 2017}
{"idRenuncia": "renuncia_648", "idPersona": "ID-05329378", "idPartidoPolitico": "3199", "fechaRenuncia": 2020}
{"idRenuncia": "renuncia_649", "idPersona": "ID-42297560", "idPartidoPolitico": "1257", "fechaRenuncia": 2007}
{"idRenuncia": "renuncia_650", "idPersona": "ID-04805535", "idPartidoPolitico": "179", "fechaRenuncia": 2016}
{"idRenuncia": "renuncia_651", "idPersona": "ID-04417642", "idPartidoPolitico": "2873", "fechaRenuncia": 2015}
{"idRenuncia": "renuncia_652", "idPersona": "ID-03888720", "idPartidoPolitico": "179", "fechaRenuncia": 2010}
{"idRenuncia": "renuncia_653", "idPersona": "ID-01545223", "idPartidoPolitico": "1257", "fechaRenuncia": 2019}
{"idRenuncia": "renuncia_654", "idPersona": "ID-42109996", "idPartidoPolitico": "3028", "fechaRenuncia": 2020}
{"idRenuncia": "renuncia_655", "idPersona": "ID-01061401", "idPartidoPolitico": "179", "fechaRenuncia": 2017}
{"idRenuncia": "renuncia_656", "idPersona": "ID-01061401", "idPartidoPolitico": "3202", "fechaRenuncia": 2017}
{"idRenuncia": "renuncia_657", "idPersona": "ID-00974279", "idPartidoPolitico": "15", "fechaRenuncia": 2014}
{"idRenuncia": "renuncia_658", "idPersona": "ID-00207805", "idPartidoPolitico": "2845", "fechaRenuncia": 2017}
{"idRenuncia": "renuncia_659", "idPersona": "ID-25637163", "idPartidoPolitico": "2845", "fechaRenuncia": 2013}
{"idRenuncia": "renuncia_660", "idPersona": "ID-25637163", "idPartidoPolitico": "2942", "fechaRenuncia": 2007}
{"idRenuncia": "renuncia_661", "idPersona": "ID-25436931", "idPartidoPolitico": "2845", "fechaRenuncia": 2017}
{"idRenuncia": "renuncia_662", "idPersona": "ID-10379271", "idPartidoPolitico": "15", "fechaRenuncia": 2019}
{"idRenuncia": "renuncia_663", "idPersona": "ID-19813153", "idPartidoPolitico": "2889", "fechaRenuncia": 2007}
{"idRenuncia": "renuncia_664", "idPersona": "ID-09381066", "idPartidoPolitico": "3175", "fechaRenuncia": 2016}
{"idRenuncia": "renuncia_665", "idPersona": "ID-40353800", "idPartidoPolitico": "15", "fechaRenuncia": 2019}
{"idRenuncia": "renuncia_666", "idPersona": "ID-40276898", "idPartidoPolitico": "3175", "fechaRenuncia": 2020}
{"idRenuncia": "renuncia_667", "idPersona": "ID-40276898", "idPartidoPolitico": "3205", "fechaRenuncia": 2013}
{"idRenuncia": "renuncia_668", "idPersona": "ID-08514870", "idPartidoPolitico": "2873", "fechaRenuncia": 2011}
{"idRenuncia": "renuncia_669", "idPersona": "ID-41924282", "idPartidoPolitico": "3206", "fechaRenuncia": 2019}
{"idRenuncia": "renuncia_670", "idPersona": "ID-42213827", "idPartidoPolitico": "4", "fechaRenuncia": 2019}
{"idRenuncia": "renuncia_671", "idPersona": "ID-06246968", "idPartidoPolitico": "15", "fechaRenuncia": 2011}
{"idRenuncia": "renuncia_672", "idPersona": "ID-06246968", "idPartidoPolitico": "3146", "fechaRenuncia": 2006}
{"idRenuncia": "renuncia_673", "idPersona": "ID-23269483", "idPartidoPolitico": "2191", "fechaRenuncia": 2019}
{"idRenuncia": "renuncia_674", "idPersona": "ID-23269483", "idPartidoPolitico": "179", "fechaRenuncia": 2015}
{"idRenuncia": "renuncia_675", "idPersona": "ID-21512419", "idPartidoPolitico": "1257", "fechaRenuncia": 2014}
{"idRenuncia": "renuncia_676", "idPersona": "ID-46741086", "idPartidoPolitico": "2218", "fechaRenuncia": 2019}
{"idRenuncia": "renuncia_677", "idPersona": "ID-16540611", "idPartidoPolitico": "179", "fechaRenuncia": 2017}
{"idRenuncia": "renuncia_678", "idPersona": "ID-16540611", "idPartidoPolitico": "1257", "fechaRenuncia": 2014}
{"idRenuncia": "renuncia_679", "idPersona": "ID-09381066", "idPartidoPolitico": "3175", "fechaRenuncia": 2016}
{"idRenuncia": "renuncia_680", "idPersona": "ID-09488177", "idPartidoPolitico": "2845", "fechaRenuncia": 2015}
{"idRenuncia": "renuncia_681", "idPersona": "ID-10731887", "idPartidoPolitico": "15", "fechaRenuncia": 2019}
{"idRenuncia": "renuncia_682", "idPersona": "ID-10731887", "idPartidoPolitico": "2845", "fechaRenuncia": 2015}
{"idRenuncia": "renuncia_683", "idPersona": "ID-07609374", "idPartidoPolitico": "15", "fechaRenuncia": 2010}
{"idRenuncia": "renuncia_684", "idPersona": "ID-08620378", "idPartidoPolitico": "3175", "fechaRenuncia": 2018}
{"idRenuncia": "renuncia_685", "idPersona": "ID-08620378", "idPartidoPolitico": "1257", "fechaRenuncia": 2017}
{"idRenuncia": "renuncia_686", "idPersona": "ID-19873483", "idPartidoPolitico": "2218", "fechaRenuncia": 2020}
{"idRenuncia": "renuncia_687", "idPersona": "ID-19873483", "idPartidoPolitico": "179", "fechaRenuncia": 2016}
{"idRenuncia": "renuncia_688", "idPersona": "ID-08683132", "idPartidoPolitico": "2893", "fechaRenuncia": 2012}
{"idRenuncia": "renuncia_689", "idPersona": "ID-10539970", "idPartidoPolitico": "1257", "fechaRenuncia": 2019}
{"idRenuncia": "renuncia_690", "idPersona": "ID-10539970", "idPartidoPolitico": "1257", "fechaRenuncia": 2007}
{"idRenuncia": "renuncia_691", "idPersona": "ID-25485737", "idPartidoPolitico": "2855", "fechaRenuncia": 2010}
{"idRenuncia": "renuncia_692", "idPersona": "ID-04817948", "idPartidoPolitico": "179", "fechaRenuncia": 2019}
{"idRenuncia": "renuncia_693", "idPersona": "ID-41075095", "idPartidoPolitico": "15", "fechaRenuncia": 2018}
{"idRenuncia": "renuncia_694", "idPersona": "ID-41075095", "idPartidoPolitico": "179", "fechaRenuncia": 2013}
{"idRenuncia": "renuncia_695", "idPersona": "ID-09708694", "idPartidoPolitico": "14", "fechaRenuncia": 2019}
{"idRenuncia": "renuncia_696", "idPersona": "ID-01286434", "idPartidoPolitico": "47", "fechaRenuncia": 2017}
{"idRenuncia": "renuncia_697", "idPersona": "ID-25559609", "idPartidoPolitico": "2873", "fechaRenuncia": 2017}
{"idRenuncia": "renuncia_698", "idPersona": "ID-21493971", "idPartidoPolitico": "179", "fechaRenuncia": 2020}
{"idRenuncia": "renuncia_699", "idPersona": "ID-08274605", "idPartidoPolitico": "15", "fechaRenuncia": 2015}
{"idRenuncia": "renuncia_700", "idPersona": "ID-23959510", "idPartidoPolitico": "3106", "fechaRenuncia": 2020}
{"idRenuncia": "renuncia_701", "idPersona": "ID-17817706", "idPartidoPolitico": "3220", "fechaRenuncia": 2012}
{"idRenuncia": "renuncia_702", "idPersona": "ID-10007617", "idPartidoPolitico": "3222", "fechaRenuncia": 2005}
{"idRenuncia": "renuncia_703", "idPersona": "ID-47667465", "idPartidoPolitico": "15", "fechaRenuncia": 2019}
{"idRenuncia": "renuncia_704", "idPersona": "ID-09838749", "idPartidoPolitico": "2646", "fechaRenuncia": 2019}
{"idRenuncia": "renuncia_705", "idPersona": "ID-07724070", "idPartidoPolitico": "2962", "fechaRenuncia": 2009}
{"idRenuncia": "renuncia_706", "idPersona": "ID-07271177", "idPartidoPolitico": "55", "fechaRenuncia": 2019}
{"idRenuncia": "renuncia_707", "idPersona": "ID-07271177", "idPartidoPolitico": "1264", "fechaRenuncia": 2013}
{"idRenuncia": "renuncia_708", "idPersona": "ID-09465777", "idPartidoPolitico": "2845", "fechaRenuncia": 2011}
{"idRenuncia": "renuncia_709", "idPersona": "ID-08408945", "idPartidoPolitico": "15", "fechaRenuncia": 2014}
{"idRenuncia": "renuncia_710", "idPersona": "ID-06111676", "idPartidoPolitico": "2893", "fechaRenuncia": 2012}
{"idRenuncia": "renuncia_711", "idPersona": "ID-05341313", "idPartidoPolitico": "15", "fechaRenuncia": 2018}
