﻿r1,g0/0,r2,g0/0
r1,g0/1,r3,g0/0
r2,g0/0,r3,g0/0
r2,g0/1,r3,g0/1
r3,g0/1,r2,g0/1
r3,g0/11,r2,g0/1
r3,g1/0,r4,g1/0
r2,g1/0,r5,g1/0
r3,g1/0,r4,g1/0
r4,g0/1,r5,g0/1
r6,g0/0,r4,g0/0
r6,g0/1,r5,g0/0
r6,g20/1,r5,g0/0
r7,g0/1,r88,g0/0
