"filename", "language", "JSON with Comments", "JSON", "Docker", "CSS", "YAML", "TypeScript", "HTML", "Markdown", "comment", "blank", "total"
"c:\Users\maikr\Desktop\PP\MSD\msd-dashboard\.gitlab-ci.yml", "YAML", 0, 0, 0, 0, 12, 0, 0, 0, 0, 2, 14
"c:\Users\maikr\Desktop\PP\MSD\msd-dashboard\Dockerfile", "Docker", 0, 0, 10, 0, 0, 0, 0, 0, 0, 10, 20
"c:\Users\maikr\Desktop\PP\MSD\msd-dashboard\README.md", "Markdown", 0, 0, 0, 0, 0, 0, 0, 69, 0, 31, 100
"c:\Users\maikr\Desktop\PP\MSD\msd-dashboard\angular.json", "JSON", 0, 111, 0, 0, 0, 0, 0, 0, 0, 1, 112
"c:\Users\maikr\Desktop\PP\MSD\msd-dashboard\docker-compose.yaml", "YAML", 0, 0, 0, 0, 13, 0, 0, 0, 0, 1, 14
"c:\Users\maikr\Desktop\PP\MSD\msd-dashboard\package-lock.json", "JSON", 0, 13289, 0, 0, 0, 0, 0, 0, 0, 1, 13290
"c:\Users\maikr\Desktop\PP\MSD\msd-dashboard\package.json", "JSON", 0, 45, 0, 0, 0, 0, 0, 0, 0, 1, 46
"c:\Users\maikr\Desktop\PP\MSD\msd-dashboard\src\app\app-routing.module.ts", "TypeScript", 0, 0, 0, 0, 0, 17, 0, 0, 0, 2, 19
"c:\Users\maikr\Desktop\PP\MSD\msd-dashboard\src\app\app.component.css", "CSS", 0, 0, 0, 4, 0, 0, 0, 0, 0, 0, 4
"c:\Users\maikr\Desktop\PP\MSD\msd-dashboard\src\app\app.component.html", "HTML", 0, 0, 0, 0, 0, 0, 2, 0, 0, 0, 2
"c:\Users\maikr\Desktop\PP\MSD\msd-dashboard\src\app\app.component.ts", "TypeScript", 0, 0, 0, 0, 0, 38, 0, 0, 0, 5, 43
"c:\Users\maikr\Desktop\PP\MSD\msd-dashboard\src\app\app.module.ts", "TypeScript", 0, 0, 0, 0, 0, 55, 0, 0, 0, 3, 58
"c:\Users\maikr\Desktop\PP\MSD\msd-dashboard\src\app\controlpanel\controlpanel.component.css", "CSS", 0, 0, 0, 66, 0, 0, 0, 0, 4, 13, 83
"c:\Users\maikr\Desktop\PP\MSD\msd-dashboard\src\app\controlpanel\controlpanel.component.html", "HTML", 0, 0, 0, 0, 0, 0, 44, 0, 0, 2, 46
"c:\Users\maikr\Desktop\PP\MSD\msd-dashboard\src\app\controlpanel\controlpanel.component.ts", "TypeScript", 0, 0, 0, 0, 0, 57, 0, 0, 0, 9, 66
"c:\Users\maikr\Desktop\PP\MSD\msd-dashboard\src\app\controlpanel\gameshandler\game\game.component.css", "CSS", 0, 0, 0, 112, 0, 0, 0, 0, 0, 23, 135
"c:\Users\maikr\Desktop\PP\MSD\msd-dashboard\src\app\controlpanel\gameshandler\game\game.component.html", "HTML", 0, 0, 0, 0, 0, 0, 59, 0, 0, 3, 62
"c:\Users\maikr\Desktop\PP\MSD\msd-dashboard\src\app\controlpanel\gameshandler\game\game.component.ts", "TypeScript", 0, 0, 0, 0, 0, 65, 0, 0, 0, 13, 78
"c:\Users\maikr\Desktop\PP\MSD\msd-dashboard\src\app\controlpanel\gameshandler\gameshandler.component.css", "CSS", 0, 0, 0, 4, 0, 0, 0, 0, 0, 0, 4
"c:\Users\maikr\Desktop\PP\MSD\msd-dashboard\src\app\controlpanel\gameshandler\gameshandler.component.html", "HTML", 0, 0, 0, 0, 0, 0, 9, 0, 0, 0, 9
"c:\Users\maikr\Desktop\PP\MSD\msd-dashboard\src\app\controlpanel\gameshandler\gameshandler.component.ts", "TypeScript", 0, 0, 0, 0, 0, 44, 0, 0, 0, 7, 51
"c:\Users\maikr\Desktop\PP\MSD\msd-dashboard\src\app\games.service.ts", "TypeScript", 0, 0, 0, 0, 0, 49, 0, 0, 0, 8, 57
"c:\Users\maikr\Desktop\PP\MSD\msd-dashboard\src\app\header\header.component.css", "CSS", 0, 0, 0, 41, 0, 0, 0, 0, 0, 8, 49
"c:\Users\maikr\Desktop\PP\MSD\msd-dashboard\src\app\header\header.component.html", "HTML", 0, 0, 0, 0, 0, 0, 20, 0, 0, 0, 20
"c:\Users\maikr\Desktop\PP\MSD\msd-dashboard\src\app\header\header.component.ts", "TypeScript", 0, 0, 0, 0, 0, 8, 0, 0, 0, 3, 11
"c:\Users\maikr\Desktop\PP\MSD\msd-dashboard\src\app\map\map.component.css", "CSS", 0, 0, 0, 168, 0, 0, 0, 0, 0, 22, 190
"c:\Users\maikr\Desktop\PP\MSD\msd-dashboard\src\app\map\map.component.html", "HTML", 0, 0, 0, 0, 0, 0, 61, 0, 0, 3, 64
"c:\Users\maikr\Desktop\PP\MSD\msd-dashboard\src\app\map\map.component.ts", "TypeScript", 0, 0, 0, 0, 0, 290, 0, 0, 3, 30, 323
"c:\Users\maikr\Desktop\PP\MSD\msd-dashboard\src\app\map\planet\planet.component.css", "CSS", 0, 0, 0, 176, 0, 0, 0, 0, 1, 25, 202
"c:\Users\maikr\Desktop\PP\MSD\msd-dashboard\src\app\map\planet\planet.component.html", "HTML", 0, 0, 0, 0, 0, 0, 35, 0, 0, 0, 35
"c:\Users\maikr\Desktop\PP\MSD\msd-dashboard\src\app\map\planet\planet.component.ts", "TypeScript", 0, 0, 0, 0, 0, 176, 0, 0, 0, 20, 196
"c:\Users\maikr\Desktop\PP\MSD\msd-dashboard\src\app\map\player\player.component.css", "CSS", 0, 0, 0, 125, 0, 0, 0, 0, 0, 23, 148
"c:\Users\maikr\Desktop\PP\MSD\msd-dashboard\src\app\map\player\player.component.html", "HTML", 0, 0, 0, 0, 0, 0, 71, 0, 0, 8, 79
"c:\Users\maikr\Desktop\PP\MSD\msd-dashboard\src\app\map\player\player.component.ts", "TypeScript", 0, 0, 0, 0, 0, 101, 0, 0, 0, 11, 112
"c:\Users\maikr\Desktop\PP\MSD\msd-dashboard\src\app\map\robot\robot.component.css", "CSS", 0, 0, 0, 122, 0, 0, 0, 0, 0, 25, 147
"c:\Users\maikr\Desktop\PP\MSD\msd-dashboard\src\app\map\robot\robot.component.html", "HTML", 0, 0, 0, 0, 0, 0, 166, 0, 0, 2, 168
"c:\Users\maikr\Desktop\PP\MSD\msd-dashboard\src\app\map\robot\robot.component.ts", "TypeScript", 0, 0, 0, 0, 0, 238, 0, 0, 0, 19, 257
"c:\Users\maikr\Desktop\PP\MSD\msd-dashboard\src\app\map\settingsbar\settingsbar.component.css", "CSS", 0, 0, 0, 64, 0, 0, 0, 0, 0, 9, 73
"c:\Users\maikr\Desktop\PP\MSD\msd-dashboard\src\app\map\settingsbar\settingsbar.component.html", "HTML", 0, 0, 0, 0, 0, 0, 50, 0, 9, 7, 66
"c:\Users\maikr\Desktop\PP\MSD\msd-dashboard\src\app\map\settingsbar\settingsbar.component.ts", "TypeScript", 0, 0, 0, 0, 0, 37, 0, 0, 0, 9, 46
"c:\Users\maikr\Desktop\PP\MSD\msd-dashboard\src\app\map\sidebar\sidebar.component.css", "CSS", 0, 0, 0, 34, 0, 0, 0, 0, 0, 7, 41
"c:\Users\maikr\Desktop\PP\MSD\msd-dashboard\src\app\map\sidebar\sidebar.component.html", "HTML", 0, 0, 0, 0, 0, 0, 40, 0, 0, 2, 42
"c:\Users\maikr\Desktop\PP\MSD\msd-dashboard\src\app\map\sidebar\sidebar.component.ts", "TypeScript", 0, 0, 0, 0, 0, 13, 0, 0, 0, 4, 17
"c:\Users\maikr\Desktop\PP\MSD\msd-dashboard\src\app\money.service.ts", "TypeScript", 0, 0, 0, 0, 0, 32, 0, 0, 0, 8, 40
"c:\Users\maikr\Desktop\PP\MSD\msd-dashboard\src\app\planet.service.ts", "TypeScript", 0, 0, 0, 0, 0, 62, 0, 0, 0, 8, 70
"c:\Users\maikr\Desktop\PP\MSD\msd-dashboard\src\app\player.service.ts", "TypeScript", 0, 0, 0, 0, 0, 113, 0, 0, 0, 10, 123
"c:\Users\maikr\Desktop\PP\MSD\msd-dashboard\src\app\robot.service.ts", "TypeScript", 0, 0, 0, 0, 0, 153, 0, 0, 0, 8, 161
"c:\Users\maikr\Desktop\PP\MSD\msd-dashboard\src\app\scoreboard\gamelog.service.ts", "TypeScript", 0, 0, 0, 0, 0, 26, 0, 0, 0, 12, 38
"c:\Users\maikr\Desktop\PP\MSD\msd-dashboard\src\app\scoreboard\scoreboard.component.css", "CSS", 0, 0, 0, 77, 0, 0, 0, 0, 0, 11, 88
"c:\Users\maikr\Desktop\PP\MSD\msd-dashboard\src\app\scoreboard\scoreboard.component.html", "HTML", 0, 0, 0, 0, 0, 0, 122, 0, 4, 5, 131
"c:\Users\maikr\Desktop\PP\MSD\msd-dashboard\src\app\scoreboard\scoreboard.component.ts", "TypeScript", 0, 0, 0, 0, 0, 97, 0, 0, 0, 14, 111
"c:\Users\maikr\Desktop\PP\MSD\msd-dashboard\src\app\shared\chart\chart.component.css", "CSS", 0, 0, 0, 0, 0, 0, 0, 0, 0, 1, 1
"c:\Users\maikr\Desktop\PP\MSD\msd-dashboard\src\app\shared\chart\chart.component.html", "HTML", 0, 0, 0, 0, 0, 0, 1, 0, 0, 1, 2
"c:\Users\maikr\Desktop\PP\MSD\msd-dashboard\src\app\shared\chart\chart.component.ts", "TypeScript", 0, 0, 0, 0, 0, 30, 0, 0, 0, 5, 35
"c:\Users\maikr\Desktop\PP\MSD\msd-dashboard\src\app\shared\data.service.ts", "TypeScript", 0, 0, 0, 0, 0, 59, 0, 0, 0, 11, 70
"c:\Users\maikr\Desktop\PP\MSD\msd-dashboard\src\app\shared\shared.service.ts", "TypeScript", 0, 0, 0, 0, 0, 45, 0, 0, 0, 7, 52
"c:\Users\maikr\Desktop\PP\MSD\msd-dashboard\src\app\store\dashboard.actions.ts", "TypeScript", 0, 0, 0, 0, 0, 104, 0, 0, 0, 15, 119
"c:\Users\maikr\Desktop\PP\MSD\msd-dashboard\src\app\store\dashboard.effects.ts", "TypeScript", 0, 0, 0, 0, 0, 56, 0, 0, 0, 5, 61
"c:\Users\maikr\Desktop\PP\MSD\msd-dashboard\src\app\store\dashboard.reducer.ts", "TypeScript", 0, 0, 0, 0, 0, 63, 0, 0, 0, 5, 68
"c:\Users\maikr\Desktop\PP\MSD\msd-dashboard\src\app\store\dashboard.selectors.ts", "TypeScript", 0, 0, 0, 0, 0, 31, 0, 0, 0, 3, 34
"c:\Users\maikr\Desktop\PP\MSD\msd-dashboard\src\app\transaction-item-format.pipe.spec.ts", "TypeScript", 0, 0, 0, 0, 0, 7, 0, 0, 0, 2, 9
"c:\Users\maikr\Desktop\PP\MSD\msd-dashboard\src\app\transaction-item-format.pipe.ts", "TypeScript", 0, 0, 0, 0, 0, 14, 0, 0, 0, 4, 18
"c:\Users\maikr\Desktop\PP\MSD\msd-dashboard\src\index.html", "HTML", 0, 0, 0, 0, 0, 0, 13, 0, 0, 2, 15
"c:\Users\maikr\Desktop\PP\MSD\msd-dashboard\src\main.ts", "TypeScript", 0, 0, 0, 0, 0, 4, 0, 0, 0, 4, 8
"c:\Users\maikr\Desktop\PP\MSD\msd-dashboard\src\styles.css", "CSS", 0, 0, 0, 10, 0, 0, 0, 0, 2, 2, 14
"c:\Users\maikr\Desktop\PP\MSD\msd-dashboard\tsconfig.app.json", "JSON", 0, 13, 0, 0, 0, 0, 0, 0, 1, 1, 15
"c:\Users\maikr\Desktop\PP\MSD\msd-dashboard\tsconfig.json", "JSON with Comments", 25, 0, 0, 0, 0, 0, 0, 0, 0, 1, 26
"c:\Users\maikr\Desktop\PP\MSD\msd-dashboard\tsconfig.spec.json", "JSON", 0, 13, 0, 0, 0, 0, 0, 0, 1, 1, 15
"Total", "-", 25, 13471, 10, 1003, 25, 2084, 693, 69, 25, 518, 17923