{
    "31061": {
        "Channel": "Bat.ChaCtlComAval",
        "Object Type": "Measured value",
        "Name (SMA Speedwire)": "Control of battery charging via communication available",
        "Read Level": "",
        "Group": "Battery > Battery > Control charging via communication available",
        "Value Range / Unit / Set values": "1129: Yes (Yes)1130: No (No)",
        "Default value": "\u2012",
        "Step Size": "\u2012",
        "Write Level": "\u2012",
        "Grid Guard": "-",
        "SMA Modbus Register Adress": "31061",
        "Number of contiguous SMA Modbus Registers": "2",
        "SMA Modbus Data Type": "U32",
        "SMA Modbus Data Format": "TAGLIST",
        "Unit": "-"
    },
    "34669": {
        "Channel": "Bat.ChaCtlComAval",
        "Object Type": "Measured value",
        "Name (SMA Speedwire)": "Control of battery charging via communication available",
        "Read Level": "",
        "Group": "Battery > Battery > Control charging via communication available",
        "Value Range / Unit / Set values": "1129: Yes (Yes)1130: No (No)",
        "Default value": "\u2012",
        "Step Size": "\u2012",
        "Write Level": "\u2012",
        "Grid Guard": "-",
        "SMA Modbus Register Adress": "34669",
        "Number of contiguous SMA Modbus Registers": "2",
        "SMA Modbus Data Type": "U32",
        "SMA Modbus Data Format": "TAGLIST",
        "Unit": "-"
    },
    "30517": {
        "Channel": "Metering.DyWhOut",
        "Object Type": "Measured value",
        "Name (SMA Speedwire)": "Daily yield",
        "Read Level": "",
        "Group": "AC Side > Measured values > Daily yield",
        "Value Range / Unit / Set values": "-",
        "Default value": "\u2012",
        "Step Size": "1",
        "Write Level": "\u2012",
        "Grid Guard": "-",
        "SMA Modbus Register Adress": "30517",
        "Number of contiguous SMA Modbus Registers": "4",
        "SMA Modbus Data Type": "U64",
        "SMA Modbus Data Format": "FIX0",
        "Unit": "Wh"
    },
    "30535": {
        "Channel": "Metering.DyWhOut",
        "Object Type": "Measured value",
        "Name (SMA Speedwire)": "Daily yield",
        "Read Level": "",
        "Group": "AC Side > Measured values > Daily yield",
        "Value Range / Unit / Set values": "-",
        "Default value": "\u2012",
        "Step Size": "1",
        "Write Level": "\u2012",
        "Grid Guard": "-",
        "SMA Modbus Register Adress": "30535",
        "Number of contiguous SMA Modbus Registers": "2",
        "SMA Modbus Data Type": "U32",
        "SMA Modbus Data Format": "FIX0",
        "Unit": "Wh"
    },
    "30537": {
        "Channel": "Metering.DyWhOut",
        "Object Type": "Measured value",
        "Name (SMA Speedwire)": "Daily yield",
        "Read Level": "",
        "Group": "AC Side > Measured values > Daily yield",
        "Value Range / Unit / Set values": "-",
        "Default value": "\u2012",
        "Step Size": "1",
        "Write Level": "\u2012",
        "Grid Guard": "-",
        "SMA Modbus Register Adress": "30537",
        "Number of contiguous SMA Modbus Registers": "2",
        "SMA Modbus Data Type": "U32",
        "SMA Modbus Data Format": "FIX0",
        "Unit": "kWh"
    },
    "30539": {
        "Channel": "Metering.DyWhOut",
        "Object Type": "Measured value",
        "Name (SMA Speedwire)": "Daily yield",
        "Read Level": "",
        "Group": "AC Side > Measured values > Daily yield",
        "Value Range / Unit / Set values": "-",
        "Default value": "\u2012",
        "Step Size": "1",
        "Write Level": "\u2012",
        "Grid Guard": "-",
        "SMA Modbus Register Adress": "30539",
        "Number of contiguous SMA Modbus Registers": "2",
        "SMA Modbus Data Type": "U32",
        "SMA Modbus Data Format": "FIX0",
        "Unit": "MWh"
    },
    "30513": {
        "Channel": "Metering.TotWhOut",
        "Object Type": "Measured value",
        "Name (SMA Speedwire)": "Total yield",
        "Read Level": "",
        "Group": "AC Side > Measured values > Total yield",
        "Value Range / Unit / Set values": "Wh (64 Bit)",
        "Default value": "\u2012",
        "Step Size": "1",
        "Write Level": "\u2012",
        "Grid Guard": "-",
        "SMA Modbus Register Adress": "30513",
        "Number of contiguous SMA Modbus Registers": "4",
        "SMA Modbus Data Type": "U64",
        "SMA Modbus Data Format": "FIX0",
        "Unit": "Wh"
    },
    "30529": {
        "Channel": "Metering.TotWhOut",
        "Object Type": "Measured value",
        "Name (SMA Speedwire)": "Total yield",
        "Read Level": "",
        "Group": "AC Side > Measured values > Total yield",
        "Value Range / Unit / Set values": "Wh (32 Bit)",
        "Default value": "\u2012",
        "Step Size": "1",
        "Write Level": "\u2012",
        "Grid Guard": "-",
        "SMA Modbus Register Adress": "30529",
        "Number of contiguous SMA Modbus Registers": "2",
        "SMA Modbus Data Type": "U32",
        "SMA Modbus Data Format": "FIX0",
        "Unit": "Wh"
    },
    "30531": {
        "Channel": "Metering.TotWhOut",
        "Object Type": "Measured value",
        "Name (SMA Speedwire)": "Total yield",
        "Read Level": "",
        "Group": "AC Side > Measured values > Total yield",
        "Value Range / Unit / Set values": "kWh (32 Bit)",
        "Default value": "\u2012",
        "Step Size": "1",
        "Write Level": "\u2012",
        "Grid Guard": "-",
        "SMA Modbus Register Adress": "30531",
        "Number of contiguous SMA Modbus Registers": "2",
        "SMA Modbus Data Type": "U32",
        "SMA Modbus Data Format": "FIX0",
        "Unit": "kWh"
    },
    "30533": {
        "Channel": "Metering.TotWhOut",
        "Object Type": "Measured value",
        "Name (SMA Speedwire)": "Total yield",
        "Read Level": "",
        "Group": "AC Side > Measured values > Total yield",
        "Value Range / Unit / Set values": "MWh (32 Bit)",
        "Default value": "\u2012",
        "Step Size": "1",
        "Write Level": "\u2012",
        "Grid Guard": "-",
        "SMA Modbus Register Adress": "30533",
        "Number of contiguous SMA Modbus Registers": "2",
        "SMA Modbus Data Type": "U32",
        "SMA Modbus Data Format": "FIX0",
        "Unit": "MWh"
    },
    "30875": {
        "Channel": "MltFncSw.Stt",
        "Object Type": "Measured value",
        "Name (SMA Speedwire)": "Multifunction relay status",
        "Read Level": "",
        "Group": "Device > Multifunction relay > Status",
        "Value Range / Unit / Set values": "303: Off (Off)308: On (On)",
        "Default value": "\u2012",
        "Step Size": "\u2012",
        "Write Level": "\u2012",
        "Grid Guard": "-",
        "SMA Modbus Register Adress": "30875",
        "Number of contiguous SMA Modbus Registers": "2",
        "SMA Modbus Data Type": "U32",
        "SMA Modbus Data Format": "TAGLIST",
        "Unit": "-"
    },
    "31391": {
        "Channel": "Operation.Bat.Health",
        "Object Type": "Measured value",
        "Name (SMA Speedwire)": "Battery status",
        "Read Level": "",
        "Group": "Status > Operation > Battery > Condition",
        "Value Range / Unit / Set values": "35: Fault (Alm)303: Off (Off)307: Ok (Ok)455: Warning (Wrn)16777213: Information not available (NaNStt)",
        "Default value": "\u2012",
        "Step Size": "\u2012",
        "Write Level": "\u2012",
        "Grid Guard": "-",
        "SMA Modbus Register Adress": "31391",
        "Number of contiguous SMA Modbus Registers": "2",
        "SMA Modbus Data Type": "U32",
        "SMA Modbus Data Format": "TAGLIST",
        "Unit": "-"
    },
    "34659": {
        "Channel": "Operation.CmpBMS.OpStt",
        "Object Type": "Measured value",
        "Name (SMA Speedwire)": "Operating status",
        "Read Level": "",
        "Group": "Battery > Operation > Battery management system > General operating status",
        "Value Range / Unit / Set values": "71: Interference device (DevFlt)303: Off (Off)388: Operation status (SttOp)1295: Standby (Stdby)2291: Battery standby (BatWait)16777213: Information not available (NaNStt)",
        "Default value": "\u2012",
        "Step Size": "\u2012",
        "Write Level": "\u2012",
        "Grid Guard": "-",
        "SMA Modbus Register Adress": "34659",
        "Number of contiguous SMA Modbus Registers": "2",
        "SMA Modbus Data Type": "U32",
        "SMA Modbus Data Format": "TAGLIST",
        "Unit": "-"
    },
    "32405": {
        "Channel": "Operation.ComRsTms",
        "Object Type": "Measured value",
        "Name (SMA Speedwire)": "Remaining duration until CP restart",
        "Read Level": "",
        "Group": "External Communication > Operation > Remaining duration until CP restart",
        "Value Range / Unit / Set values": "-",
        "Default value": "\u2012",
        "Step Size": "1",
        "Write Level": "\u2012",
        "Grid Guard": "-",
        "SMA Modbus Register Adress": "32405",
        "Number of contiguous SMA Modbus Registers": "2",
        "SMA Modbus Data Type": "U32",
        "SMA Modbus Data Format": "HIDDEN",
        "Unit": "-"
    },
    "30215": {
        "Channel": "Operation.Evt.Dsc",
        "Object Type": "Measured value",
        "Name (SMA Speedwire)": "Fault correction measure",
        "Read Level": "",
        "Group": "Status > Operation > Current event > Fault correction measure",
        "Value Range / Unit / Set values": "885: none (NoneDsc)",
        "Default value": "\u2012",
        "Step Size": "\u2012",
        "Write Level": "\u2012",
        "Grid Guard": "-",
        "SMA Modbus Register Adress": "30215",
        "Number of contiguous SMA Modbus Registers": "2",
        "SMA Modbus Data Type": "U32",
        "SMA Modbus Data Format": "TAGLIST",
        "Unit": "-"
    },
    "30213": {
        "Channel": "Operation.Evt.Msg",
        "Object Type": "Measured value",
        "Name (SMA Speedwire)": "Message",
        "Read Level": "",
        "Group": "Status > Operation > Current event > Message",
        "Value Range / Unit / Set values": "886: none (NoneMsg)",
        "Default value": "\u2012",
        "Step Size": "\u2012",
        "Write Level": "\u2012",
        "Grid Guard": "-",
        "SMA Modbus Register Adress": "30213",
        "Number of contiguous SMA Modbus Registers": "2",
        "SMA Modbus Data Type": "U32",
        "SMA Modbus Data Format": "TAGLIST",
        "Unit": "-"
    },
    "30211": {
        "Channel": "Operation.Evt.Prio",
        "Object Type": "Measured value",
        "Name (SMA Speedwire)": "Recommended action",
        "Read Level": "",
        "Group": "Status > Operation > Current event > Recommended action",
        "Value Range / Unit / Set values": "336: Contact manufacturer (PrioA)337: Contact installer (PrioC)338: invalid (PrioIna)887: none (NonePrio)",
        "Default value": "\u2012",
        "Step Size": "\u2012",
        "Write Level": "\u2012",
        "Grid Guard": "-",
        "SMA Modbus Register Adress": "30211",
        "Number of contiguous SMA Modbus Registers": "2",
        "SMA Modbus Data Type": "U32",
        "SMA Modbus Data Format": "TAGLIST",
        "Unit": "-"
    },
    "30561": {
        "Channel": "Operation.EvtCntIstl",
        "Object Type": "Measured value",
        "Name (SMA Speedwire)": "Number of events for installer",
        "Read Level": "",
        "Group": "Status > Operation > Events for installer",
        "Value Range / Unit / Set values": "-",
        "Default value": "\u2012",
        "Step Size": "1",
        "Write Level": "\u2012",
        "Grid Guard": "-",
        "SMA Modbus Register Adress": "30561",
        "Number of contiguous SMA Modbus Registers": "2",
        "SMA Modbus Data Type": "U32",
        "SMA Modbus Data Format": "FIX0",
        "Unit": "-"
    },
    "35381": {
        "Channel": "Operation.EvtCntIstl",
        "Object Type": "Measured value",
        "Name (SMA Speedwire)": "Number of events for installer",
        "Read Level": "",
        "Group": "Status > Operation > Events for installer",
        "Value Range / Unit / Set values": "-",
        "Default value": "\u2012",
        "Step Size": "1",
        "Write Level": "\u2012",
        "Grid Guard": "-",
        "SMA Modbus Register Adress": "35381",
        "Number of contiguous SMA Modbus Registers": "4",
        "SMA Modbus Data Type": "U64",
        "SMA Modbus Data Format": "FIX0",
        "Unit": "-"
    },
    "30563": {
        "Channel": "Operation.EvtCntSvc",
        "Object Type": "Measured value",
        "Name (SMA Speedwire)": "Number of events for service",
        "Read Level": "Svc",
        "Group": "Status > Operation > Events for service",
        "Value Range / Unit / Set values": "-",
        "Default value": "\u2012",
        "Step Size": "1",
        "Write Level": "\u2012",
        "Grid Guard": "-",
        "SMA Modbus Register Adress": "30563",
        "Number of contiguous SMA Modbus Registers": "2",
        "SMA Modbus Data Type": "U32",
        "SMA Modbus Data Format": "FIX0",
        "Unit": "-"
    },
    "35385": {
        "Channel": "Operation.EvtCntSvc",
        "Object Type": "Measured value",
        "Name (SMA Speedwire)": "Number of events for service",
        "Read Level": "Svc",
        "Group": "Status > Operation > Events for service",
        "Value Range / Unit / Set values": "-",
        "Default value": "\u2012",
        "Step Size": "1",
        "Write Level": "\u2012",
        "Grid Guard": "-",
        "SMA Modbus Register Adress": "35385",
        "Number of contiguous SMA Modbus Registers": "4",
        "SMA Modbus Data Type": "U64",
        "SMA Modbus Data Format": "FIX0",
        "Unit": "-"
    },
    "30559": {
        "Channel": "Operation.EvtCntUsr",
        "Object Type": "Measured value",
        "Name (SMA Speedwire)": "Number of events for user",
        "Read Level": "",
        "Group": "Status > Operation > Events for user",
        "Value Range / Unit / Set values": "-",
        "Default value": "\u2012",
        "Step Size": "1",
        "Write Level": "\u2012",
        "Grid Guard": "-",
        "SMA Modbus Register Adress": "30559",
        "Number of contiguous SMA Modbus Registers": "2",
        "SMA Modbus Data Type": "U32",
        "SMA Modbus Data Format": "FIX0",
        "Unit": "-"
    },
    "35377": {
        "Channel": "Operation.EvtCntUsr",
        "Object Type": "Measured value",
        "Name (SMA Speedwire)": "Number of events for user",
        "Read Level": "",
        "Group": "Status > Operation > Events for user",
        "Value Range / Unit / Set values": "-",
        "Default value": "\u2012",
        "Step Size": "1",
        "Write Level": "\u2012",
        "Grid Guard": "-",
        "SMA Modbus Register Adress": "35377",
        "Number of contiguous SMA Modbus Registers": "4",
        "SMA Modbus Data Type": "U64",
        "SMA Modbus Data Format": "FIX0",
        "Unit": "-"
    },
    "30201": {
        "Channel": "Operation.Health",
        "Object Type": "Measured value",
        "Name (SMA Speedwire)": "Condition",
        "Read Level": "",
        "Group": "Status > Operation > Condition",
        "Value Range / Unit / Set values": "35: Fault (Alm)303: Off (Off)307: Ok (Ok)455: Warning (Wrn)",
        "Default value": "\u2012",
        "Step Size": "\u2012",
        "Write Level": "\u2012",
        "Grid Guard": "-",
        "SMA Modbus Register Adress": "30201",
        "Number of contiguous SMA Modbus Registers": "2",
        "SMA Modbus Data Type": "U32",
        "SMA Modbus Data Format": "TAGLIST",
        "Unit": "-"
    },
    "30207": {
        "Channel": "Operation.HealthStt.Alm",
        "Object Type": "Measured value",
        "Name (SMA Speedwire)": "Nominal power in Fault Mode",
        "Read Level": "",
        "Group": "Status > Operation > Device status > Fault",
        "Value Range / Unit / Set values": "-",
        "Default value": "\u2012",
        "Step Size": "1",
        "Write Level": "\u2012",
        "Grid Guard": "-",
        "SMA Modbus Register Adress": "30207",
        "Number of contiguous SMA Modbus Registers": "2",
        "SMA Modbus Data Type": "U32",
        "SMA Modbus Data Format": "FIX0",
        "Unit": "W"
    },
    "30203": {
        "Channel": "Operation.HealthStt.Ok",
        "Object Type": "Measured value",
        "Name (SMA Speedwire)": "Nominal power in Ok Mode",
        "Read Level": "",
        "Group": "Status > Operation > Device status > Ok",
        "Value Range / Unit / Set values": "-",
        "Default value": "\u2012",
        "Step Size": "1",
        "Write Level": "\u2012",
        "Grid Guard": "-",
        "SMA Modbus Register Adress": "30203",
        "Number of contiguous SMA Modbus Registers": "2",
        "SMA Modbus Data Type": "U32",
        "SMA Modbus Data Format": "FIX0",
        "Unit": "W"
    },
    "31085": {
        "Channel": "Operation.HealthStt.Ok",
        "Object Type": "Measured value",
        "Name (SMA Speedwire)": "Nominal power in Ok Mode",
        "Read Level": "",
        "Group": "Status > Operation > Device status > Ok",
        "Value Range / Unit / Set values": "-",
        "Default value": "\u2012",
        "Step Size": "1",
        "Write Level": "\u2012",
        "Grid Guard": "-",
        "SMA Modbus Register Adress": "31085",
        "Number of contiguous SMA Modbus Registers": "2",
        "SMA Modbus Data Type": "U32",
        "SMA Modbus Data Format": "FIX0",
        "Unit": "W"
    },
    "30205": {
        "Channel": "Operation.HealthStt.Wrn",
        "Object Type": "Measured value",
        "Name (SMA Speedwire)": "Nominal power in Warning Mode",
        "Read Level": "",
        "Group": "Status > Operation > Device status > Warning",
        "Value Range / Unit / Set values": "-",
        "Default value": "\u2012",
        "Step Size": "1",
        "Write Level": "\u2012",
        "Grid Guard": "-",
        "SMA Modbus Register Adress": "30205",
        "Number of contiguous SMA Modbus Registers": "2",
        "SMA Modbus Data Type": "U32",
        "SMA Modbus Data Format": "FIX0",
        "Unit": "W"
    },
    "32385": {
        "Channel": "Operation.Inverter.Health",
        "Object Type": "Measured value",
        "Name (SMA Speedwire)": "Inverter status",
        "Read Level": "",
        "Group": "Status > Operation > Inverter > Condition",
        "Value Range / Unit / Set values": "35: Fault (Alm)303: Off (Off)307: Ok (Ok)455: Warning (Wrn)",
        "Default value": "\u2012",
        "Step Size": "\u2012",
        "Write Level": "\u2012",
        "Grid Guard": "-",
        "SMA Modbus Register Adress": "32385",
        "Number of contiguous SMA Modbus Registers": "2",
        "SMA Modbus Data Type": "U32",
        "SMA Modbus Data Format": "TAGLIST",
        "Unit": "-"
    },
    "31041": {
        "Channel": "Spdwr.ActlDnsSrvIp",
        "Object Type": "Measured value",
        "Name (SMA Speedwire)": "\u2012",
        "Read Level": "-",
        "Group": "-",
        "Value Range / Unit / Set values": "-",
        "Default value": "\u2012",
        "Step Size": "\u2012",
        "Write Level": "\u2012",
        "Grid Guard": "-",
        "SMA Modbus Register Adress": "31041",
        "Number of contiguous SMA Modbus Registers": "8",
        "SMA Modbus Data Type": "STR32",
        "SMA Modbus Data Format": "UTF8",
        "Unit": "-"
    },
    "31033": {
        "Channel": "Spdwr.ActlGwIp",
        "Object Type": "Measured value",
        "Name (SMA Speedwire)": "\u2012",
        "Read Level": "-",
        "Group": "-",
        "Value Range / Unit / Set values": "-",
        "Default value": "\u2012",
        "Step Size": "\u2012",
        "Write Level": "\u2012",
        "Grid Guard": "-",
        "SMA Modbus Register Adress": "31033",
        "Number of contiguous SMA Modbus Registers": "8",
        "SMA Modbus Data Type": "STR32",
        "SMA Modbus Data Format": "UTF8",
        "Unit": "-"
    },
    "31017": {
        "Channel": "Spdwr.ActlIp",
        "Object Type": "Measured value",
        "Name (SMA Speedwire)": "\u2012",
        "Read Level": "-",
        "Group": "-",
        "Value Range / Unit / Set values": "-",
        "Default value": "\u2012",
        "Step Size": "\u2012",
        "Write Level": "\u2012",
        "Grid Guard": "-",
        "SMA Modbus Register Adress": "31017",
        "Number of contiguous SMA Modbus Registers": "8",
        "SMA Modbus Data Type": "STR32",
        "SMA Modbus Data Format": "UTF8",
        "Unit": "-"
    },
    "31025": {
        "Channel": "Spdwr.ActlSnetMsk",
        "Object Type": "Measured value",
        "Name (SMA Speedwire)": "\u2012",
        "Read Level": "-",
        "Group": "-",
        "Value Range / Unit / Set values": "-",
        "Default value": "\u2012",
        "Step Size": "\u2012",
        "Write Level": "\u2012",
        "Grid Guard": "-",
        "SMA Modbus Register Adress": "31025",
        "Number of contiguous SMA Modbus Registers": "8",
        "SMA Modbus Data Type": "STR32",
        "SMA Modbus Data Format": "UTF8",
        "Unit": "-"
    },
    "30925": {
        "Channel": "Spdwr.ComSocA.ConnSpd",
        "Object Type": "Measured value",
        "Name (SMA Speedwire)": "Connection speed of SMACOM A",
        "Read Level": "",
        "Group": "System communication > Speedwire > SMACOM A > Connection speed",
        "Value Range / Unit / Set values": "302: ------- (None)1720: 10 Mbit/s (ConnSpd10)1721: 100 Mbit/s (ConnSpd100)",
        "Default value": "\u2012",
        "Step Size": "\u2012",
        "Write Level": "\u2012",
        "Grid Guard": "-",
        "SMA Modbus Register Adress": "30925",
        "Number of contiguous SMA Modbus Registers": "2",
        "SMA Modbus Data Type": "U32",
        "SMA Modbus Data Format": "TAGLIST",
        "Unit": "-"
    },
    "30927": {
        "Channel": "Spdwr.ComSocA.DpxMode",
        "Object Type": "Measured value",
        "Name (SMA Speedwire)": "Duplex mode of SMACOM A",
        "Read Level": "",
        "Group": "System communication > Speedwire > SMACOM A > Duplex mode",
        "Value Range / Unit / Set values": "302: ------- (None)1726: Half duplex (HalfDpx)1727: Full duplex (FulDpx)",
        "Default value": "\u2012",
        "Step Size": "\u2012",
        "Write Level": "\u2012",
        "Grid Guard": "-",
        "SMA Modbus Register Adress": "30927",
        "Number of contiguous SMA Modbus Registers": "2",
        "SMA Modbus Data Type": "U32",
        "SMA Modbus Data Format": "TAGLIST",
        "Unit": "-"
    },
    "30929": {
        "Channel": "Spdwr.ComSocA.Stt",
        "Object Type": "Measured value",
        "Name (SMA Speedwire)": "Speedwire connection status of SMACOM A",
        "Read Level": "",
        "Group": "System communication > Speedwire > SMACOM A > Status",
        "Value Range / Unit / Set values": "35: Fault (Alm)307: Ok (Ok)455: Warning (Wrn)1725: No connection (NotConn)",
        "Default value": "\u2012",
        "Step Size": "\u2012",
        "Write Level": "\u2012",
        "Grid Guard": "-",
        "SMA Modbus Register Adress": "30929",
        "Number of contiguous SMA Modbus Registers": "2",
        "SMA Modbus Data Type": "U32",
        "SMA Modbus Data Format": "TAGLIST",
        "Unit": "-"
    },
    "30931": {
        "Channel": "Spdwr.ComSocB.ConnSpd",
        "Object Type": "Measured value",
        "Name (SMA Speedwire)": "Connection speed of SMACOM B",
        "Read Level": "",
        "Group": "System communication > Speedwire > SMACOM B > Connection speed",
        "Value Range / Unit / Set values": "302: ------- (None)1720: 10 Mbit/s (ConnSpd10)1721: 100 Mbit/s (ConnSpd100)",
        "Default value": "\u2012",
        "Step Size": "\u2012",
        "Write Level": "\u2012",
        "Grid Guard": "-",
        "SMA Modbus Register Adress": "30931",
        "Number of contiguous SMA Modbus Registers": "2",
        "SMA Modbus Data Type": "U32",
        "SMA Modbus Data Format": "TAGLIST",
        "Unit": "-"
    },
    "30933": {
        "Channel": "Spdwr.ComSocB.DpxMode",
        "Object Type": "Measured value",
        "Name (SMA Speedwire)": "Duplex mode of SMACOM B",
        "Read Level": "",
        "Group": "System communication > Speedwire > SMACOM B > Duplex mode",
        "Value Range / Unit / Set values": "302: ------- (None)1726: Half duplex (HalfDpx)1727: Full duplex (FulDpx)",
        "Default value": "\u2012",
        "Step Size": "\u2012",
        "Write Level": "\u2012",
        "Grid Guard": "-",
        "SMA Modbus Register Adress": "30933",
        "Number of contiguous SMA Modbus Registers": "2",
        "SMA Modbus Data Type": "U32",
        "SMA Modbus Data Format": "TAGLIST",
        "Unit": "-"
    },
    "30935": {
        "Channel": "Spdwr.ComSocB.Stt",
        "Object Type": "Measured value",
        "Name (SMA Speedwire)": "Speedwire connection status of SMACOM B",
        "Read Level": "",
        "Group": "System communication > Speedwire > SMACOM B > Status",
        "Value Range / Unit / Set values": "35: Fault (Alm)307: Ok (Ok)455: Warning (Wrn)1725: No connection (NotConn)",
        "Default value": "\u2012",
        "Step Size": "\u2012",
        "Write Level": "\u2012",
        "Grid Guard": "-",
        "SMA Modbus Register Adress": "30935",
        "Number of contiguous SMA Modbus Registers": "2",
        "SMA Modbus Data Type": "U32",
        "SMA Modbus Data Format": "TAGLIST",
        "Unit": "-"
    },
    "30769": {
        "Channel": "DcMs.Amp",
        "Object Type": "Measured value",
        "Name (SMA Speedwire)": "DC current input",
        "Read Level": "",
        "Group": "DC Side > DC measurements > Current",
        "Value Range / Unit / Set values": "-",
        "Default value": "\u2012",
        "Step Size": "0.001",
        "Write Level": "\u2012",
        "Grid Guard": "-",
        "SMA Modbus Register Adress": "30769",
        "Number of contiguous SMA Modbus Registers": "2",
        "SMA Modbus Data Type": "S32",
        "SMA Modbus Data Format": "FIX3",
        "Unit": "A"
    },
    "30957": {
        "Channel": "DcMs.Amp",
        "Object Type": "Measured value",
        "Name (SMA Speedwire)": "DC current input",
        "Read Level": "",
        "Group": "DC Side > DC measurements > Current",
        "Value Range / Unit / Set values": "-",
        "Default value": "\u2012",
        "Step Size": "0.001",
        "Write Level": "\u2012",
        "Grid Guard": "-",
        "SMA Modbus Register Adress": "30957",
        "Number of contiguous SMA Modbus Registers": "2",
        "SMA Modbus Data Type": "S32",
        "SMA Modbus Data Format": "FIX3",
        "Unit": "A"
    },
    "31793": {
        "Channel": "DcMs.Amp",
        "Object Type": "Measured value",
        "Name (SMA Speedwire)": "DC current input",
        "Read Level": "",
        "Group": "DC Side > DC measurements > Current",
        "Value Range / Unit / Set values": "-",
        "Default value": "\u2012",
        "Step Size": "0.001",
        "Write Level": "\u2012",
        "Grid Guard": "-",
        "SMA Modbus Register Adress": "31793",
        "Number of contiguous SMA Modbus Registers": "2",
        "SMA Modbus Data Type": "S32",
        "SMA Modbus Data Format": "FIX3",
        "Unit": "-"
    },
    "31795": {
        "Channel": "DcMs.Amp",
        "Object Type": "Measured value",
        "Name (SMA Speedwire)": "DC current input",
        "Read Level": "",
        "Group": "DC Side > DC measurements > Current",
        "Value Range / Unit / Set values": "-",
        "Default value": "\u2012",
        "Step Size": "0.001",
        "Write Level": "\u2012",
        "Grid Guard": "-",
        "SMA Modbus Register Adress": "31795",
        "Number of contiguous SMA Modbus Registers": "2",
        "SMA Modbus Data Type": "S32",
        "SMA Modbus Data Format": "FIX3",
        "Unit": "-"
    },
    "30771": {
        "Channel": "DcMs.Vol",
        "Object Type": "Measured value",
        "Name (SMA Speedwire)": "DC voltage input",
        "Read Level": "",
        "Group": "DC Side > DC measurements > Voltage",
        "Value Range / Unit / Set values": "-",
        "Default value": "\u2012",
        "Step Size": "0.01",
        "Write Level": "\u2012",
        "Grid Guard": "-",
        "SMA Modbus Register Adress": "30771",
        "Number of contiguous SMA Modbus Registers": "2",
        "SMA Modbus Data Type": "S32",
        "SMA Modbus Data Format": "FIX2",
        "Unit": "V"
    },
    "30959": {
        "Channel": "DcMs.Vol",
        "Object Type": "Measured value",
        "Name (SMA Speedwire)": "DC voltage input",
        "Read Level": "",
        "Group": "DC Side > DC measurements > Voltage",
        "Value Range / Unit / Set values": "-",
        "Default value": "\u2012",
        "Step Size": "0.01",
        "Write Level": "\u2012",
        "Grid Guard": "-",
        "SMA Modbus Register Adress": "30959",
        "Number of contiguous SMA Modbus Registers": "2",
        "SMA Modbus Data Type": "S32",
        "SMA Modbus Data Format": "FIX2",
        "Unit": "V"
    },
    "30773": {
        "Channel": "DcMs.Watt",
        "Object Type": "Measured value",
        "Name (SMA Speedwire)": "DC power input",
        "Read Level": "",
        "Group": "DC Side > DC measurements > Power",
        "Value Range / Unit / Set values": "-",
        "Default value": "\u2012",
        "Step Size": "1",
        "Write Level": "\u2012",
        "Grid Guard": "-",
        "SMA Modbus Register Adress": "30773",
        "Number of contiguous SMA Modbus Registers": "2",
        "SMA Modbus Data Type": "S32",
        "SMA Modbus Data Format": "FIX0",
        "Unit": "W"
    },
    "30961": {
        "Channel": "DcMs.Watt",
        "Object Type": "Measured value",
        "Name (SMA Speedwire)": "DC power input",
        "Read Level": "",
        "Group": "DC Side > DC measurements > Power",
        "Value Range / Unit / Set values": "-",
        "Default value": "\u2012",
        "Step Size": "1",
        "Write Level": "\u2012",
        "Grid Guard": "-",
        "SMA Modbus Register Adress": "30961",
        "Number of contiguous SMA Modbus Registers": "2",
        "SMA Modbus Data Type": "S32",
        "SMA Modbus Data Format": "FIX0",
        "Unit": "W"
    },
    "30803": {
        "Channel": "GridMs.Hz",
        "Object Type": "Measured value",
        "Name (SMA Speedwire)": "Grid frequency",
        "Read Level": "",
        "Group": "AC Side > Grid measurements > Grid frequency",
        "Value Range / Unit / Set values": "-",
        "Default value": "\u2012",
        "Step Size": "0.01",
        "Write Level": "\u2012",
        "Grid Guard": "-",
        "SMA Modbus Register Adress": "30803",
        "Number of contiguous SMA Modbus Registers": "2",
        "SMA Modbus Data Type": "U32",
        "SMA Modbus Data Format": "FIX2",
        "Unit": "Hz"
    },
    "30813": {
        "Channel": "GridMs.TotVA",
        "Object Type": "Measured value",
        "Name (SMA Speedwire)": "Apparent power",
        "Read Level": "",
        "Group": "AC Side > Grid measurements > Apparent power",
        "Value Range / Unit / Set values": "-",
        "Default value": "\u2012",
        "Step Size": "1",
        "Write Level": "\u2012",
        "Grid Guard": "-",
        "SMA Modbus Register Adress": "30813",
        "Number of contiguous SMA Modbus Registers": "2",
        "SMA Modbus Data Type": "S32",
        "SMA Modbus Data Format": "FIX0",
        "Unit": "VA"
    },
    "30805": {
        "Channel": "GridMs.TotVAr",
        "Object Type": "Measured value",
        "Name (SMA Speedwire)": "Reactive power",
        "Read Level": "",
        "Group": "AC Side > Grid measurements > Reactive power",
        "Value Range / Unit / Set values": "-",
        "Default value": "\u2012",
        "Step Size": "1",
        "Write Level": "\u2012",
        "Grid Guard": "-",
        "SMA Modbus Register Adress": "30805",
        "Number of contiguous SMA Modbus Registers": "2",
        "SMA Modbus Data Type": "S32",
        "SMA Modbus Data Format": "FIX0",
        "Unit": "VAr"
    },
    "30775": {
        "Channel": "GridMs.TotW",
        "Object Type": "Measured value",
        "Name (SMA Speedwire)": "Power",
        "Read Level": "",
        "Group": "AC Side > Grid measurements > Power",
        "Value Range / Unit / Set values": "-",
        "Default value": "\u2012",
        "Step Size": "1",
        "Write Level": "\u2012",
        "Grid Guard": "-",
        "SMA Modbus Register Adress": "30775",
        "Number of contiguous SMA Modbus Registers": "2",
        "SMA Modbus Data Type": "S32",
        "SMA Modbus Data Format": "FIX0",
        "Unit": "W"
    },
    "30977": {
        "Channel": "GridMs.A.phsA",
        "Object Type": "Measured value",
        "Name (SMA Speedwire)": "Grid current phase L1",
        "Read Level": "",
        "Group": "AC Side > Grid measurements > Phase currents > Phase L1",
        "Value Range / Unit / Set values": "-",
        "Default value": "\u2012",
        "Step Size": "0.001",
        "Write Level": "\u2012",
        "Grid Guard": "-",
        "SMA Modbus Register Adress": "30977",
        "Number of contiguous SMA Modbus Registers": "2",
        "SMA Modbus Data Type": "S32",
        "SMA Modbus Data Format": "FIX3",
        "Unit": "A"
    },
    "30783": {
        "Channel": "GridMs.PhV.phsA",
        "Object Type": "Measured value",
        "Name (SMA Speedwire)": "Grid voltage phase L1",
        "Read Level": "",
        "Group": "AC Side > Grid measurements > Phase voltage > Phase L1",
        "Value Range / Unit / Set values": "-",
        "Default value": "\u2012",
        "Step Size": "0.01",
        "Write Level": "\u2012",
        "Grid Guard": "-",
        "SMA Modbus Register Adress": "30783",
        "Number of contiguous SMA Modbus Registers": "2",
        "SMA Modbus Data Type": "U32",
        "SMA Modbus Data Format": "FIX2",
        "Unit": "V"
    },
    "30777": {
        "Channel": "GridMs.W.phsA",
        "Object Type": "Measured value",
        "Name (SMA Speedwire)": "Power L1",
        "Read Level": "",
        "Group": "AC Side > Grid measurements > Active power > Phase L1",
        "Value Range / Unit / Set values": "-",
        "Default value": "\u2012",
        "Step Size": "1",
        "Write Level": "\u2012",
        "Grid Guard": "-",
        "SMA Modbus Register Adress": "30777",
        "Number of contiguous SMA Modbus Registers": "2",
        "SMA Modbus Data Type": "S32",
        "SMA Modbus Data Format": "FIX0",
        "Unit": "W"
    },
    "30815": {
        "Channel": "GridMs.VA.phsA",
        "Object Type": "Measured value",
        "Name (SMA Speedwire)": "Apparent power L1",
        "Read Level": "",
        "Group": "AC Side > Grid measurements > Apparent power > Phase L1",
        "Value Range / Unit / Set values": "-",
        "Default value": "\u2012",
        "Step Size": "1",
        "Write Level": "\u2012",
        "Grid Guard": "-",
        "SMA Modbus Register Adress": "30815",
        "Number of contiguous SMA Modbus Registers": "2",
        "SMA Modbus Data Type": "S32",
        "SMA Modbus Data Format": "FIX0",
        "Unit": "VA"
    },
    "30807": {
        "Channel": "GridMs.VAr.phsA",
        "Object Type": "Measured value",
        "Name (SMA Speedwire)": "Reactive power L1",
        "Read Level": "",
        "Group": "AC Side > Grid measurements > Reactive power > Phase L1",
        "Value Range / Unit / Set values": "-",
        "Default value": "\u2012",
        "Step Size": "1",
        "Write Level": "\u2012",
        "Grid Guard": "-",
        "SMA Modbus Register Adress": "30807",
        "Number of contiguous SMA Modbus Registers": "2",
        "SMA Modbus Data Type": "S32",
        "SMA Modbus Data Format": "FIX0",
        "Unit": "var"
    },
    "30949": {
        "Channel": "GridMs.TotPFPrc",
        "Object Type": "Measured value",
        "Name (SMA Speedwire)": "Displacement power factor",
        "Read Level": "",
        "Group": "AC Side > Grid measurements > Displacement power factor",
        "Value Range / Unit / Set values": "-",
        "Default value": "\u2012",
        "Step Size": "0.001",
        "Write Level": "\u2012",
        "Grid Guard": "-",
        "SMA Modbus Register Adress": "30949",
        "Number of contiguous SMA Modbus Registers": "2",
        "SMA Modbus Data Type": "U32",
        "SMA Modbus Data Format": "FIX3",
        "Unit": "-"
    },
    "31221": {
        "Channel": "GridMs.TotPFEEI",
        "Object Type": "Measured value",
        "Name (SMA Speedwire)": "EEI displacement power factor",
        "Read Level": "",
        "Group": "AC Side > Grid measurements > EEI displacement power factor",
        "Value Range / Unit / Set values": "-",
        "Default value": "\u2012",
        "Step Size": "0.001",
        "Write Level": "\u2012",
        "Grid Guard": "-",
        "SMA Modbus Register Adress": "31221",
        "Number of contiguous SMA Modbus Registers": "2",
        "SMA Modbus Data Type": "S32",
        "SMA Modbus Data Format": "FIX3",
        "Unit": "-"
    },
    "30823": {
        "Channel": "GridMs.TotPFExt",
        "Object Type": "Measured value",
        "Name (SMA Speedwire)": "Excitation type of cos \u03c6",
        "Read Level": "",
        "Group": "AC Side > Grid measurements > Excitation type of cos \u03c6",
        "Value Range / Unit / Set values": "1041: Overexcited (OvExt)1042: Underexcited (UnExt)16777213: Information not available (NaNStt)",
        "Default value": "\u2012",
        "Step Size": "\u2012",
        "Write Level": "\u2012",
        "Grid Guard": "-",
        "SMA Modbus Register Adress": "30823",
        "Number of contiguous SMA Modbus Registers": "2",
        "SMA Modbus Data Type": "U32",
        "SMA Modbus Data Format": "TAGLIST",
        "Unit": "-"
    },
    "31247": {
        "Channel": "Isolation.FltA",
        "Object Type": "Measured value",
        "Name (SMA Speedwire)": "Residual current",
        "Read Level": "",
        "Group": "DC Side > Insulation monitoring > Residual current",
        "Value Range / Unit / Set values": "-",
        "Default value": "\u2012",
        "Step Size": "0.001",
        "Write Level": "\u2012",
        "Grid Guard": "-",
        "SMA Modbus Register Adress": "31247",
        "Number of contiguous SMA Modbus Registers": "2",
        "SMA Modbus Data Type": "S32",
        "SMA Modbus Data Format": "FIX3",
        "Unit": "A"
    },
    "30225": {
        "Channel": "Isolation.LeakRis",
        "Object Type": "Measured value",
        "Name (SMA Speedwire)": "Insulation resistance",
        "Read Level": "",
        "Group": "DC Side > Insulation monitoring > Insulation resistance",
        "Value Range / Unit / Set values": "-",
        "Default value": "\u2012",
        "Step Size": "1",
        "Write Level": "\u2012",
        "Grid Guard": "-",
        "SMA Modbus Register Adress": "30225",
        "Number of contiguous SMA Modbus Registers": "2",
        "SMA Modbus Data Type": "U32",
        "SMA Modbus Data Format": "FIX0",
        "Unit": "Ohm"
    },
    "30521": {
        "Channel": "Metering.TotOpTms",
        "Object Type": "Measured value",
        "Name (SMA Speedwire)": "Operating time",
        "Read Level": "",
        "Group": "AC Side > Measured values > Operating time",
        "Value Range / Unit / Set values": "-",
        "Default value": "\u2012",
        "Step Size": "1",
        "Write Level": "\u2012",
        "Grid Guard": "-",
        "SMA Modbus Register Adress": "30521",
        "Number of contiguous SMA Modbus Registers": "4",
        "SMA Modbus Data Type": "U64",
        "SMA Modbus Data Format": "Dauer",
        "Unit": "s"
    },
    "30541": {
        "Channel": "Metering.TotOpTms",
        "Object Type": "Measured value",
        "Name (SMA Speedwire)": "Operating time",
        "Read Level": "",
        "Group": "AC Side > Measured values > Operating time",
        "Value Range / Unit / Set values": "-",
        "Default value": "\u2012",
        "Step Size": "1",
        "Write Level": "\u2012",
        "Grid Guard": "-",
        "SMA Modbus Register Adress": "30541",
        "Number of contiguous SMA Modbus Registers": "2",
        "SMA Modbus Data Type": "U32",
        "SMA Modbus Data Format": "Dauer",
        "Unit": "s"
    },
    "30525": {
        "Channel": "Metering.TotFeedTms",
        "Object Type": "Measured value",
        "Name (SMA Speedwire)": "Feed-in time",
        "Read Level": "",
        "Group": "AC Side > Measured values > Feed-in time",
        "Value Range / Unit / Set values": "-",
        "Default value": "\u2012",
        "Step Size": "1",
        "Write Level": "\u2012",
        "Grid Guard": "-",
        "SMA Modbus Register Adress": "30525",
        "Number of contiguous SMA Modbus Registers": "4",
        "SMA Modbus Data Type": "U64",
        "SMA Modbus Data Format": "Dauer",
        "Unit": "s"
    },
    "30543": {
        "Channel": "Metering.TotFeedTms",
        "Object Type": "Measured value",
        "Name (SMA Speedwire)": "Feed-in time",
        "Read Level": "",
        "Group": "AC Side > Measured values > Feed-in time",
        "Value Range / Unit / Set values": "-",
        "Default value": "\u2012",
        "Step Size": "1",
        "Write Level": "\u2012",
        "Grid Guard": "-",
        "SMA Modbus Register Adress": "30543",
        "Number of contiguous SMA Modbus Registers": "2",
        "SMA Modbus Data Type": "U32",
        "SMA Modbus Data Format": "Dauer",
        "Unit": "s"
    },
    "30599": {
        "Channel": "Operation.GriSwCnt",
        "Object Type": "Measured value",
        "Name (SMA Speedwire)": "Number of grid connections",
        "Read Level": "",
        "Group": "AC Side > Operation > Counter grid connections",
        "Value Range / Unit / Set values": "-",
        "Default value": "\u2012",
        "Step Size": "1",
        "Write Level": "\u2012",
        "Grid Guard": "-",
        "SMA Modbus Register Adress": "30599",
        "Number of contiguous SMA Modbus Registers": "2",
        "SMA Modbus Data Type": "U32",
        "SMA Modbus Data Format": "FIX0",
        "Unit": "-"
    },
    "30217": {
        "Channel": "Operation.GriSwStt",
        "Object Type": "Measured value",
        "Name (SMA Speedwire)": "Grid relay/contactor",
        "Read Level": "",
        "Group": "Status > Operation > Grid relay status",
        "Value Range / Unit / Set values": "51: Closed (Cls)311: Open (Opn)16777213: Information not available (NaNStt)",
        "Default value": "\u2012",
        "Step Size": "\u2012",
        "Write Level": "\u2012",
        "Grid Guard": "-",
        "SMA Modbus Register Adress": "30217",
        "Number of contiguous SMA Modbus Registers": "2",
        "SMA Modbus Data Type": "U32",
        "SMA Modbus Data Format": "TAGLIST",
        "Unit": "-"
    },
    "30219": {
        "Channel": "Operation.DrtStt",
        "Object Type": "Measured value",
        "Name (SMA Speedwire)": "Reason for derating",
        "Read Level": "",
        "Group": "Status > Operation > Reason for derating",
        "Value Range / Unit / Set values": "557: Overtemperature (TmpDrt)884: not active (NoneDrt)1705: Frequency deviation (HzDrt)3520: Voltage deviation (VDrt)16777213: Information not available (NaNStt)",
        "Default value": "\u2012",
        "Step Size": "\u2012",
        "Write Level": "\u2012",
        "Grid Guard": "-",
        "SMA Modbus Register Adress": "30219",
        "Number of contiguous SMA Modbus Registers": "2",
        "SMA Modbus Data Type": "U32",
        "SMA Modbus Data Format": "TAGLIST",
        "Unit": "-"
    },
    "30235": {
        "Channel": "Operation.BckStt",
        "Object Type": "Measured value",
        "Name (SMA Speedwire)": "Backup mode status",
        "Read Level": "",
        "Group": "Device > Operation > Backup mode status",
        "Value Range / Unit / Set values": "1440: Grid mode (ModGri)1441: Separate network mode (ModOffGri)16777213: Information not available (NaNStt)",
        "Default value": "\u2012",
        "Step Size": "\u2012",
        "Write Level": "\u2012",
        "Grid Guard": "-",
        "SMA Modbus Register Adress": "30235",
        "Number of contiguous SMA Modbus Registers": "2",
        "SMA Modbus Data Type": "U32",
        "SMA Modbus Data Format": "TAGLIST",
        "Unit": "-"
    },
    "31405": {
        "Channel": "Operation.Dmd.WCtl",
        "Object Type": "Measured value",
        "Name (SMA Speedwire)": "Current spec. active power limitation P",
        "Read Level": "",
        "Group": "System and device control > Operation > Specification > Active power limitation P",
        "Value Range / Unit / Set values": "0\u00a0W to 7730\u00a0W",
        "Default value": "\u2012",
        "Step Size": "1",
        "Write Level": "\u2012",
        "Grid Guard": "-",
        "SMA Modbus Register Adress": "31405",
        "Number of contiguous SMA Modbus Registers": "2",
        "SMA Modbus Data Type": "U32",
        "SMA Modbus Data Format": "FIX0",
        "Unit": "-"
    },
    "31409": {
        "Channel": "Operation.Dmd.PFExtCtl",
        "Object Type": "Measured value",
        "Name (SMA Speedwire)": "Current spec. stimulation type cos \u03c6",
        "Read Level": "",
        "Group": "System and device control > Operation > Specification > Excitation type cos \u03c6",
        "Value Range / Unit / Set values": "1041: Overexcited (OvExt)1042: Underexcited (UnExt)16777213: Information not available (NaNStt)",
        "Default value": "\u2012",
        "Step Size": "\u2012",
        "Write Level": "\u2012",
        "Grid Guard": "-",
        "SMA Modbus Register Adress": "31409",
        "Number of contiguous SMA Modbus Registers": "2",
        "SMA Modbus Data Type": "U32",
        "SMA Modbus Data Format": "TAGLIST",
        "Unit": "-"
    },
    "40109": {
        "Channel": "GridGuard.Cntry",
        "Object Type": "Measured value",
        "Name (SMA Speedwire)": "Country standard set",
        "Read Level": "",
        "Group": "Grid Monitoring > Grid monitoring > Country standard",
        "Value Range / Unit / Set values": "27: Special setting (Adj)306: SMA Island mode 60 Hz (OFF-Grid60)313: SMA Island mode 50 Hz (OFF-Grid50)333: [GR] PPC (PPC)438: [DE] VDE0126-1-1 (VDE0126-1-1)1199: [CZ] PPDS (PPDS)7510: [DE] VDE-AR-N4105 (VDE-AR-N4105)7513: [DE] VDE-AR-N4105-MP (VDE-AR-N4105-MP)7514: [DE] VDE-AR-N4105-HP (VDE-AR-N4105-HP)7517: [IT] CEI 0-21 intern (CEI0-21Int)7518: [IT] CEI 0-21 extern (CEI0-21Ext)7523: [BE] C10/11/2012 (C10/11/2012)7527: [FR] VFR2014 (VFR2014)7532: [EN] EN50438:2013 (EN50438_2013)7533: [NL] NEN-EN50438:2013 (NEN-EN50438_13)7536: SMA Default (DftEN)7538: [IL] SI4777_HS131_13 (SI4777_HS131_13)7539: [ES] RD1699/413 (RD1699/413)7549: [AU] AS4777.2_2015 (AS4777.2_2015)7550: [ZA] NRS 097-2-1 (NRS97-2-1)7551: [CL] NT_Ley20571 (NT_Ley2057)7556: [TH] MEA2016 (MEA2016)7557: [TH] PEA2016 (PEA2016)7565: [BR] ABNT NBR 16149:2013 (ABNT_NBR_16149_2013)7566: [EU] IE-EN50438:2013 (IE-EN50438_2013)7567: [AE] DEWA\u00a02016 intern (DEWA_2016_intern)7568: [AE] DEWA\u00a02016 extern (DEWA_2016_extern)7569: [AT] TOR D4 2016\u00a0 (TOR_D4_2016)7573: [GB] G83/2-1:2018 (G83/2-1_2018)7574: [GB] G59/3-4:2018 (G59/3-4_2018)16777213: Information not available (NaNStt)",
        "Default value": "\u2012",
        "Step Size": "\u2012",
        "Write Level": "\u2012",
        "Grid Guard": "-",
        "SMA Modbus Register Adress": "40109",
        "Number of contiguous SMA Modbus Registers": "2",
        "SMA Modbus Data Type": "U32",
        "SMA Modbus Data Format": "TAGLIST",
        "Unit": "-"
    },
    "30975": {
        "Channel": "Inverter.DclVol",
        "Object Type": "Measured value",
        "Name (SMA Speedwire)": "Intermediate circuit voltage",
        "Read Level": "Svc",
        "Group": "Device > Inverter > Intermediate circuit voltage",
        "Value Range / Unit / Set values": "-",
        "Default value": "\u2012",
        "Step Size": "0.01",
        "Write Level": "\u2012",
        "Grid Guard": "-",
        "SMA Modbus Register Adress": "30975",
        "Number of contiguous SMA Modbus Registers": "2",
        "SMA Modbus Data Type": "S32",
        "SMA Modbus Data Format": "FIX2",
        "Unit": "V"
    },
    "40029": {
        "Channel": "Operation.OpStt",
        "Object Type": "Measured value",
        "Name (SMA Speedwire)": "General operating status",
        "Read Level": "",
        "Group": "Status > Operation > General operating status",
        "Value Range / Unit / Set values": "295: MPP (Mpp)381: Stop (Stop)443: Constant voltage (VolDCConst)1392: Fault (Flt)1393: Waiting for PV voltage (WaitPV)1467: Start (Str)1469: Shut down (Shtdwn)1480: Waiting for utilities company (WaitUtil)1855: Stand-alone operation (SocOp)2119: Derating (Drt)16777213: Information not available (NaNStt)",
        "Default value": "\u2012",
        "Step Size": "\u2012",
        "Write Level": "\u2012",
        "Grid Guard": "-",
        "SMA Modbus Register Adress": "40029",
        "Number of contiguous SMA Modbus Registers": "2",
        "SMA Modbus Data Type": "U32",
        "SMA Modbus Data Format": "TAGLIST",
        "Unit": "-"
    },
    "30881": {
        "Channel": "Operation.PvGriConn",
        "Object Type": "Measured value",
        "Name (SMA Speedwire)": "Plant mains connection",
        "Read Level": "",
        "Group": "AC Side > Operation > Mains connection",
        "Value Range / Unit / Set values": "1779: Separated (Dscon)1780: Public electricity mains (PubGri)1781: Island mains (IsoGri)16777213: Information not available (NaNStt)",
        "Default value": "\u2012",
        "Step Size": "\u2012",
        "Write Level": "\u2012",
        "Grid Guard": "-",
        "SMA Modbus Register Adress": "30881",
        "Number of contiguous SMA Modbus Registers": "2",
        "SMA Modbus Data Type": "U32",
        "SMA Modbus Data Format": "TAGLIST",
        "Unit": "-"
    },
    "30953": {
        "Channel": "Coolsys.Cab.TmpVal",
        "Object Type": "Measured value",
        "Name (SMA Speedwire)": "Internal temperature",
        "Read Level": "Svc",
        "Group": "Device > Cooling system > Interior > Temperature",
        "Value Range / Unit / Set values": "-",
        "Default value": "\u2012",
        "Step Size": "0.1",
        "Write Level": "\u2012",
        "Grid Guard": "-",
        "SMA Modbus Register Adress": "30953",
        "Number of contiguous SMA Modbus Registers": "2",
        "SMA Modbus Data Type": "S32",
        "SMA Modbus Data Format": "TEMP",
        "Unit": "\u00b0C"
    },
    "30795": {
        "Channel": "GridMs.TotA",
        "Object Type": "Measured value",
        "Name (SMA Speedwire)": "Grid current",
        "Read Level": "",
        "Group": "AC Side > Grid measurements > Phase total Current",
        "Value Range / Unit / Set values": "-",
        "Default value": "\u2012",
        "Step Size": "0.001",
        "Write Level": "\u2012",
        "Grid Guard": "-",
        "SMA Modbus Register Adress": "30795",
        "Number of contiguous SMA Modbus Registers": "2",
        "SMA Modbus Data Type": "U32",
        "SMA Modbus Data Format": "FIX3",
        "Unit": "-"
    }
}
