<?xml version="1.0" encoding="UTF-8"?>
<UndoHistory>
  <UndoTransaction tv-sec="1621073949" tv-usec="491988" name="add automation event">
    <MementoCommand obj-id="982698" type-name="ARDOUR::AutomationList">
      <AutomationList automation-id="gain" id="982698" interpolation-style="Exponential" state="Off"/>
      <AutomationList automation-id="gain" id="982698" interpolation-style="Exponential" state="Off">
        <events>0 0.63757616281509399
10271282 0.63757616281509399
</events>
      </AutomationList>
    </MementoCommand>
    <MementoCommand obj-id="43" type-name="SelectionMemento">
      <SelectionMemento mouse-mode="MouseDraw" zoom="6760" left-frame="5897562" y-origin="1063">
        <Selection>
          <MIDINotes region-id="730292">
            <note note-id="302622"/>
          </MIDINotes>
          <ControlPoint type="region" region-id="821821" view-index="1"/>
        </Selection>
      </SelectionMemento>
      <SelectionMemento mouse-mode="MouseDraw" zoom="6760" left-frame="5897562" y-origin="1063">
        <Selection>
          <MIDINotes region-id="730292">
            <note note-id="302622"/>
          </MIDINotes>
          <ControlPoint type="track" route-id="982695" automation-list-id="982698" parameter="gain" view-index="1"/>
        </Selection>
      </SelectionMemento>
    </MementoCommand>
  </UndoTransaction>
  <UndoTransaction tv-sec="1621073959" tv-usec="15262" name="automation event move">
    <MementoUndoCommand obj-id="982698" type-name="ARDOUR::AutomationList">
      <AutomationList automation-id="gain" id="982698" interpolation-style="Exponential" state="Off">
        <events>0 0.63757616281509399
10271282 0.63757616281509399
</events>
      </AutomationList>
    </MementoUndoCommand>
    <MementoRedoCommand obj-id="982698" type-name="ARDOUR::AutomationList">
      <AutomationList automation-id="gain" id="982698" interpolation-style="Exponential" state="Off">
        <events>0 0.63757616281509399
10271282 1.0001335144042969
</events>
      </AutomationList>
    </MementoRedoCommand>
    <MementoCommand obj-id="43" type-name="SelectionMemento">
      <SelectionMemento mouse-mode="MouseDraw" zoom="6760" left-frame="5897562" y-origin="1063">
        <Selection>
          <MIDINotes region-id="730292">
            <note note-id="302622"/>
          </MIDINotes>
          <ControlPoint type="track" route-id="982695" automation-list-id="982698" parameter="gain" view-index="1"/>
        </Selection>
      </SelectionMemento>
      <SelectionMemento mouse-mode="MouseDraw" zoom="6760" left-frame="5897562" y-origin="1063">
        <Selection>
          <MIDINotes region-id="730292">
            <note note-id="302622"/>
          </MIDINotes>
          <ControlPoint type="track" route-id="982695" automation-list-id="982698" parameter="gain" view-index="1"/>
        </Selection>
      </SelectionMemento>
    </MementoCommand>
  </UndoTransaction>
  <UndoTransaction tv-sec="1621073966" tv-usec="291042" name="add automation event">
    <MementoCommand obj-id="982698" type-name="ARDOUR::AutomationList">
      <AutomationList automation-id="gain" id="982698" interpolation-style="Exponential" state="Off">
        <events>0 0.63757616281509399
10271282 1.0001335144042969
</events>
      </AutomationList>
      <AutomationList automation-id="gain" id="982698" interpolation-style="Exponential" state="Off">
        <events>0 0.63757616281509399
10271282 1.0001335144042969
10609282 0.96762979030609131
</events>
      </AutomationList>
    </MementoCommand>
    <MementoCommand obj-id="43" type-name="SelectionMemento">
      <SelectionMemento mouse-mode="MouseDraw" zoom="6760" left-frame="5897562" y-origin="1063">
        <Selection>
          <MIDINotes region-id="730292">
            <note note-id="302622"/>
          </MIDINotes>
          <ControlPoint type="track" route-id="982695" automation-list-id="982698" parameter="gain" view-index="1"/>
        </Selection>
      </SelectionMemento>
      <SelectionMemento mouse-mode="MouseDraw" zoom="6760" left-frame="5897562" y-origin="1063">
        <Selection>
          <MIDINotes region-id="730292">
            <note note-id="302622"/>
          </MIDINotes>
          <ControlPoint type="track" route-id="982695" automation-list-id="982698" parameter="gain" view-index="2"/>
        </Selection>
      </SelectionMemento>
    </MementoCommand>
  </UndoTransaction>
  <UndoTransaction tv-sec="1621073972" tv-usec="824262" name="automation event move">
    <MementoUndoCommand obj-id="982698" type-name="ARDOUR::AutomationList">
      <AutomationList automation-id="gain" id="982698" interpolation-style="Exponential" state="Off">
        <events>0 0.63757616281509399
10271282 1.0001335144042969
10609282 0.96762979030609131
</events>
      </AutomationList>
    </MementoUndoCommand>
    <MementoRedoCommand obj-id="982698" type-name="ARDOUR::AutomationList">
      <AutomationList automation-id="gain" id="982698" interpolation-style="Exponential" state="Off">
        <events>0 0.63757616281509399
10271282 1.0001335144042969
10602522 1.449760913848877
</events>
      </AutomationList>
    </MementoRedoCommand>
    <MementoCommand obj-id="43" type-name="SelectionMemento">
      <SelectionMemento mouse-mode="MouseDraw" zoom="6760" left-frame="5897562" y-origin="1063">
        <Selection>
          <MIDINotes region-id="730292">
            <note note-id="302622"/>
          </MIDINotes>
          <ControlPoint type="track" route-id="982695" automation-list-id="982698" parameter="gain" view-index="2"/>
        </Selection>
      </SelectionMemento>
      <SelectionMemento mouse-mode="MouseDraw" zoom="6760" left-frame="5897562" y-origin="1063">
        <Selection>
          <MIDINotes region-id="730292">
            <note note-id="302622"/>
          </MIDINotes>
          <ControlPoint type="track" route-id="982695" automation-list-id="982698" parameter="gain" view-index="2"/>
        </Selection>
      </SelectionMemento>
    </MementoCommand>
  </UndoTransaction>
  <UndoTransaction tv-sec="1621074045" tv-usec="658038" name="automation event move">
    <MementoUndoCommand obj-id="982698" type-name="ARDOUR::AutomationList">
      <AutomationList automation-id="gain" id="982698" interpolation-style="Exponential" state="Play">
        <events>0 0.63757616281509399
10271282 1.0001335144042969
10602522 1.449760913848877
</events>
      </AutomationList>
    </MementoUndoCommand>
    <MementoRedoCommand obj-id="982698" type-name="ARDOUR::AutomationList">
      <AutomationList automation-id="gain" id="982698" interpolation-style="Exponential" state="Play">
        <events>0 1.0001333951950073
10271282 1.0001335144042969
10602522 1.449760913848877
</events>
      </AutomationList>
    </MementoRedoCommand>
    <MementoCommand obj-id="43" type-name="SelectionMemento">
      <SelectionMemento mouse-mode="MouseDraw" zoom="6760" left-frame="0" y-origin="1063">
        <Selection>
          <MIDINotes region-id="730292">
            <note note-id="302622"/>
          </MIDINotes>
          <ControlPoint type="track" route-id="982695" automation-list-id="982698" parameter="gain" view-index="0"/>
        </Selection>
      </SelectionMemento>
      <SelectionMemento mouse-mode="MouseDraw" zoom="6760" left-frame="0" y-origin="1063">
        <Selection>
          <MIDINotes region-id="730292">
            <note note-id="302622"/>
          </MIDINotes>
          <ControlPoint type="track" route-id="982695" automation-list-id="982698" parameter="gain" view-index="0"/>
        </Selection>
      </SelectionMemento>
    </MementoCommand>
  </UndoTransaction>
  <UndoTransaction tv-sec="1621074214" tv-usec="174344" name="automation event move">
    <MementoUndoCommand obj-id="982698" type-name="ARDOUR::AutomationList">
      <AutomationList automation-id="gain" id="982698" interpolation-style="Exponential" state="Play">
        <events>0 1.0001333951950073
10271282 1.0001335144042969
10602522 1.449760913848877
</events>
      </AutomationList>
    </MementoUndoCommand>
    <MementoRedoCommand obj-id="982698" type-name="ARDOUR::AutomationList">
      <AutomationList automation-id="gain" id="982698" interpolation-style="Exponential" state="Play">
        <events>0 1.0001333951950073
10271282 1.0001335144042969
10602522 1.7047823667526245
</events>
      </AutomationList>
    </MementoRedoCommand>
    <MementoCommand obj-id="43" type-name="SelectionMemento">
      <SelectionMemento mouse-mode="MouseDraw" zoom="6760" left-frame="8269891" y-origin="1063">
        <Selection>
          <MIDINotes region-id="730292">
            <note note-id="302622"/>
          </MIDINotes>
          <ControlPoint type="track" route-id="982695" automation-list-id="982698" parameter="gain" view-index="2"/>
        </Selection>
      </SelectionMemento>
      <SelectionMemento mouse-mode="MouseDraw" zoom="6760" left-frame="8269891" y-origin="1063">
        <Selection>
          <MIDINotes region-id="730292">
            <note note-id="302622"/>
          </MIDINotes>
          <ControlPoint type="track" route-id="982695" automation-list-id="982698" parameter="gain" view-index="2"/>
        </Selection>
      </SelectionMemento>
    </MementoCommand>
  </UndoTransaction>
  <UndoTransaction tv-sec="1621074246" tv-usec="162032" name="change fade out length">
    <MementoCommand obj-id="821824" type-name="ARDOUR::AutomationList">
      <AutomationList automation-id="fadeout" id="821824" interpolation-style="Curved" state="Off">
        <events>0 1
529199 1.0000000116860974e-07
</events>
      </AutomationList>
      <AutomationList automation-id="fadeout" id="821824" interpolation-style="Curved" state="Off">
        <events>0 1
114148 1.0000000116860974e-07
</events>
      </AutomationList>
    </MementoCommand>
    <MementoCommand obj-id="43" type-name="SelectionMemento">
      <SelectionMemento mouse-mode="MouseObject" zoom="6760" left-frame="8269891" y-origin="1063">
        <Selection>
          <Regions>
            <Region id="821821"/>
          </Regions>
          <MIDINotes region-id="730292">
            <note note-id="302622"/>
          </MIDINotes>
        </Selection>
      </SelectionMemento>
      <SelectionMemento mouse-mode="MouseObject" zoom="6760" left-frame="8269891" y-origin="1063">
        <Selection>
          <Regions>
            <Region id="821821"/>
          </Regions>
          <MIDINotes region-id="730292">
            <note note-id="302622"/>
          </MIDINotes>
        </Selection>
      </SelectionMemento>
    </MementoCommand>
  </UndoTransaction>
  <UndoTransaction tv-sec="1621074295" tv-usec="590178" name="change fade out length">
    <MementoCommand obj-id="821824" type-name="ARDOUR::AutomationList">
      <AutomationList automation-id="fadeout" id="821824" interpolation-style="Curved" state="Off">
        <events>0 1
114148 1.0000000116860974e-07
</events>
      </AutomationList>
      <AutomationList automation-id="fadeout" id="821824" interpolation-style="Curved" state="Off">
        <events>0 1
249348 1.0000000116860974e-07
</events>
      </AutomationList>
    </MementoCommand>
    <MementoCommand obj-id="43" type-name="SelectionMemento">
      <SelectionMemento mouse-mode="MouseObject" zoom="6760" left-frame="8269891" y-origin="1063">
        <Selection>
          <Regions>
            <Region id="821821"/>
          </Regions>
          <MIDINotes region-id="730292">
            <note note-id="302622"/>
          </MIDINotes>
        </Selection>
      </SelectionMemento>
      <SelectionMemento mouse-mode="MouseObject" zoom="6760" left-frame="8269891" y-origin="1063">
        <Selection>
          <Regions>
            <Region id="821821"/>
          </Regions>
          <MIDINotes region-id="730292">
            <note note-id="302622"/>
          </MIDINotes>
        </Selection>
      </SelectionMemento>
    </MementoCommand>
  </UndoTransaction>
  <UndoTransaction tv-sec="1621074320" tv-usec="389161" name="change fade out length">
    <MementoCommand obj-id="821824" type-name="ARDOUR::AutomationList">
      <AutomationList automation-id="fadeout" id="821824" interpolation-style="Curved" state="Off">
        <events>0 1
249348 1.0000000116860974e-07
</events>
      </AutomationList>
      <AutomationList automation-id="fadeout" id="821824" interpolation-style="Curved" state="Off">
        <events>0 1
404828 1.0000000116860974e-07
</events>
      </AutomationList>
    </MementoCommand>
    <MementoCommand obj-id="43" type-name="SelectionMemento">
      <SelectionMemento mouse-mode="MouseObject" zoom="6760" left-frame="8269891" y-origin="1063">
        <Selection>
          <Regions>
            <Region id="821821"/>
          </Regions>
          <MIDINotes region-id="730292">
            <note note-id="302622"/>
          </MIDINotes>
        </Selection>
      </SelectionMemento>
      <SelectionMemento mouse-mode="MouseObject" zoom="6760" left-frame="8269891" y-origin="1063">
        <Selection>
          <Regions>
            <Region id="821821"/>
          </Regions>
          <MIDINotes region-id="730292">
            <note note-id="302622"/>
          </MIDINotes>
        </Selection>
      </SelectionMemento>
    </MementoCommand>
  </UndoTransaction>
  <UndoTransaction tv-sec="1621074344" tv-usec="761838" name="change fade out length">
    <MementoCommand obj-id="821824" type-name="ARDOUR::AutomationList">
      <AutomationList automation-id="fadeout" id="821824" interpolation-style="Curved" state="Off">
        <events>0 1
404828 1.0000000116860974e-07
</events>
      </AutomationList>
      <AutomationList automation-id="fadeout" id="821824" interpolation-style="Curved" state="Off">
        <events>0 1
249348 1.0000000116860974e-07
</events>
      </AutomationList>
    </MementoCommand>
    <MementoCommand obj-id="43" type-name="SelectionMemento">
      <SelectionMemento mouse-mode="MouseObject" zoom="6760" left-frame="8269891" y-origin="1063">
        <Selection>
          <Regions>
            <Region id="821821"/>
          </Regions>
          <MIDINotes region-id="730292">
            <note note-id="302622"/>
          </MIDINotes>
        </Selection>
      </SelectionMemento>
      <SelectionMemento mouse-mode="MouseObject" zoom="6760" left-frame="8269891" y-origin="1063">
        <Selection>
          <Regions>
            <Region id="821821"/>
          </Regions>
          <MIDINotes region-id="730292">
            <note note-id="302622"/>
          </MIDINotes>
        </Selection>
      </SelectionMemento>
    </MementoCommand>
  </UndoTransaction>
  <UndoTransaction tv-sec="1621074357" tv-usec="246571" name="add automation event">
    <MementoCommand obj-id="982698" type-name="ARDOUR::AutomationList">
      <AutomationList automation-id="gain" id="982698" interpolation-style="Exponential" state="Play">
        <events>0 1.0001333951950073
10271282 1.0001335144042969
10602522 1.7047823667526245
</events>
      </AutomationList>
      <AutomationList automation-id="gain" id="982698" interpolation-style="Exponential" state="Play">
        <events>0 1.0001333951950073
10271282 1.0001335144042969
10602522 1.7047823667526245
13224971 1.6665910482406616
</events>
      </AutomationList>
    </MementoCommand>
    <MementoCommand obj-id="43" type-name="SelectionMemento">
      <SelectionMemento mouse-mode="MouseDraw" zoom="6760" left-frame="8269891" y-origin="1063">
        <Selection>
          <Regions>
            <Region id="730292"/>
          </Regions>
          <MIDINotes region-id="730292">
            <note note-id="302622"/>
          </MIDINotes>
        </Selection>
      </SelectionMemento>
      <SelectionMemento mouse-mode="MouseDraw" zoom="6760" left-frame="8269891" y-origin="1063">
        <Selection>
          <MIDINotes region-id="730292">
            <note note-id="302622"/>
          </MIDINotes>
          <ControlPoint type="track" route-id="982695" automation-list-id="982698" parameter="gain" view-index="3"/>
        </Selection>
      </SelectionMemento>
    </MementoCommand>
  </UndoTransaction>
  <UndoTransaction tv-sec="1621074359" tv-usec="73611" name="add automation event">
    <MementoCommand obj-id="982698" type-name="ARDOUR::AutomationList">
      <AutomationList automation-id="gain" id="982698" interpolation-style="Exponential" state="Play">
        <events>0 1.0001333951950073
10271282 1.0001335144042969
10602522 1.7047823667526245
13224971 1.6665910482406616
</events>
      </AutomationList>
      <AutomationList automation-id="gain" id="982698" interpolation-style="Exponential" state="Play">
        <events>0 1.0001333951950073
10271282 1.0001335144042969
10602522 1.7047823667526245
13224971 1.6665910482406616
13495371 1.573705792427063
</events>
      </AutomationList>
    </MementoCommand>
    <MementoCommand obj-id="43" type-name="SelectionMemento">
      <SelectionMemento mouse-mode="MouseDraw" zoom="6760" left-frame="8269891" y-origin="1063">
        <Selection>
          <MIDINotes region-id="730292">
            <note note-id="302622"/>
          </MIDINotes>
          <ControlPoint type="track" route-id="982695" automation-list-id="982698" parameter="gain" view-index="3"/>
        </Selection>
      </SelectionMemento>
      <SelectionMemento mouse-mode="MouseDraw" zoom="6760" left-frame="8269891" y-origin="1063">
        <Selection>
          <MIDINotes region-id="730292">
            <note note-id="302622"/>
          </MIDINotes>
          <ControlPoint type="track" route-id="982695" automation-list-id="982698" parameter="gain" view-index="4"/>
        </Selection>
      </SelectionMemento>
    </MementoCommand>
  </UndoTransaction>
  <UndoTransaction tv-sec="1621074361" tv-usec="690822" name="automation event move">
    <MementoUndoCommand obj-id="982698" type-name="ARDOUR::AutomationList">
      <AutomationList automation-id="gain" id="982698" interpolation-style="Exponential" state="Play">
        <events>0 1.0001333951950073
10271282 1.0001335144042969
10602522 1.7047823667526245
13224971 1.6665910482406616
13495371 1.573705792427063
</events>
      </AutomationList>
    </MementoUndoCommand>
    <MementoRedoCommand obj-id="982698" type-name="ARDOUR::AutomationList">
      <AutomationList automation-id="gain" id="982698" interpolation-style="Exponential" state="Play">
        <events>0 1.0001333951950073
10271282 1.0001335144042969
10602522 1.7047823667526245
13224971 1.6665910482406616
13502131 0
</events>
      </AutomationList>
    </MementoRedoCommand>
    <MementoCommand obj-id="43" type-name="SelectionMemento">
      <SelectionMemento mouse-mode="MouseDraw" zoom="6760" left-frame="8269891" y-origin="1063">
        <Selection>
          <MIDINotes region-id="730292">
            <note note-id="302622"/>
          </MIDINotes>
          <ControlPoint type="track" route-id="982695" automation-list-id="982698" parameter="gain" view-index="4"/>
        </Selection>
      </SelectionMemento>
      <SelectionMemento mouse-mode="MouseDraw" zoom="6760" left-frame="8269891" y-origin="1063">
        <Selection>
          <MIDINotes region-id="730292">
            <note note-id="302622"/>
          </MIDINotes>
          <ControlPoint type="track" route-id="982695" automation-list-id="982698" parameter="gain" view-index="4"/>
        </Selection>
      </SelectionMemento>
    </MementoCommand>
  </UndoTransaction>
  <UndoTransaction tv-sec="1621074386" tv-usec="410481" name="change fade out length">
    <MementoCommand obj-id="821824" type-name="ARDOUR::AutomationList">
      <AutomationList automation-id="fadeout" id="821824" interpolation-style="Curved" state="Off">
        <events>0 1
249348 1.0000000116860974e-07
</events>
      </AutomationList>
      <AutomationList automation-id="fadeout" id="821824" interpolation-style="Curved" state="Off">
        <events>0 1
322940 1.0000000116860974e-07
</events>
      </AutomationList>
    </MementoCommand>
    <MementoCommand obj-id="43" type-name="SelectionMemento">
      <SelectionMemento mouse-mode="MouseObject" zoom="1690" left-frame="12333419" y-origin="1063">
        <Selection>
          <Regions>
            <Region id="821821"/>
          </Regions>
          <MIDINotes region-id="730292">
            <note note-id="302622"/>
          </MIDINotes>
        </Selection>
      </SelectionMemento>
      <SelectionMemento mouse-mode="MouseObject" zoom="1690" left-frame="12333419" y-origin="1063">
        <Selection>
          <Regions>
            <Region id="821821"/>
          </Regions>
          <MIDINotes region-id="730292">
            <note note-id="302622"/>
          </MIDINotes>
        </Selection>
      </SelectionMemento>
    </MementoCommand>
  </UndoTransaction>
  <UndoTransaction tv-sec="1621074417" tv-usec="340120" name="move marker">
    <MementoCommand obj-id="50" type-name="ARDOUR::Locations">
      <Locations>
        <Location id="111759" name="session" start="264600" end="13494600" flags="IsSessionRange" locked="0" position-lock-style="AudioTime" timestamp="1618153752"/>
        <Location id="250709" name="mark1" start="529200" end="529200" flags="IsMark" locked="0" position-lock-style="AudioTime" timestamp="1620484985"/>
        <Location id="250721" name="mark2" start="2656876" end="2656876" flags="IsMark" locked="0" position-lock-style="AudioTime" timestamp="1620485011"/>
        <Location id="250725" name="mark3" start="4772024" end="4772024" flags="IsMark" locked="0" position-lock-style="AudioTime" timestamp="1620485029"/>
        <Location id="250729" name="mark4" start="6879600" end="6879600" flags="IsMark" locked="0" position-lock-style="AudioTime" timestamp="1620485036"/>
        <Location id="250737" name="mark5" start="8996400" end="8996400" flags="IsMark" locked="0" position-lock-style="AudioTime" timestamp="1620485045"/>
        <Location id="250745" name="mark6" start="11113200" end="11113200" flags="IsMark" locked="0" position-lock-style="AudioTime" timestamp="1620485060"/>
      </Locations>
      <Locations>
        <Location id="111759" name="session" start="264600" end="13562200" flags="IsSessionRange" locked="0" position-lock-style="AudioTime" timestamp="1618153752"/>
        <Location id="250709" name="mark1" start="529200" end="529200" flags="IsMark" locked="0" position-lock-style="AudioTime" timestamp="1620484985"/>
        <Location id="250721" name="mark2" start="2656876" end="2656876" flags="IsMark" locked="0" position-lock-style="AudioTime" timestamp="1620485011"/>
        <Location id="250725" name="mark3" start="4772024" end="4772024" flags="IsMark" locked="0" position-lock-style="AudioTime" timestamp="1620485029"/>
        <Location id="250729" name="mark4" start="6879600" end="6879600" flags="IsMark" locked="0" position-lock-style="AudioTime" timestamp="1620485036"/>
        <Location id="250737" name="mark5" start="8996400" end="8996400" flags="IsMark" locked="0" position-lock-style="AudioTime" timestamp="1620485045"/>
        <Location id="250745" name="mark6" start="11113200" end="11113200" flags="IsMark" locked="0" position-lock-style="AudioTime" timestamp="1620485060"/>
      </Locations>
    </MementoCommand>
    <MementoCommand obj-id="43" type-name="SelectionMemento">
      <SelectionMemento mouse-mode="MouseObject" zoom="1690" left-frame="12333419" y-origin="1063">
        <Selection>
          <Regions>
            <Region id="821821"/>
          </Regions>
          <MIDINotes region-id="730292">
            <note note-id="302622"/>
          </MIDINotes>
          <Marker id="111759" start="0"/>
        </Selection>
      </SelectionMemento>
      <SelectionMemento mouse-mode="MouseObject" zoom="1690" left-frame="12333419" y-origin="1063">
        <Selection>
          <Regions>
            <Region id="821821"/>
          </Regions>
          <MIDINotes region-id="730292">
            <note note-id="302622"/>
          </MIDINotes>
          <Marker id="111759" start="0"/>
        </Selection>
      </SelectionMemento>
    </MementoCommand>
  </UndoTransaction>
  <UndoTransaction tv-sec="1621074419" tv-usec="768965" name="Region end trim">
    <StatefulDiffCommand obj-id="821821" type-name="ARDOUR::AudioRegion">
      <Changes>
        <length from="13230000" to="13299290"/>
        <Envelope>
          <from>
            <AutomationList automation-id="envelope" id="982837" interpolation-style="Exponential" state="Off">
              <events>0 1.4581669569015503
13230000 1.4581671953201294
</events>
            </AutomationList>
          </from>
          <to>
            <AutomationList automation-id="envelope" id="982838" interpolation-style="Exponential" state="Off">
              <events>0 1.4581669569015503
13230000 1.4581671953201294
13299290 1.4581671953201294
</events>
            </AutomationList>
          </to>
        </Envelope>
      </Changes>
    </StatefulDiffCommand>
    <MementoCommand obj-id="43" type-name="SelectionMemento">
      <SelectionMemento mouse-mode="MouseObject" zoom="1690" left-frame="12333419" y-origin="1063">
        <Selection>
          <Regions>
            <Region id="821821"/>
          </Regions>
          <MIDINotes region-id="730292">
            <note note-id="302622"/>
          </MIDINotes>
          <Marker id="111759" start="0"/>
        </Selection>
      </SelectionMemento>
      <SelectionMemento mouse-mode="MouseObject" zoom="1690" left-frame="12333419" y-origin="1063">
        <Selection>
          <Regions>
            <Region id="821821"/>
          </Regions>
          <MIDINotes region-id="730292">
            <note note-id="302622"/>
          </MIDINotes>
          <Marker id="111759" start="0"/>
        </Selection>
      </SelectionMemento>
    </MementoCommand>
  </UndoTransaction>
  <UndoTransaction tv-sec="1621074422" tv-usec="489790" name="change fade out length">
    <MementoCommand obj-id="821824" type-name="ARDOUR::AutomationList">
      <AutomationList automation-id="fadeout" id="821824" interpolation-style="Curved" state="Off">
        <events>0 1
322940 1.0000000116860974e-07
</events>
      </AutomationList>
      <AutomationList automation-id="fadeout" id="821824" interpolation-style="Curved" state="Off">
        <events>0 1
385470 1.0000000116860974e-07
</events>
      </AutomationList>
    </MementoCommand>
    <MementoCommand obj-id="43" type-name="SelectionMemento">
      <SelectionMemento mouse-mode="MouseObject" zoom="1690" left-frame="12333419" y-origin="1063">
        <Selection>
          <Regions>
            <Region id="821821"/>
          </Regions>
          <MIDINotes region-id="730292">
            <note note-id="302622"/>
          </MIDINotes>
          <Marker id="111759" start="0"/>
        </Selection>
      </SelectionMemento>
      <SelectionMemento mouse-mode="MouseObject" zoom="1690" left-frame="12333419" y-origin="1063">
        <Selection>
          <Regions>
            <Region id="821821"/>
          </Regions>
          <MIDINotes region-id="730292">
            <note note-id="302622"/>
          </MIDINotes>
          <Marker id="111759" start="0"/>
        </Selection>
      </SelectionMemento>
    </MementoCommand>
  </UndoTransaction>
  <UndoTransaction tv-sec="1621074427" tv-usec="370012" name="Region end trim">
    <MementoCommand obj-id="43" type-name="SelectionMemento">
      <SelectionMemento mouse-mode="MouseObject" zoom="1690" left-frame="12333419" y-origin="1063">
        <Selection>
          <Regions>
            <Region id="821821"/>
          </Regions>
          <MIDINotes region-id="730292">
            <note note-id="302622"/>
          </MIDINotes>
          <Marker id="111759" start="0"/>
        </Selection>
      </SelectionMemento>
      <SelectionMemento mouse-mode="MouseObject" zoom="1690" left-frame="12333419" y-origin="1063">
        <Selection>
          <Regions>
            <Region id="821821"/>
          </Regions>
          <MIDINotes region-id="730292">
            <note note-id="302622"/>
          </MIDINotes>
          <Marker id="111759" start="0"/>
        </Selection>
      </SelectionMemento>
    </MementoCommand>
  </UndoTransaction>
  <UndoTransaction tv-sec="1621074453" tv-usec="151455" name="automation event move">
    <MementoUndoCommand obj-id="982698" type-name="ARDOUR::AutomationList">
      <AutomationList automation-id="gain" id="982698" interpolation-style="Exponential" state="Play">
        <events>0 1.0001333951950073
10271282 1.0001335144042969
10602522 1.7047823667526245
13224971 1.6665910482406616
13502131 0
</events>
      </AutomationList>
    </MementoUndoCommand>
    <MementoRedoCommand obj-id="982698" type-name="ARDOUR::AutomationList">
      <AutomationList automation-id="gain" id="982698" interpolation-style="Exponential" state="Play">
        <events>0 1.0001333951950073
10271282 1.0001335144042969
10716300 1.6289941072463989
13224971 1.6665910482406616
13502131 0
</events>
      </AutomationList>
    </MementoRedoCommand>
    <MementoCommand obj-id="43" type-name="SelectionMemento">
      <SelectionMemento mouse-mode="MouseObject" zoom="1690" left-frame="9916748" y-origin="1063">
        <Selection>
          <MIDINotes region-id="730292">
            <note note-id="302622"/>
          </MIDINotes>
          <ControlPoint type="track" route-id="982695" automation-list-id="982698" parameter="gain" view-index="2"/>
          <Marker id="111759" start="0"/>
        </Selection>
      </SelectionMemento>
      <SelectionMemento mouse-mode="MouseObject" zoom="1690" left-frame="9916748" y-origin="1063">
        <Selection>
          <MIDINotes region-id="730292">
            <note note-id="302622"/>
          </MIDINotes>
          <ControlPoint type="track" route-id="982695" automation-list-id="982698" parameter="gain" view-index="2"/>
          <Marker id="111759" start="0"/>
        </Selection>
      </SelectionMemento>
    </MementoCommand>
  </UndoTransaction>
  <UndoTransaction tv-sec="1621074456" tv-usec="432969" name="automation event move">
    <MementoUndoCommand obj-id="982698" type-name="ARDOUR::AutomationList">
      <AutomationList automation-id="gain" id="982698" interpolation-style="Exponential" state="Play">
        <events>0 1.0001333951950073
10271282 1.0001335144042969
10716300 1.6289941072463989
13224971 1.6665910482406616
13502131 0
</events>
      </AutomationList>
    </MementoUndoCommand>
    <MementoRedoCommand obj-id="982698" type-name="ARDOUR::AutomationList">
      <AutomationList automation-id="gain" id="982698" interpolation-style="Exponential" state="Play">
        <events>0 1.0001333951950073
10319400 1.0001335144042969
10716300 1.6289941072463989
13224971 1.6665910482406616
13502131 0
</events>
      </AutomationList>
    </MementoRedoCommand>
    <MementoCommand obj-id="43" type-name="SelectionMemento">
      <SelectionMemento mouse-mode="MouseObject" zoom="1690" left-frame="9916748" y-origin="1063">
        <Selection>
          <MIDINotes region-id="730292">
            <note note-id="302622"/>
          </MIDINotes>
          <ControlPoint type="track" route-id="982695" automation-list-id="982698" parameter="gain" view-index="1"/>
          <Marker id="111759" start="0"/>
        </Selection>
      </SelectionMemento>
      <SelectionMemento mouse-mode="MouseObject" zoom="1690" left-frame="9916748" y-origin="1063">
        <Selection>
          <MIDINotes region-id="730292">
            <note note-id="302622"/>
          </MIDINotes>
          <ControlPoint type="track" route-id="982695" automation-list-id="982698" parameter="gain" view-index="1"/>
          <Marker id="111759" start="0"/>
        </Selection>
      </SelectionMemento>
    </MementoCommand>
  </UndoTransaction>
</UndoHistory>
