//===== rAthena Script =======================================
//= Lutie Town Pre-Renewal
//===== Description: =========================================
//= Lutie - City NPCs
//===== Additional Comments: =================================
//= 1.0 First version. [Lemongrass]
//============================================================

// Teleport to Lutie
//============================================================
aldebaran,223,222,4	duplicate(Sr. Noel)	Sr. Noel#1	718
