//===== rAthena Script =======================================
//= Lutie Town Renewal
//===== Description: =========================================
//= Lutie - City NPCs
//===== Additional Comments: =================================
//= 1.0 First version. [Lemongrass]
//============================================================

// Teleport to Lutie
//============================================================
aldebaran,168,168,4	duplicate(Sr. Noel)	Sr. Noel#1	718
