//===== rAthena Script =======================================
//= Lighthalzen Fields Monster Spawn Script
//===== By: ==================================================
//= Muad_Dib, rAthena Dev Team
//===== Current Version: =====================================
//= 1.5
//===== Compatible With: =====================================
//= rAthena Project
//===== Additional Comments: =================================
//= 1.0 by Muad_Dib (Prometheus Project)
//= 1.1 Added Porcellio by MasterOfMuppets
//= 1.2 Corrected monsters. Many thanks to vicious_pucca for
//=     the information [MasterOfMuppets]
//= 1.3 Updated acordingly to Episode 10.4 [Poki#3]
//= 1.4 Fully updated X.4 spawns [Playtester]
//= 1.5 More accurate spawns [Playtester]
//============================================================

//==================================================
// lhz_fild01 - Lighthalzen Field
//==================================================
lhz_fild01,0,0	monster	Metaling	1613,70
lhz_fild01,0,0	monster	Holden	1628,30
lhz_fild01,0,0	monster	Caramelo	1103,20
lhz_fild01,0,0	monster	Planta Vermelha	1078,10,60000,30000
lhz_fild01,0,0	monster	Planta Amarela	1081,10,60000,30000
lhz_fild01,0,0	monster	Planta Verde	1080,10,60000,30000

//==================================================
// lhz_fild02 - Lighthalzen Field (Grim Ripper's Valley)
//==================================================
lhz_fild02,0,0	monster	Metaling	1613,50
lhz_fild02,0,0	monster	Caramelo	1103,30
lhz_fild02,0,0	monster	Besouro-Chifre	1128,10
lhz_fild02,0,0	monster	Holden	1628,10
lhz_fild02,0,0	monster	Anopheles	1627,10
lhz_fild02,0,0	monster	Planta Amarela	1081,15,60000,30000
lhz_fild02,0,0	monster	Planta Verde	1080,15,60000,30000

//==================================================
// lhz_fild03 - Lighthalzen Field
//==================================================
lhz_fild03,262,233,74,140	monster	Talo de Verme	1215,50,600000
lhz_fild03,262,233,74,140	monster	Metaling	1613,20
lhz_fild03,127,248,45,140	monster	Caramelo	1103,20
lhz_fild03,127,248,45,140	monster	Besouro-Chifre	1128,10
lhz_fild03,127,248,45,140	monster	Rafflesia	1162,5
lhz_fild03,0,0	monster	Anopheles	1627,20
lhz_fild03,0,0	monster	Vento da Colina	1680,10
lhz_fild03,0,0	monster	Planta Vermelha	1078,10,60000,30000
lhz_fild03,0,0	monster	Planta Verde	1080,10,60000,30000
