//    ________________________________________________________
//   /                                                        \
//   |       _           _   _   _                            |
//   |      | |__  _ __ / \ | |_| |__   ___ _ __   __ _       |
//   |      | '_ \| '__/ _ \| __| '_ \ / _ \ '_ \ / _` |      |
//   |      | |_) | | / ___ \ |_| | | |  __/ | | | (_| |      |
//   |      |_.__/|_|/_/   \_\__|_| |_|\___|_| |_|\__,_|      |
//   |                                                        |
//   |                    brAthena Script                     |
//   |--------------------------------------------------------|
//   | Nome do Script: carvena_do_polvo.txt                   |
//   |--------------------------------------------------------|
//   | Criado por: Herc/brA Dev. Team                         |
//   |--------------------------------------------------------|
//   | Versões Herc/brA: 1.0/1.0                              |
//   |--------------------------------------------------------|
//   | Descrição: Caverna do Polvo                            |
//   |--------------------------------------------------------|
//   | Changelog:                                             |
//   | 1.0 First version. [Euphy]                             |
//   | 1.1 Instance system rewrite. [Euphy]                   |
//   | 1.2 Cabeçalho brAthena e tradução. [SoulKnown]         |
//   |--------------------------------------------------------|
//   | - Anotações                                            |
//   \________________________________________________________/


// Instance Creation :: oct
//============================================================
mal_dun01,151,235,5	script	Estrela do Mar	4_ASTER,{

	.@party_id = getcharid(1);
	.@md_name$ = "Caverna do Polvo";

	if (!.@party_id) {
		mes "[Estrela do Mar]";
		mes "Você não terá forças sozinho, hehe";
		mes "É melhor pedir ajuda a alguém.";
		mes "Faça parte de um grupo, e retorne.";
		close;
	}
	if (getcharid(0) != getpartyleader(.@party_id,2)) {
		mes "[Estrela do Mar]";
		mes "Onde está o seu líder, hehe.";
		mes "Não posso falar com qualquer pessoa.";
		mes "Traga o representante do grupo até mim.";
		close;
	}
	mes "[Estrela do Mar]";
	mes "Estou protegendo aqui, hehe!";
	mes "Por enquanto, está parcialmente bloqueada.";
	mes "Mas, algum dia, essa caverna vai ser fechada para sempre, hehe!";
	next;
	while(1) {
		switch(select("Perguntar o que está acontecendo.:Pedir para abrir o portão.:Ir para outro lugar.")) {
		case 1:
			mes "[Estrela do Mar]";
			mes "Ultimamente, nossa Estrela do Mar está tendo alguns problemas, ooh ooh.";
			mes "Algo sombrio anda acontecendo neste lugar que normalmente é tão tranquilo, hehe!";
			next;
			mes "[Estrela do Mar]";
			mes "Membros de uma organização secreta foram vistos saindo de um bueiro, e seguindo em direção à nossa senhora Estrela do Mar para sequestrá-la.";
			mes "Ooh Ooh.";
			next;
			mes "[Estrela do Mar]";
			mes "Tudo indica que esses membros pertencem a esse polvo pervertido.";
			mes "Devemos ter muita cautela com esse monstro.";
			next;
			mes "[Estrela do Mar]";
			mes "Desejo um dia encontrar alguém forte o bastante para combater este polvo pervertido.";
			mes "Espero que esse polvo jamais consiga alcançar seu objetivo em raptar a nossa Estrela do Mar.";
			next;
			mes "[Estrela do Mar]";
			mes "Precisamos que alguém vá em busca dele durante um certo período de tempo";
			mes "e, traga-o preso no arpão.";
			next;
			break;
		case 2:
			set .@playtime, checkquest(4197,PLAYTIME);
			if (.@playtime == 0 || .@playtime == 1) {
				mes "[Estrela do Mar]";
				mes "O polvo não está aqui agora.";
				mes "Por favor, retorne em outro momento.";
				close;
			}
			if (.@playtime == 2) erasequest 4197;
			if (countitem(6442)) {
				if (instance_create(.@md_name$) < 0) {
					mes "[Estrela do Mar]";
					mes "Nome do Grupo: ["+getpartyname(.@party_id)+"].";
					mes "Líder do Grupo: ["+strcharinfo(0)+"].";
					mes "^0000ff"+.@md_name$+"^000000, não pôde ser aberta agora.";
					mes "Por favor, tente mais tarde.";
					close;
				}
				mes "[Estrela do Mar]";
				mes "Vou abrir o portão por algum tempo ^0000ff"+.@md_name$+"^000000.";
				mes "Por favor, pegue aquele polvo pervertido,";
				mes "e volte com ele na ponta do seu arpão, hehe.";
				close;
			}
			mes "[Estrela do Mar]";
			mes "Você precisa se preparar primeiro, somente assim será capaz de enfrentá-lo";
			mes "Então, deixarei você ir se aprontar, hehe.";
			close;
		case 3:
			mes "[Estrela do Mar]";
			mes "Esta não é uma boa localização, confira outro lugar.";
			close;
		}
	}
}

mal_dun01,153,237,5	script	Entrada Estranha	CLEAR_NPC,{
	mes "Tem uma entrada estranha";
	mes "parcialmente bloqueada com algumas tábuas.";
	next;
	switch(select("Entrar.:Parar.")) {
	case 1:
		if (countitem(6442)) {
			switch(instance_enter("Octopus Cave")) {
			case IE_OTHER:
				mes "[Estrela do Mar]";
				mes "Ah, agora não é um momento apropriado.";
				mes "Volte mais tarde, tudo bem? Hehe.";
				close;
			case IE_NOINSTANCE:
			case IE_NOMEMBER:
				mes "[Starfish]";
				mes "Nesta entrada há um segredo.";
				mes "Então, por favor, tenha cuidado com ele, sim? Hehe.";
				close;
			case IE_OK:
				mapannounce "mal_dun01", strcharinfo(0)+" membro do grupo "+getpartyname(getcharid(1))+" entrou na Caverna e começou a caçar o Polvo!",bc_map,"0x00ff99";
				if (checkquest(4197) == -1) setquest 4197;
				//warp instance_mapname("1@cash"),199,99;
				close;
			default:
				mes "[Estrela do Mar]";
				mes "Shhh... Uma aura estranha foi expelida dessa entrada.";
				mes "Um grande desafio estará te aguardando se você entrar agora.";
				close;
			}
		}
		mes "[Estrela do Mar]";
		mes "É necessário que você se organize antes de ir à caçar do polvo.";
		mes "Senão, eu não posso deixá-lo passar! Hehe.";
		close;
	case 2:
		mes "[Estrela do Mar]";
		mes "Sim, sim, é melhor que você vá embora.";
		close;
	}
}

1@cash,199,99,0	script	oct_enter	HIDDEN_WARP_NPC,4,4,{
	end;
OnTouch:
	donpcevent instance_npcname("oct_enter_broad")+"::OnEnable";
	specialeffect EF_BASH;
	disablenpc instance_npcname("oct_enter");
	end;
}

1@cash,1,1,0	script	oct_enter_broad	-1,{
	end;
OnInstanceInit:
	donpcevent instance_npcname("oct_enter_broad")+"::OnDisable";
	end;
OnEnable:
	enablenpc instance_npcname("oct_enter_broad");
	donpcevent instance_npcname("oct_foot_4")+"::OnEnable";
	donpcevent instance_npcname("oct_mob_con")+"::OnEnable";
	initnpctimer;
	end;
OnDisable:
	disablenpc instance_npcname("oct_enter_broad");
	end;
OnTimer1000:
	mapannounce instance_mapname("1@cash"),"Polvo pervertido: Como você ousa entrar na minha casa!",bc_map,"0xFFFF00";
	end;
OnTimer4000:
	mapannounce instance_mapname("1@cash"),"Polvo pervertido: Mas eu bloqueei todos os portões da caverna! Não há nada que você possa fazer!",bc_map,"0xFFFF00";
	end;
OnTimer7000:
	mapannounce instance_mapname("1@cash"),"Polvo pervertido: Meus jovens... Aqui está o brinquedo de vocês! Brinquem com ele... Hahaha.",bc_map,"0xFFFF00";
	stopnpctimer;
	donpcevent instance_npcname("oct_enter_broad")+"::OnDisable";
	end;
}

1@cash,3,3,0	script	oct_foot_4	-1,{
	end;
OnInstanceInit:
	donpcevent instance_npcname("oct_foot_4")+"::OnDisable";
	end;
OnEnable:
	enablenpc instance_npcname("oct_foot_4");
	donpcevent instance_npcname("oct_foot1")+"::OnEnable";
	donpcevent instance_npcname("oct_foot2")+"::OnEnable";
	donpcevent instance_npcname("oct_foot3")+"::OnEnable";
	donpcevent instance_npcname("oct_foot4")+"::OnEnable";
	.@map$ = instance_mapname("1@cash");
	monster .@map$,20,114,"Tentáculo de Polvo#1",2193,1,instance_npcname("oct_foot_4")+"::OnMyMobDead";
	monster .@map$,88,190,"Tentáculo de Polvo#2",2193,1,instance_npcname("oct_foot_4")+"::OnMyMobDead";
	monster .@map$,307,215,"Tentáculo de Polvo#3",2193,1,instance_npcname("oct_foot_4")+"::OnMyMobDead";
	monster .@map$,372,131,"Tentáculo de Polvo#4",2193,1,instance_npcname("oct_foot_4")+"::OnMyMobDead";
	end;
OnDisable:
	disablenpc instance_npcname("oct_foot_4");
	end;
OnMyMobDead:
	.@map$ = instance_mapname("1@cash");
	if (mobcount(.@map$,instance_npcname("oct_foot_4")+"::OnMyMobDead") < 1) {
		donpcevent instance_npcname("oct_boss_con")+"::OnEnable";
		mapannounce .@map$,"Ei, vocês!!! Eu vou tomar conta de todos vocês pessoalmente! Vamos nessa!",bc_map,"0x00ff99";
		enablenpc instance_npcname("oct_boss_warp");
		instance_warpall .@map$,199,99;
		end;
	}
	mapannounce .@map$,"Arrgg!! Isso dói!!! Preciso de uma estratégia...",bc_map,"0x00ff99";
	end;
}

1@cash,20,114,0	script	oct_foot1	HIDDEN_WARP_NPC,6,6,{
	end;
OnInstanceInit:
	donpcevent instance_npcname(strnpcinfo(0))+"::OnDisable";
	end;
OnEnable:
	enablenpc instance_npcname(strnpcinfo(0));
	.@label$ = instance_npcname(strnpcinfo(0))+"::OnMyMobDead";
	.@i = atoi(charat(strnpcinfo(0),8));
	.@map$ = instance_mapname("1@cash");
	switch(.@i) {
	case 1:
		areamonster .@map$,34,96,38,100,"Polvo Pequeno",2192,3,.@label$;
		areamonster .@map$,39,90,41,92,"Polvo Pequeno",2192,2,.@label$;
		areamonster .@map$,38,76,40,78,"Polvo Pequeno",2192,2,.@label$;
		areamonster .@map$,39,58,41,60,"Polvo Pequeno",2192,2,.@label$;
		areamonster .@map$,50,38,56,44,"Polvo Pequeno",2192,5,.@label$;
		areamonster .@map$,68,32,72,36,"Polvo Pequeno",2192,5,.@label$;
		areamonster .@map$,83,26,85,28,"Polvo Pequeno",2192,2,.@label$;
		areamonster .@map$,107,28,109,30,"Polvo Pequeno",2192,1,.@label$;
		areamonster .@map$,123,28,125,30,"Polvo Pequeno",2192,2,.@label$;
		areamonster .@map$,134,31,138,35,"Polvo Pequeno",2192,5,.@label$;
		areamonster .@map$,142,39,146,43,"Polvo Pequeno",2192,2,.@label$;
		break;
	case 2:
		areamonster .@map$,139,113,143,117,"Polvo Pequeno",2192,5,.@label$;
		areamonster .@map$,135,104,137,106,"Polvo Pequeno",2192,2,.@label$;
		areamonster .@map$,123,93,127,97,"Polvo Pequeno",2192,3,.@label$;
		areamonster .@map$,113,90,115,92,"Polvo Pequeno",2192,2,.@label$;
		areamonster .@map$,103,89,105,91,"Polvo Pequeno",2192,2,.@label$;
		areamonster .@map$,89,90,91,92,"Polvo Pequeno",2192,2,.@label$;
		areamonster .@map$,74,104,76,106,"Polvo Pequeno",2192,2,.@label$;
		areamonster .@map$,74,120,76,122,"Polvo Pequeno",2192,2,.@label$;
		areamonster .@map$,83,131,87,135,"Polvo Pequeno",2192,3,.@label$;
		areamonster .@map$,92,142,94,144,"Polvo Pequeno",2192,2,.@label$;
		areamonster .@map$,98,159,100,161,"Polvo Pequeno",2192,2,.@label$;
		areamonster .@map$,94,180,98,184,"Polvo Pequeno",2192,5,.@label$;
		break;
	case 3:
		areamonster .@map$,299,209,303,213,"Polvo Pequeno",2192,3,.@label$;
		areamonster .@map$,292,203,296,207,"Polvo Pequeno",2192,3,.@label$;
		areamonster .@map$,291,186,293,188,"Polvo Pequeno",2192,2,.@label$;
		areamonster .@map$,292,166,294,168,"Polvo Pequeno",2192,2,.@label$;
		areamonster .@map$,293,151,295,153,"Polvo Pequeno",2192,2,.@label$;
		areamonster .@map$,299,137,303,141,"Polvo Pequeno",2192,2,.@label$;
		areamonster .@map$,300,123,304,127,"Polvo Pequeno",2192,2,.@label$;
		areamonster .@map$,300,104,304,108,"Polvo Pequeno",2192,3,.@label$;
		areamonster .@map$,279,101,281,103,"Polvo Pequeno",2192,2,.@label$;
		monster .@map$,260,103,"Polvo Pequeno",2192,1,.@label$;
		break;
	case 4:
		areamonster .@map$,363,123,367,127,"Polvo Pequeno",2192,2,.@label$;
		areamonster .@map$,364,108,368,112,"Polvo Pequeno",2192,5,.@label$;
		areamonster .@map$,363,93,367,97,"Polvo Pequeno",2192,3,.@label$;
		areamonster .@map$,364,72,366,74,"Polvo Pequeno",2192,2,.@label$;
		areamonster .@map$,364,58,366,60,"Polvo Pequeno",2192,2,.@label$;
		areamonster .@map$,355,44,359,48,"Polvo Pequeno",2192,3,.@label$;
		areamonster .@map$,346,36,350,40,"Polvo Pequeno",2192,3,.@label$;
		areamonster .@map$,319,28,325,34,"Polvo Pequeno",2192,5,.@label$;
		areamonster .@map$,305,27,307,29,"Polvo Pequeno",2192,2,.@label$;
		areamonster .@map$,276,29,280,33,"Polvo Pequeno",2192,5,.@label$;
		areamonster .@map$,258,37,262,41,"Polvo Pequeno",2192,2,.@label$;
		break;
	}
	end;
OnDisable:
	killmonster instance_mapname("1@cash"),instance_npcname(strnpcinfo(0))+"::OnMyMobDead";
	disablenpc instance_npcname(strnpcinfo(0));
	end;
OnTouch:
	if (getd("."+strnpcinfo(0)+instance_id())) end;
	setd "."+strnpcinfo(0)+instance_id(),1;
	hideonnpc instance_npcname(strnpcinfo(0));
	mapannounce instance_mapname("1@cash"),"Saiam, meus bebês, venham me ajudar!",bc_map,"0xFFFF00";
	initnpctimer;
	end;
OnTimer5000:
	.@map$ = instance_mapname("1@cash");
	mapannounce .@map$,"Vamos ensinar uma lição a eles!",bc_map,"0xFFFF00";
	.@label$ = instance_npcname(strnpcinfo(0))+"::OnMyMobDead";
	.@i = atoi(charat(strnpcinfo(0),8));
	switch(.@i) {
	case 1:
		areamonster .@map$,18,112,22,116,"Polvo Pequeno",2192,3,.@label$;
		areamonster .@map$,18,112,22,116,"Polvo Pequeno",2192,3,.@label$;
		break;
	case 2:
		areamonster .@map$,86,188,90,192,"Polvo Pequeno",2192,3,.@label$;
		areamonster .@map$,96,98,100,102,"Polvo Pequeno",2192,3,.@label$;
		break;
	case 3:
		areamonster .@map$,305,213,309,217,"Polvo Pequeno",2192,3,.@label$;
		areamonster .@map$,305,213,309,217,"Polvo Pequeno",2192,3,.@label$;
		break;
	case 4:
		areamonster .@map$,370,129,374,133,"Polvo Pequeno",2192,3,.@label$;
		areamonster .@map$,370,129,374,133,"Polvo Pequeno",2192,3,.@label$;
		break;
	}
	end;
OnTimer30000:
	setd "."+strnpcinfo(0)+instance_id(),0;
	stopnpctimer;
	.@i = atoi(charat(strnpcinfo(0),8));
	donpcevent instance_npcname("oct_foot_exit"+.@i)+"::OnEnable";
	donpcevent instance_npcname(strnpcinfo(0))+"::OnDisable";
	end;
OnMyMobDead:
	.@map$ = instance_mapname("1@cash");
	if (mobcount(.@map$,instance_npcname(strnpcinfo(0))+"::OnMyMobDead") < 1) {
		mapannounce .@map$,"Você machucou os meus bebês! Vai ter que pagar por isso!",bc_map,"0x00ff99";
		setd "."+strnpcinfo(0)+instance_id(),0;
		stopnpctimer;
		.@i = atoi(charat(strnpcinfo(0),8));
		donpcevent instance_npcname("oct_foot_exit"+.@i)+"::OnEnable";
		donpcevent instance_npcname(strnpcinfo(0))+"::OnDisable";
		end;
	}
	end;
}
1@cash,88,190,0	duplicate(oct_foot1)	oct_foot2	HIDDEN_WARP_NPC,6,6
1@cash,307,215,0	duplicate(oct_foot1)	oct_foot3	HIDDEN_WARP_NPC,6,6
1@cash,372,131,0	duplicate(oct_foot1)	oct_foot4	HIDDEN_WARP_NPC,6,6

1@cash,16,117,0	script	oct_foot_exit1	WARPNPC,2,2,{
	end;
OnInstanceInit:
	disablenpc instance_npcname(strnpcinfo(0));
	end;
OnEnable:
	enablenpc instance_npcname(strnpcinfo(0));
	end;
OnTouch:
	warp instance_mapname("1@cash"),198,99;
	end;
}
1@cash,77,193,0	duplicate(oct_foot_exit1)	oct_foot_exit2	WARPNPC,2,2
1@cash,312,214,0	duplicate(oct_foot_exit1)	oct_foot_exit3	WARPNPC,2,2
1@cash,370,139,0	duplicate(oct_foot_exit1)	oct_foot_exit4	WARPNPC,2,2

1@cash,15,15,0	script	oct_mob_con	-1,{
	end;
OnInstanceInit:
	donpcevent instance_npcname("oct_mob_con")+"::OnDisable";
	end;
OnEnable:
	.@map$ = instance_mapname("1@cash");
	enablenpc instance_npcname("oct_mob_con");
	monster .@map$,32,94,"Hidra",1068,1;
	monster .@map$,41,101,"Hidra",1068,1;
	monster .@map$,35,78,"Hidra",1068,1;
	monster .@map$,35,62,"Hidra",1068,1;
	monster .@map$,49,54,"Hidra",1068,1;
	monster .@map$,70,28,"Hidra",1068,1;
	monster .@map$,83,22,"Hidra",1068,1;
	monster .@map$,99,23,"Hidra",1068,1;
	monster .@map$,115,23,"Hidra",1068,1;
	monster .@map$,132,25,"Hidra",1068,1;
	monster .@map$,100,185,"Hidra",1068,1;
	monster .@map$,92,178,"Hidra",1068,1;
	monster .@map$,92,162,"Hidra",1068,1;
	monster .@map$,70,121,"Hidra",1068,1;
	monster .@map$,70,105,"Hidra",1068,1;
	monster .@map$,105,85,"Hidra",1068,1;
	monster .@map$,121,84,"Hidra",1068,1;
	monster .@map$,292,209,"Hidra",1068,1;
	monster .@map$,303,206,"Hidra",1068,1;
	monster .@map$,290,163,"Hidra",1068,1;
	monster .@map$,299,150,"Hidra",1068,1;
	monster .@map$,308,141,"Hidra",1068,1;
	monster .@map$,308,125,"Hidra",1068,1;
	monster .@map$,295,97,"Hidra",1068,1;
	monster .@map$,279,97,"Hidra",1068,1;
	monster .@map$,370,111,"Hidra",1068,1;
	monster .@map$,370,110,"Hidra",1068,1;
	monster .@map$,371,96,"Hidra",1068,1;
	monster .@map$,371,80,"Hidra",1068,1;
	monster .@map$,367,55,"Hidra",1068,1;
	monster .@map$,343,29,"Hidra",1068,1;
	monster .@map$,327,24,"Hidra",1068,1;
	monster .@map$,311,22,"Hidra",1068,1;
	monster .@map$,295,22,"Hidra",1068,1;
	monster .@map$,279,22,"Hidra",1068,1;
	areamonster .@map$,30,67,50,87,"Stapo",1784,1;
	areamonster .@map$,102,19,122,39,"Stapo",1784,1;
	areamonster .@map$,89,138,109,158,"Stapo",1784,1;
	areamonster .@map$,112,83,132,103,"Stapo",1784,1;
	areamonster .@map$,283,168,303,188,"Stapo",1784,1;
	areamonster .@map$,292,97,312,117,"Stapo",1784,1;
	areamonster .@map$,355,64,375,84,"Stapo",1784,1;
	areamonster .@map$,317,17,337,37,"Stapo",1784,1;
	donpcevent instance_npcname("oct_backattack1")+"::OnEnable";
	donpcevent instance_npcname("oct_backattack2")+"::OnEnable";
	donpcevent instance_npcname("oct_backattack3")+"::OnEnable";
	donpcevent instance_npcname("oct_backattack4")+"::OnEnable";
	donpcevent instance_npcname("oct_mob_con")+"::OnDisable";
	end;
OnDisable:
	disablenpc instance_npcname("oct_mob_con");
	end;
}

1@cash,45,53,0	script	oct_backattack1	HIDDEN_WARP_NPC,3,3,{
	end;
OnInstanceInit:
	disablenpc instance_npcname("oct_backattack1");
	end;
OnTouch:
	.@map$ = instance_mapname("1@cash");
	monster .@map$,39,59,"Hidra",1068,1;
	monster .@map$,40,59,"Hidra",1068,1;
	monster .@map$,41,59,"Hidra",1068,1;
	monster .@map$,47,50,"Hidra",1068,1;
	monster .@map$,48,50,"Hidra",1068,1;
	monster .@map$,49,50,"Hidra",1068,1;
	monster .@map$,41,53,"Polvo Pequeno",2192,1;
	mapannounce .@map$,"Não deixem que eles passem, impeça-os!!!",bc_map,"0x00ff99";
	specialeffect EF_BASH;
	disablenpc instance_npcname("oct_backattack1");
	end;
OnEnable:
	enablenpc instance_npcname("oct_backattack1");
	end;
}

1@cash,78,99,0	script	oct_backattack2	HIDDEN_WARP_NPC,3,3,{
	end;
OnInstanceInit:
	disablenpc instance_npcname("oct_backattack2");
	end;
OnTouch:
	if (getd("."+instance_id())) end;
	setd "."+instance_id(),1;
	initnpctimer;
	.@map$ = instance_mapname("1@cash");
	monster .@map$,71,105,"Polvo Pequeno",2192,1;
	mapannounce .@map$,"O quartel-general está vázio, VÁ!!!",bc_map,"0x00ff99";
	hideonnpc instance_npcname("oct_backattack2");
	end;
OnTimer2000:
	.@map$ = instance_mapname("1@cash");
	monster .@map$,71,105,"Polvo Pequeno",2192,1;
	mapannounce .@map$,"Corra, CORRA! Vá, VÁ!!!",bc_map,"0x00ff99";
	end;
OnTimer4000:
	.@map$ = instance_mapname("1@cash");
	monster .@map$,71,105,"Polvo Pequeno",2192,1;
	mapannounce .@map$,"Não temos tempo, saia, rápido!",bc_map,"0x00ff99";
	end;
OnTimer6000:
	.@map$ = instance_mapname("1@cash");
	monster .@map$,71,105,"Polvo Pequeno",2192,3;
	mapannounce .@map$,"Vamos tomar o quartel-general!!!",bc_map,"0x00ff99";
	end;
OnTimer8000:
	.@map$ = instance_mapname("1@cash");
	monster .@map$,71,105,"Polvo Pequeno",2192,1;
	mapannounce .@map$,"Não temos tempo a perder, vamos logo!!!",bc_map,"0x00ff99";
	stopnpctimer;
	end;
OnEnable:
	enablenpc instance_npcname("oct_backattack2");
	end;
}

1@cash,299,144,0	script	oct_backattack3	HIDDEN_WARP_NPC,3,3,{
	end;
OnInstanceInit:
	disablenpc instance_npcname("oct_backattack3");
	end;
OnTouch:
	if (getd("."+instance_id())) end;
	setd "."+instance_id(),1;
	.@map$ = instance_mapname("1@cash");
	monster .@map$,293,153,"Polvo Pequeno",2192,1;
	monster .@map$,294,152,"Polvo Pequeno",2192,1;
	monster .@map$,292,153,"Polvo Pequeno",2192,1;
	monster .@map$,293,151,"Polvo Pequeno",2192,1;
	monster .@map$,293,152,"Lula Mercenária",2175,1;
	mapannounce .@map$,"Hahaha! Surpresos??!!",bc_map,"0x00ff99";
	initnpctimer;
	hideonnpc instance_npcname("oct_backattack3");
	end;
OnTimer5000:
	mapannounce instance_mapname("1@cash"),"... Parece que temos um espião entre nós.",bc_map,"0x00ff99";
	stopnpctimer;
	end;
OnEnable:
	enablenpc instance_npcname("oct_backattack3");
	end;
}

1@cash,336,36,0	script	oct_backattack4	HIDDEN_WARP_NPC,3,3,{
	end;
OnInstanceInit:
	disablenpc instance_npcname("oct_backattack4");
	end;
OnTouch:
	if (getd("."+instance_id())) end;
	setd "."+instance_id(),1;
	.@map$ = instance_mapname("1@cash");
	monster .@map$,332,37,"Polvo Pequeno",2192,1;
	monster .@map$,332,36,"Polvo Pequeno",2192,1;
	monster .@map$,332,35,"Polvo Pequeno",2192,1;
	monster .@map$,332,34,"Polvo Pequeno",2192,1;
	monster .@map$,341,37,"Polvo Pequeno",2192,1;
	monster .@map$,341,36,"Polvo Pequeno",2192,1;
	monster .@map$,341,35,"Polvo Pequeno",2192,1;
	monster .@map$,341,34,"Polvo Pequeno",2192,1;
	monster .@map$,260,40,"Lula Mercenária",2175,1;
	monster .@map$,260,41,"Lula Mercenária",2175,1;
	monster .@map$,260,39,"Lula Mercenária",2175,1;
	monster .@map$,259,40,"Lula Mercenária",2175,1;
	monster .@map$,261,40,"Lula Mercenária",2175,1;
	mapannounce .@map$,"Que tática bem-sucedida com a pinça! O inimigo é forte! Não vamos nos perder! De qualquer forma, onde estão todos os mercenários?",bc_map,"0x00ff99";
	initnpctimer;
	hideonnpc instance_npcname("oct_backattack4");
	end;
OnTimer5000:
	mapannounce instance_mapname("1@cash"),"Marte mercenária: He... He... Direção errada. Não nenhum inimigo nessa direção.",bc_map,"0x00ff99";
	end;
OnTimer7000:
	mapannounce instance_mapname("1@cash"),"Polvo pervertido: Tolos! Você não consegue ler o mapa?!?! Imprestável!",bc_map,"0x00ff99";
	stopnpctimer;
	end;
OnEnable:
	enablenpc instance_npcname("oct_backattack4");
	end;
}

1@cash,2,2,0	script	oct_boss_con	-1,{
	end;
OnInstanceInit:
	donpcevent instance_npcname("oct_boss_con")+"::OnDisable";
	end;
OnDisable:
	disablenpc instance_npcname("oct_boss_con");
	end;
OnEnable:
	enablenpc instance_npcname("oct_boss_con");
	donpcevent instance_npcname("oct_boss_foot")+"::OnEnable";
	monster instance_mapname("1@cash"),199,188,"Polvo Gigante",2192,1,instance_npcname("oct_boss_con")+"::OnMyMobDead";
	initnpctimer;
	end;
OnTimer7000:
	callsub OnAnnounce,
		"Você não vai atacar uma pessoa de bem.",
		"Fui despedido da fabrica de tinta na semana passada.",
		"Polvo nojento: Arghhhhh, qual é!";
	end;
OnTimer14000:
	callsub OnAnnounce,
		"Por que... Por que você consegue entender o que eu sinto?",
		"Sabe como é difícil para viver hoje em dia por não haver tantas aventuras?",
		"Vocês... Eu vou destruir todos vocês...!";
	end;
OnTimer21000:
	callsub OnAnnounce,
		"O quê? Sou um Polvo nojento? Vocês são sádicos.",
		"Não vamos fazer isso, que tal procurarmos a melhor solução, hein?",
		"Mesmo se eu falhar aqui, continuarei a voltar, sempre!!!";
	end;
OnTimer28000:
	callsub OnAnnounce,
		"O instinto de reprodução é para os machos, o que eu fiz de errado?",
		"Você realmente quer resolver o problema com os seres humanos através da violência? Ah, eu sou um polvo...",
		"Isso é o suficiente! Desista!";
	end;
OnTimer35000:
	callsub OnAnnounce,
		"Eu tenho que passar o Natal sozinho novamente...",
		"O desemprego dos jovens tornou-se um grande problema nos dias de hoje... Você não vai conseguir um emprego se ficar aqui jogando.",
		"Isto é, acabará como eu!";
	end;
OnTimer42000:
	callsub OnAnnounce,
		"Vejo em seu coração acho que você deve parar...",
		"Não faça isso!",
		"Você vai continuar fazendo isso até o fim, é isso?";
	end;
OnTimer49000:
	callsub OnAnnounce,
		"errrrrrrrrrrrrrrrrrrrrrrrr... Coff!Coff!",
		"Polvo nojento: A violência não é necessária neste caso.",
		"Este é meu território!!!";
	stopnpctimer;
	initnpctimer;
	end;
OnAnnounce:
	mapannounce instance_mapname("1@cash"),"Polvo nojento: "+getarg(rand(3)),bc_map,"0xFFFF00";
	return;
OnMyMobDead:
	.@map$ = instance_mapname("1@cash");
	if (mobcount(.@map$,instance_npcname("oct_boss_con")+"::OnMyMobDead") < 1) {
		mapannounce .@map$,"Polvo nojento: Isso é o suficiente por hoje! Da próxima vez, vou brincar muito com você.",bc_map,"0xFFFF00";
		enablenpc instance_npcname("oct_exit_1");
		enablenpc instance_npcname("oct_exit_2");
		donpcevent instance_npcname("oct_boss_foot")+"::OnDisable";
		stopnpctimer;
		donpcevent instance_npcname("oct_boss_con")+"::OnDisable";
		end;
	}
	end;
}

1@cash,4,4,0	script	oct_boss_foot	-1,{
	end;
OnInstanceInit:
	donpcevent instance_npcname("oct_boss_foot")+"::OnDisable";
	end;
OnEnable:
	enablenpc instance_npcname("oct_boss_foot");
	initnpctimer;
	end;
OnCall:
	.@map$ = instance_mapname("1@cash");
	if (mobcount(.@map$,instance_npcname("oct_boss_foot")+"::OnMyMobDead") < 100) {
		switch(rand(2)) {
		case 0:
			mapannounce .@map$,"Polvo nojento: Sabe quantas pernas tem um polvo? Não importa, tenho infinitas pernas!",bc_map,"0xFFFF00";
			areamonster .@map$,192,181,206,195,"Tentáculo de Polvo",2193,1,instance_npcname("oct_boss_foot")+"::OnMyMobDead";
			break;
		case 1:
			mapannounce .@map$,"Polvo nojento: Não... consigo mais.. segurar os meus bebês, por favor, saia e lute!",bc_map,"0xFFFF00";
			areamonster .@map$,192,181,206,195,"Polvo Pequeno",2192,5,instance_npcname("oct_boss_foot")+"::OnMyMobDead";
			break;
		}
	}
	initnpctimer;
	end;
OnTimer10000:
	stopnpctimer;
	donpcevent instance_npcname("oct_boss_foot")+"::OnCall";
	end;
OnDisable:
	stopnpctimer;
	killmonster instance_mapname("1@cash"),instance_npcname("oct_boss_foot")+"::OnMyMobDead";
	disablenpc instance_npcname("oct_boss_foot");
	end;
OnMyMobDead:
	end;
}

1@cash,198,116,0	script	oct_boss_warp	WARPNPC,2,2,{
	end;
OnInstanceInit:
	disablenpc instance_npcname("oct_boss_warp");
	end;
OnTouch:
	warp instance_mapname("1@cash"),210,172;
	end;
}

1@cash,190,208,0	script	oct_exit_1	WARPNPC,2,2,{
	end;
OnInstanceInit:
	disablenpc instance_npcname(strnpcinfo(0));
	end;
OnTouch:
	mes "Você quer sair do calabouço do polvo?";
	next;
	if(select("Não!:Sim!") == 2)
		warp "mal_dun01",153,233;
	close;
}
1@cash,198,82,0	duplicate(oct_exit_1)	oct_exit_2	WARPNPC,2,2

1@cash,193,82,0	warp	oct_door1	2,2,1@cash,151,48
1@cash,154,53,0	warp	oct_door2	2,2,1@cash,197,87
1@cash,187,99,0	warp	oct_door3	2,2,1@cash,148,128
1@cash,153,133,0	warp	oct_door4	2,2,1@cash,197,99
1@cash,209,100,0	warp	oct_door5	2,2,1@cash,250,111
1@cash,244,118,0	warp	oct_door6	2,2,1@cash,199,100
1@cash,209,83,0	warp	oct_door7	2,2,1@cash,252,46
1@cash,246,53,0	warp	oct_door8	2,2,1@cash,203,83