{
  "Records": [
    {
      "eventVersion": "2.1",
      "eventSource": "aws:s3",
      "awsRegion": "ap-southeast-1",
      "eventTime": "2019-05-11T01:18:33.384Z",
      "eventName": "ObjectCreated:Put",
      "userIdentity": {
        "principalId": "A3NA26JE4VFO0T"
      },
      "requestParameters": {
        "sourceIPAddress": "184.22.80.24"
      },
      "responseElements": {
        "x-amz-request-id": "EBA8FAE6E85891FF",
        "x-amz-id-2": "LXj1Mi5ZsxP35PIbGknu8UXEL/jYlUPu1GtFQNQuciDaKDgyRiOnNz1CAUSYYCqg7OcK9c/EnTk="
      },
      "s3": {
        "s3SchemaVersion": "1.0",
        "configurationId": "TransferToEfsEvent",
        "bucket": {
          "name": "s3-lambda-efs-input-bucket",
          "ownerIdentity": {
            "principalId": "A3NA26JE4VFO0T"
          },
          "arn": "arn:aws:s3:::s3-lambda-efs-input-bucket"
        },
        "object": {
          "key": "test-3.txt",
          "size": 6,
          "eTag": "b1946ac92492d2347c6235b4d2611184",
          "sequencer": "005CD622E959A2CC31"
        }
      }
    }
  ]
}