{
  "$id": "https://example.com/merchant.schema.json",
  "$schema": "http://json-schema.org/draft-07/schema#",
  "type": "object",
  "required": [
    "ownerDetail.firstname",
    "ownerDetail.lastname",
    "shopDetail.name.th",
    "shopDetail.contactNo"
  ],
  "properties": {
    "ownerDetail.title": {
      "type": "string",
      "enum": [
        "mr",
        "mrs",
        "miss"
      ]
    },
    "ownerDetail.firstname": {
      "type": "string",
      "maxLength": 15
    },
    "ownerDetail.lastname": {
      "type": "string",
      "maxLength": 15
    },
    "shopDetail.name.th": {
      "type": "string"
    },
    "shopDetail.name.en": {
      "type": "string",
      "minLength": 1
    },
    "shopDetail.contactNo": {
      "type": "string",
      "pattern": "\\d{3}-\\d{3}-\\d{4}"
    }
  }
}
