{
  "name": "devsapp_di01",
  "description": "",
  "cookbook_versions": {

  },
  "json_class": "Chef::Environment",
  "chef_type": "environment",
  "default_attributes": {
    "io_env": "devsapp",
    "io_di": "di01",
    "io_site": "sapp-a"
  },
  "override_attributes": {
    "ssl_test": true,
    "saas": {
      "property_overrides": {
        "hls": {
          "memcached.endpoints": "cache01.di01.dev:11211",
          "cassandra.host.node": "cass01.di01.dev,cass02.di01.dev",
          "cassandra.login.user": "cassandra",
          "sapp.relational.db.url": "jdbc:oracle:thin:@db01.di01.dev:1521/SAPDEV",
          "sapp.relational.db.username": "SAAS_DEV_SAPP",
          "system.relational.db.url": "jdbc:oracle:thin:@db01.di01.dev:1521/SAPDEV",
          "system.relational.db.username": "SAAS_DEV_SYSTEM",
          "di.domain": "sapp.net",
          "di.env": "devsapp"
        },
        "subscriber": {
          "memcached.endpoints": "cache01.di01.dev:11211",
          "cassandra.host.node": "cass01.di01.dev,cass02.di01.dev",
          "cassandra.login.user": "cassandra",
          "sapp.relational.db.url": "jdbc:oracle:thin:@db01.di01.dev:1521/SAPDEV",
          "sapp.relational.db.username": "SAAS_DEV_SAPP",
          "system.relational.db.url": "jdbc:oracle:thin:@db01.di01.dev:1521/SAPDEV",
          "system.relational.db.username": "SAAS_DEV_SYSTEM",
          "di.domain": "sapp.net",
          "di.env": "devsapp"
        },
        "partner": {
          "memcached.endpoints": "cache01.di01.dev:11211",
          "cassandra.host.node": "cass01.di01.dev,cass02.di01.dev",
          "cassandra.login.user": "cassandra",
          "sapp.relational.db.url": "jdbc:oracle:thin:@db01.di01.dev:1521/SAPDEV",
          "sapp.relational.db.username": "SAAS_DEV_SAPP",
          "system.relational.db.url": "jdbc:oracle:thin:@db01.di01.dev:1521/SAPDEV",
          "system.relational.db.username": "SAAS_DEV_SYSTEM",
          "di.domain": "sapp.net",
          "di.env": "devsapp"
        },
        "ums": {
          "memcached.endpoints": "cache01.di01.dev:11211",
          "cassandra.host.node": "cass01.di01.dev,cass02.di01.dev",
          "cassandra.login.user": "cassandra",
          "sapp.relational.db.url": "jdbc:oracle:thin:@db01.di01.dev:1521/SAPDEV",
          "sapp.relational.db.username": "SAAS_DEV_SAPP",
          "system.relational.db.url": "jdbc:oracle:thin:@db01.di01.dev:1521/SAPDEV",
          "system.relational.db.username": "SAAS_DEV_SYSTEM"
        },
        "plancycle": {
          "memcached.endpoints": "cache01.di01.dev:11211",
          "cassandra.host.node": "cass01.di01.dev,cass02.di01.dev",
          "cassandra.login.user": "cassandra",
          "sapp.relational.db.url": "jdbc:oracle:thin:@db01.di01.dev:1521/SAPDEV",
          "sapp.relational.db.username": "SAAS_DEV_SAPP",
          "system.relational.db.url": "jdbc:oracle:thin:@db01.di01.dev:1521/SAPDEV",
          "system.relational.db.username": "SAAS_DEV_SYSTEM"
        },
        "notify": {
          "memcached.endpoints": "cache01.di01.dev:11211",
          "cassandra.host.node": "cass01.di01.dev,cass02.di01.dev",
          "cassandra.login.user": "cassandra",
          "sapp.relational.db.url": "jdbc:oracle:thin:@db01.di01.dev:1521/SAPDEV",
          "sapp.relational.db.username": "SAAS_DEV_SAPP",
          "system.relational.db.url": "jdbc:oracle:thin:@db01.di01.dev:1521/SAPDEV",
          "system.relational.db.username": "SAAS_DEV_SYSTEM"
        },
        "sapp-adapter": {
          "memcached.endpoints": "cache01.di01.dev:11211",
          "cassandra.host.node": "cass01.di01.dev,cass02.di01.dev",
          "cassandra.login.user": "cassandra",
          "sapp.relational.db.url": "jdbc:oracle:thin:@db01.di01.dev:1521/SAPDEV",
          "sapp.relational.db.username": "SAAS_DEV_SAPP",
          "system.relational.db.url": "jdbc:oracle:thin:@db01.di01.dev:1521/SAPDEV",
          "system.relational.db.username": "SAAS_DEV_SYSTEM",
          "hls.base.url": "http://home-di01-service.devsapp.com:8680",
          "saas.base.url": "http://subscriber-di01-service.devsapp.com:8280"
        },
        "sapp-pay-adapter": {
          "memcached.endpoints": "cache01.di01.dev:11211",
          "cassandra.host.node": "cass01.di01.dev,cass02.di01.dev",
          "cassandra.login.user": "cassandra",
          "sapp.relational.db.url": "jdbc:oracle:thin:@db01.di01.dev:1521/SAPDEV",
          "sapp.relational.db.username": "SAAS_DEV_SAPP",
          "system.relational.db.url": "jdbc:oracle:thin:@db01.di01.dev:1521/SAPDEV",
          "system.relational.db.username": "SAAS_DEV_SYSTEM",
          "hls.base.url": "http://home-di01-service.devsapp.com:8680",
          "saas.base.url": "http://subscriber-di01-service.devsapp.com:8280"
        },
        "sapp-in-adapter": {
          "memcached.endpoints": "cache01.di01.dev:11211",
          "cassandra.host.node": "cass01.di01.dev,cass02.di01.dev",
          "cassandra.login.user": "cassandra",
          "sapp.relational.db.url": "jdbc:oracle:thin:@db01.di01.dev:1521/SAPDEV",
          "sapp.relational.db.username": "SAAS_DEV_SAPP",
          "system.relational.db.url": "jdbc:oracle:thin:@db01.di01.dev:1521/SAPDEV",
          "system.relational.db.username": "SAAS_DEV_SYSTEM",
          "hls.base.url": "http://home-di01-service.devsapp.com:8680",
          "saas.base.url": "http://subscriber-di01-service.devsapp.com:8280",
          "ums.base.url": "http://ums01.di01.dev:8183"
        },
        "sapp-op-api": {
          "memcached.endpoints": "cache01.di01.dev:11211",
          "cassandra.host.node": "cass01.di01.dev,cass02.di01.dev",
          "cassandra.login.user": "cassandra",
          "sapp.relational.db.url": "jdbc:oracle:thin:@db01.di01.dev:1521/SAPDEV",
          "sapp.relational.db.username": "SAAS_DEV_SAPP",
          "system.relational.db.url": "jdbc:oracle:thin:@db01.di01.dev:1521/SAPDEV",
          "system.relational.db.username": "SAAS_DEV_SYSTEM"
        },
        "sapp-op-admin": {
          "memcached.endpoints": "cache01.di01.dev:11211",
          "cassandra.host.node": "cass01.di01.dev,cass02.di01.dev",
          "cassandra.login.user": "cassandra",
          "sapp.relational.db.url": "jdbc:oracle:thin:@db01.di01.dev:1521/SAPDEV",
          "sapp.relational.db.username": "SAAS_DEV_SAPP",
          "system.relational.db.url": "jdbc:oracle:thin:@db01.di01.dev:1521/SAPDEV",
          "system.relational.db.username": "SAAS_DEV_SYSTEM"
        },
        "iop": {
          "memcached.endpoints": "cache01.di01.dev:11211",
          "cassandra.host.node": "cass01.di01.dev,cass02.di01.dev",
          "cassandra.login.user": "cassandra",
          "sapp.relational.db.url": "jdbc:oracle:thin:@db01.di01.dev:1521/SAPDEV",
          "sapp.relational.db.username": "SAAS_DEV_SAPP",
          "system.relational.db.url": "jdbc:oracle:thin:@db01.di01.dev:1521/SAPDEV",
          "system.relational.db.username": "SAAS_DEV_SYSTEM",
          "di.domain": "sapp.net",
          "di.env": "devsapp"
        },
        "scep": {
          "memcached.endpoints": "cache01.di01.dev:11211",
          "cassandra.host.node": "cass01.di01.dev,cass02.di01.dev",
          "cassandra.login.user": "cassandra",
          "sapp.relational.db.url": "jdbc:oracle:thin:@db01.di01.dev:1521/SAPDEV",
          "sapp.relational.db.username": "SAAS_DEV_SAPP",
          "system.relational.db.url": "jdbc:oracle:thin:@db01.di01.dev:1521/SAPDEV",
          "system.relational.db.username": "SAAS_DEV_SYSTEM",
          "di.domain": "sapp.net",
          "di.env": "devsapp"
        },
        "extractor": {
          "memcached.endpoints": "cache01.di01.dev:11211",
          "cassandra.host.node": "cass01.di01.dev,cass02.di01.dev",
          "cassandra.login.user": "cassandra",
          "sapp.relational.db.url": "jdbc:oracle:thin:@db01.di01.dev:1521/SAPDEV",
          "sapp.relational.db.username": "SAAS_DEV_SAPP",
          "system.relational.db.url": "jdbc:oracle:thin:@db01.di01.dev:1521/SAPDEV",
          "system.relational.db.username": "SAAS_DEV_SYSTEM",
          "di.domain": "sapp.net",
          "di.env": "devsapp"
        },
        "analytics": {
          "memcached.endpoints": "cache01.di01.dev:11211",
          "cassandra.host.node": "cass01.di01.dev,cass02.di01.dev",
          "cassandra.login.user": "cassandra",
          "sapp.relational.db.url": "jdbc:oracle:thin:@db01.di01.dev:1521/SAPDEV",
          "sapp.relational.db.username": "SAAS_DEV_SAPP",
          "system.relational.db.url": "jdbc:oracle:thin:@db01.di01.dev:1521/SAPDEV",
          "system.relational.db.username": "SAAS_DEV_SYSTEM",
          "di.domain": "sapp.net",
          "di.env": "devsapp"
        }
      },
      "env_vars": [
        "SAAS_SCEP_PASSWORD",
        "SAAS_SCEP_MASTER_PASSWORD"
      ],
      "hls": {
        "rpm_version": "6992-1"
      },
      "ums": {
        "rpm_version": "6992-1"
      },
      "notify": {
        "rpm_version": "6992-1"
      },
      "partner": {
        "rpm_version": "6992-1"
      },
      "subscriber": {
        "rpm_version": "6992-1"
      },
      "scep": {
        "rpm_version": "104-1"
      },
      "iop": {
        "rpm_version": "6992-1"
      },
      "plancycle": {
        "rpm_version": "6992-1"
      },
      "extractor": {
        "rpm_version": "354-1"
      },
      "analytics": {
        "rpm_version": "354-1"
      },
      "sapp-adapter": {
        "rpm_version": "5499-1"
      },
      "sapp-in-adapter": {
        "rpm_version": "5499-1"
      },
      "sapp-pay-adapter": {
        "rpm_version": "5499-1"
      },
      "sapp-op-api": {
        "rpm_version": "3116-1"
      },
      "sapp-op-admin": {
        "rpm_version": "3116-1"
      }
    },
    "ez-php": {
      "timezone": "UTC"
    },
    "ez-yum": {
      "rhsm_manage_repos": "0"
    },
    "ez-elk": {
      "disable_kibana": true
    },
    "ez-base": {
      "mail-handler": {
        "enabled": false
      },
      "chef_client": {
        "config": {
          "enabled": false
        }
      }
    }
  }
}
