{
  "name": "base",
  "description": "",
  "json_class": "Chef::Role",
  "default_attributes": {

  },
  "override_attributes": {
    "ez-base": {
      "mail-handler": {
        "enabled": false
      },
      "chef_client": {
        "config": {
          "enabled": false
        }
      }
    }
  },
  "chef_type": "role",
  "run_list": [
    "recipe[env-lookup]",
    "recipe[ez-sudo]",
    "recipe[ez-yum]",
    "recipe[ez-tweak::ez_alias-ps1]",
    "recipe[ez-tdagent]"
  ],
  "env_run_lists": {

  }
}