<?xml version="1.0" encoding="UTF-8" standalone="no"?>
<!-- Created with Inkscape (http://www.inkscape.org/) -->

<svg
   version="1.1"
   id="svg9"
   xml:space="preserve"
   width="215.99728"
   height="196.8588"
   viewBox="0 0 215.99728 196.8588"
   sodipodi:docname="cartesian_c.svg"
   inkscape:version="1.1 (c68e22c387, 2021-05-23)"
   xmlns:inkscape="http://www.inkscape.org/namespaces/inkscape"
   xmlns:sodipodi="http://sodipodi.sourceforge.net/DTD/sodipodi-0.dtd"
   xmlns="http://www.w3.org/2000/svg"
   xmlns:svg="http://www.w3.org/2000/svg"><defs
     id="defs13" /><sodipodi:namedview
     id="namedview11"
     pagecolor="#ffffff"
     bordercolor="#666666"
     borderopacity="1.0"
     inkscape:pageshadow="2"
     inkscape:pageopacity="0.0"
     inkscape:pagecheckerboard="0"
     showgrid="false"
     fit-margin-top="0"
     fit-margin-left="0"
     fit-margin-right="0"
     fit-margin-bottom="0"
     inkscape:zoom="1.5978965"
     inkscape:cx="86.363541"
     inkscape:cy="41.617214"
     inkscape:window-width="1680"
     inkscape:window-height="971"
     inkscape:window-x="-9"
     inkscape:window-y="-9"
     inkscape:window-maximized="1"
     inkscape:current-layer="g15" /><g
     id="g15"
     inkscape:groupmode="layer"
     inkscape:label="ink_ext_XXXXXX"
     transform="matrix(1.3333333,0,0,-1.3333333,-2.3427066,215.22133)"><g
       id="g907"><path
         d="m 51.8379,66.7488 h 91.9633 v 87.4723 H 51.8379 Z"
         style="fill:#efeeee;fill-opacity:1;fill-rule:evenodd;stroke:none;stroke-width:0.1"
         id="path19" /><path
         d="m 51.8379,66.7488 h 91.9633 v 87.4723 H 51.8379 Z"
         style="fill:none;stroke:#efeeee;stroke-width:0.567;stroke-linecap:butt;stroke-linejoin:miter;stroke-miterlimit:2.613;stroke-dasharray:none;stroke-opacity:1"
         id="path21" /><path
         d="m 73.0938,85.5359 h 42.6891 V 112.041 H 73.0938 Z"
         style="fill:#e5f7fd;fill-opacity:1;fill-rule:nonzero;stroke:none;stroke-width:0.1"
         id="path23" /><path
         d="M 91.4578,132.519 H 134.148 L 116.071,111.771 H 73.0938 l 18.364,20.748"
         style="fill:#d1f0fc;fill-opacity:1;fill-rule:evenodd;stroke:none;stroke-width:0.1"
         id="path25" /><path
         d="m 115.784,111.532 18.364,21.226 V 106.763 L 115.784,85.5379 v 25.9941"
         style="fill:#b2e6fa;fill-opacity:1;fill-rule:evenodd;stroke:none;stroke-width:0.1"
         id="path27" /><path
         d="m 18.075,28.2949 33.766,38.7242 h 92.325 L 127.165,28.7672 18.075,28.2949"
         style="fill:#f3f3f3;fill-opacity:1;fill-rule:evenodd;stroke:none;stroke-width:0.1"
         id="path29" /><path
         d="m 17.7449,128.413 34.2391,26.21 V 67.0191 L 18.6898,28.059 17.7449,128.413"
         style="fill:#f5f4f5;fill-opacity:1;fill-rule:evenodd;stroke:none;stroke-width:0.1"
         id="path31" /><path
         d="M 151.467,67.0191 H 51.984 v 83.2379"
         style="fill:none;stroke:#a8a6a7;stroke-width:0.567;stroke-linecap:butt;stroke-linejoin:miter;stroke-miterlimit:2.613;stroke-dasharray:none;stroke-opacity:1"
         id="path35" /><path
         d="m 155.869,67.0191 -5.64,-1.698 c 0.805,1.1328 0.805,2.2641 0,3.3961 l 5.64,-1.6981"
         style="fill:#a8a6a7;fill-opacity:1;fill-rule:evenodd;stroke:none;stroke-width:0.1"
         id="path37" /><path
         d="m 51.984,154.661 -1.6992,-5.642 c 1.132,0.805 2.264,0.805 3.3972,0 l -1.698,5.642"
         style="fill:#a8a6a7;fill-opacity:1;fill-rule:evenodd;stroke:none;stroke-width:0.1"
         id="path39" /><path
         d="M 51.9367,66.832 12.2988,21.4418"
         style="fill:none;stroke:#a8a6a7;stroke-width:0.567;stroke-linecap:butt;stroke-linejoin:miter;stroke-miterlimit:2.613;stroke-dasharray:none;stroke-opacity:1"
         id="path41" /><path
         d="m 9.40391,18.1262 4.98989,3.1316 c -1.384,0.1383 -2.236,0.882 -2.559,2.234 L 9.40391,18.1262"
         style="fill:#a8a6a7;fill-opacity:1;fill-rule:evenodd;stroke:none;stroke-width:0.1"
         id="path43" /><path
         d="m 115.499,113.172 c 0.776,0 1.407,-0.631 1.407,-1.407 0,-0.775 -0.631,-1.407 -1.407,-1.407 -0.774,0 -1.407,0.632 -1.407,1.407 0,0.776 0.633,1.407 1.407,1.407"
         style="fill:#231f20;fill-opacity:1;fill-rule:evenodd;stroke:none;stroke-width:0.1"
         id="path45" /><path
         d="m 115.499,113.172 c 0.776,0 1.407,-0.631 1.407,-1.407 0,-0.775 -0.631,-1.407 -1.407,-1.407 -0.774,0 -1.407,0.632 -1.407,1.407 0,0.776 0.633,1.407 1.407,1.407 z"
         style="fill:none;stroke:#231f20;stroke-width:0.567;stroke-linecap:butt;stroke-linejoin:miter;stroke-miterlimit:2.613;stroke-dasharray:none;stroke-opacity:1"
         id="path47" /><path
         d="m 161.526,68.818 c 0.087,-0.15 0.148,-0.2918 0.183,-0.4219 0.033,-0.132 0.067,-0.391 0.102,-0.775 l 0.172,-1.9231 c 0.155,0.1872 0.382,0.484 0.679,0.8911 0.144,0.198 0.321,0.4668 0.532,0.8078 0.127,0.2082 0.205,0.3551 0.233,0.4371 0.016,0.0422 0.023,0.0859 0.023,0.1301 0,0.0277 -0.007,0.0519 -0.027,0.0699 -0.018,0.018 -0.064,0.039 -0.142,0.064 -0.077,0.025 -0.141,0.0711 -0.192,0.136 -0.051,0.0672 -0.076,0.143 -0.076,0.2301 0,0.1058 0.032,0.1918 0.095,0.257 0.061,0.066 0.139,0.0969 0.233,0.0969 0.115,0 0.212,-0.0461 0.293,-0.1418 0.081,-0.0942 0.121,-0.2262 0.121,-0.3922 0,-0.2051 -0.069,-0.4418 -0.21,-0.7051 -0.141,-0.2648 -0.412,-0.6699 -0.812,-1.2168 -0.401,-0.548 -0.888,-1.143 -1.457,-1.7891 -0.394,-0.4449 -0.686,-0.7269 -0.875,-0.8429 -0.191,-0.1141 -0.354,-0.1731 -0.489,-0.1731 -0.081,0 -0.153,0.0309 -0.214,0.0918 -0.061,0.0621 -0.089,0.1321 -0.089,0.2133 0,0.102 0.041,0.1938 0.126,0.2777 0.084,0.0821 0.175,0.1243 0.274,0.1243 0.053,0 0.097,-0.011 0.129,-0.0352 0.022,-0.0129 0.045,-0.05 0.068,-0.1121 0.027,-0.0598 0.048,-0.1008 0.071,-0.1207 0.011,-0.0152 0.027,-0.0199 0.045,-0.0199 0.015,0 0.043,0.0117 0.082,0.0379 0.143,0.089 0.31,0.2308 0.5,0.4218 0.25,0.2559 0.434,0.4641 0.554,0.625 l -0.218,2.477 c -0.036,0.4082 -0.09,0.6582 -0.164,0.7461 -0.074,0.089 -0.195,0.1328 -0.367,0.1328 -0.055,0 -0.152,-0.0078 -0.293,-0.0238 l -0.035,0.1449 1.145,0.2801"
         style="fill:#bdbbbc;fill-opacity:1;fill-rule:evenodd;stroke:none;stroke-width:0.1"
         id="path49" /><path
         d="m 50.9398,161.416 h 2.479 v -0.098 l -2.702,-2.813 h 1.1441 c 0.27,0 0.4418,0.011 0.5161,0.032 0.073,0.021 0.141,0.065 0.2007,0.132 0.0621,0.068 0.1293,0.191 0.2051,0.368 h 0.1442 l -0.3403,-1.063 h -2.5418 v 0.114 l 2.702,2.812 H 51.623 c -0.2371,0 -0.3812,-0.007 -0.4292,-0.019 -0.0727,-0.016 -0.1469,-0.057 -0.2161,-0.124 -0.0726,-0.065 -0.1468,-0.176 -0.2226,-0.329 h -0.1473 l 0.332,0.988"
         style="fill:#bdbbbc;fill-opacity:1;fill-rule:evenodd;stroke:none;stroke-width:0.1"
         id="path51" /><path
         d="M 3.425,17.4 C 3.55273,17.2648 3.65,17.1301 3.71406,16.9961 3.76094,16.9 3.83789,16.6551 3.94492,16.2559 l 0.34414,0.516 c 0.08985,0.1242 0.20078,0.2441 0.33164,0.3582 0.1293,0.114 0.24414,0.1898 0.34219,0.2308 0.06406,0.027 0.13281,0.0391 0.20781,0.0391 0.11211,0 0.2,-0.0281 0.26836,-0.0891 0.06563,-0.0597 0.09883,-0.1339 0.09883,-0.2187 0,-0.0981 -0.01914,-0.1672 -0.05781,-0.2031 C 5.40586,16.8238 5.32305,16.791 5.23086,16.791 c -0.05586,0 -0.11406,0.0121 -0.17695,0.0371 -0.12188,0.041 -0.20391,0.061 -0.24493,0.061 -0.06406,0 -0.13828,-0.0371 -0.22421,-0.109 -0.16172,-0.136 -0.35196,-0.3973 -0.57774,-0.784 l 0.31992,-1.3449 c 0.05,-0.2063 0.09102,-0.3293 0.12578,-0.3692 0.03321,-0.041 0.06797,-0.0601 0.10118,-0.0601 0.05586,0 0.11914,0.0293 0.19101,0.089 0.14492,0.12 0.26485,0.2762 0.36797,0.4692 L 5.24883,14.709 C 5.08477,14.402 4.87695,14.1469 4.62305,13.9441 4.48203,13.8301 4.35898,13.7719 4.26094,13.7719 c -0.1461,0 -0.26211,0.082 -0.34805,0.2453 C 3.85898,14.1199 3.74492,14.557 3.57305,15.332 3.1668,14.6238 2.8418,14.1711 2.59805,13.9672 2.43906,13.8371 2.28477,13.7719 2.13477,13.7719 c -0.10391,0 -0.19688,0.0371 -0.28399,0.114 -0.06172,0.0571 -0.09375,0.1332 -0.09375,0.2301 0,0.0852 0.02891,0.157 0.08594,0.216 0.05781,0.0559 0.12695,0.084 0.21094,0.084 0.08281,0 0.17304,-0.041 0.26601,-0.125 0.0668,-0.0601 0.1211,-0.0898 0.15586,-0.0898 0.03203,0 0.0711,0.0218 0.12227,0.0629 0.12187,0.0988 0.28789,0.3121 0.5,0.6398 0.20976,0.3281 0.34765,0.566 0.41367,0.7121 -0.16172,0.6328 -0.25,0.9668 -0.26289,1.0039 -0.05899,0.1692 -0.13789,0.2879 -0.23399,0.359 -0.09687,0.0699 -0.23789,0.1051 -0.42578,0.1051 -0.06015,0 -0.13008,-0.002 -0.20703,-0.0078 v 0.141 L 3.425,17.4"
         style="fill:#bdbbbc;fill-opacity:1;fill-rule:evenodd;stroke:none;stroke-width:0.1"
         id="path53" /><path
         d="m 107.708,109.52 h 2.086 c 0.546,0 0.956,-0.119 1.227,-0.353 0.27,-0.236 0.406,-0.524 0.406,-0.861 0,-0.269 -0.087,-0.53 -0.259,-0.782 -0.172,-0.253 -0.426,-0.459 -0.765,-0.616 -0.338,-0.157 -0.704,-0.236 -1.096,-0.236 -0.246,0 -0.557,0.044 -0.935,0.134 l -0.422,-1.446 c -0.098,-0.344 -0.148,-0.569 -0.148,-0.68 0,-0.084 0.034,-0.152 0.105,-0.206 0.072,-0.056 0.24,-0.091 0.504,-0.107 l -0.039,-0.144 h -2.105 l 0.044,0.144 c 0.275,0 0.467,0.049 0.575,0.143 0.108,0.096 0.225,0.357 0.35,0.788 l 0.875,3.014 c 0.103,0.363 0.156,0.606 0.156,0.728 0,0.091 -0.036,0.167 -0.112,0.225 -0.075,0.061 -0.237,0.097 -0.491,0.11 z m 0.731,-2.469 c 0.294,-0.076 0.531,-0.113 0.712,-0.113 0.282,0 0.541,0.059 0.773,0.176 0.234,0.117 0.416,0.293 0.548,0.526 0.132,0.235 0.196,0.48 0.196,0.732 0,0.263 -0.08,0.471 -0.241,0.625 -0.162,0.152 -0.406,0.23 -0.734,0.23 -0.177,0 -0.393,-0.022 -0.646,-0.066 l -0.608,-2.11"
         style="fill:#231f20;fill-opacity:1;fill-rule:evenodd;stroke:none;stroke-width:0.1"
         id="path55" /><path
         d="m 112.185,107.672 0.29,1.782 c 0.024,0.158 0.068,0.274 0.13,0.347 0.06,0.074 0.145,0.111 0.252,0.111 0.082,0 0.147,-0.028 0.201,-0.079 0.053,-0.053 0.079,-0.119 0.079,-0.204 0,-0.041 -0.006,-0.087 -0.019,-0.14 -0.011,-0.053 -0.031,-0.103 -0.054,-0.153 l -0.742,-1.664 h -0.137"
         style="fill:#231f20;fill-opacity:1;fill-rule:evenodd;stroke:none;stroke-width:0.1"
         id="path57" /><path
         d="m 117.14579,147.05784 -1.3429,-4.609 c -0.0711,-0.25 -0.109,-0.415 -0.109,-0.492 0,-0.027 0.0109,-0.05 0.0328,-0.073 0.0222,-0.024 0.0461,-0.036 0.068,-0.036 0.0339,0 0.075,0.017 0.121,0.05 0.0891,0.063 0.2379,0.219 0.4461,0.468 l 0.1329,-0.081 c -0.1879,-0.26 -0.377,-0.472 -0.5688,-0.633 -0.1902,-0.161 -0.3699,-0.241 -0.5371,-0.241 -0.0891,0 -0.1609,0.03 -0.2191,0.093 -0.0559,0.062 -0.086,0.151 -0.086,0.265 0,0.15 0.0402,0.348 0.118,0.597 l 0.1512,0.486 c -0.377,-0.584 -0.7211,-0.987 -1.029,-1.211 -0.214,-0.154 -0.4191,-0.23 -0.6152,-0.23 -0.1969,0 -0.3711,0.087 -0.516,0.263 -0.1488,0.175 -0.223,0.414 -0.223,0.717 0,0.388 0.125,0.802 0.373,1.243 0.2461,0.439 0.573,0.797 0.9812,1.072 0.3188,0.222 0.6129,0.332 0.8809,0.332 0.141,0 0.2609,-0.027 0.3649,-0.085 0.1,-0.057 0.2011,-0.151 0.3,-0.285 l 0.382,1.36 c 0.0301,0.096 0.0519,0.172 0.0711,0.23 0.0301,0.104 0.0469,0.19 0.0469,0.258 0,0.054 -0.0208,0.1 -0.0598,0.136 -0.0539,0.045 -0.125,0.067 -0.2102,0.067 -0.0597,0 -0.1578,-0.01 -0.2968,-0.027 v 0.144 z m -1.448,-2.773 c 0,0.167 -0.0481,0.301 -0.1449,0.403 -0.0961,0.101 -0.218,0.153 -0.368,0.153 -0.327,0 -0.6692,-0.272 -1.025,-0.813 -0.3551,-0.543 -0.534,-1.059 -0.534,-1.555 0,-0.196 0.0449,-0.345 0.1301,-0.448 0.0859,-0.101 0.1898,-0.154 0.3097,-0.154 0.27,0 0.6102,0.293 1.018,0.879 0.4102,0.586 0.6141,1.098 0.6141,1.535"
         style="fill:#ff0000;fill-opacity:1;fill-rule:evenodd;stroke:none;stroke-width:0.1"
         id="path91" /><path
         d="m 118.20489,145.03784 c 0.128,-0.134 0.224,-0.27 0.291,-0.404 0.045,-0.095 0.123,-0.341 0.229,-0.739 l 0.345,0.515 c 0.09,0.124 0.2,0.245 0.332,0.358 0.129,0.114 0.243,0.19 0.343,0.232 0.061,0.026 0.131,0.038 0.207,0.038 0.112,0 0.201,-0.028 0.266,-0.089 0.067,-0.06 0.101,-0.133 0.101,-0.219 0,-0.097 -0.02,-0.166 -0.059,-0.202 -0.074,-0.066 -0.156,-0.099 -0.249,-0.099 -0.055,0 -0.113,0.012 -0.177,0.037 -0.122,0.042 -0.205,0.062 -0.246,0.062 -0.062,0 -0.135,-0.038 -0.222,-0.11 -0.162,-0.136 -0.354,-0.397 -0.578,-0.784 l 0.321,-1.345 c 0.049,-0.205 0.09,-0.329 0.125,-0.369 0.032,-0.039 0.066,-0.06 0.1,-0.06 0.055,0 0.12,0.029 0.192,0.089 0.143,0.12 0.264,0.276 0.367,0.47 l 0.137,-0.071 c -0.164,-0.308 -0.372,-0.563 -0.625,-0.765 -0.144,-0.114 -0.265,-0.172 -0.364,-0.172 -0.145,0 -0.26,0.081 -0.347,0.245 -0.055,0.102 -0.168,0.54 -0.341,1.314 -0.404,-0.708 -0.7309,-1.161 -0.9762,-1.365 -0.159,-0.129 -0.311,-0.194 -0.461,-0.194 -0.1039,0 -0.1988,0.037 -0.2847,0.113 -0.0613,0.057 -0.0942,0.133 -0.0942,0.23 0,0.087 0.0301,0.158 0.0871,0.216 0.0559,0.057 0.1258,0.085 0.2098,0.085 0.0832,0 0.1723,-0.042 0.266,-0.126 0.068,-0.06 0.12,-0.088 0.1563,-0.088 0.0316,0 0.0726,0.02 0.1207,0.061 0.123,0.099 0.2902,0.313 0.5,0.64 0.2112,0.328 0.3492,0.566 0.4152,0.712 -0.163,0.632 -0.25,0.967 -0.2621,1.004 -0.0609,0.169 -0.1379,0.288 -0.2359,0.359 -0.095,0.071 -0.2371,0.106 -0.4242,0.106 -0.061,0 -0.129,-0.003 -0.2071,-0.008 v 0.141 l 1.0423,0.182"
         style="fill:#ff0000;fill-opacity:1;fill-rule:evenodd;stroke:none;stroke-width:0.1"
         id="path93" /><path
         d="m 125.19789,147.05784 -1.345,-4.609 c -0.071,-0.25 -0.108,-0.415 -0.108,-0.492 0,-0.027 0.011,-0.05 0.033,-0.073 0.022,-0.024 0.046,-0.036 0.067,-0.036 0.035,0 0.075,0.017 0.122,0.05 0.089,0.063 0.237,0.219 0.445,0.468 l 0.133,-0.081 c -0.187,-0.26 -0.377,-0.472 -0.568,-0.633 -0.191,-0.161 -0.369,-0.241 -0.536,-0.241 -0.09,0 -0.161,0.03 -0.22,0.093 -0.057,0.062 -0.086,0.151 -0.086,0.265 0,0.15 0.04,0.348 0.117,0.597 l 0.153,0.486 c -0.377,-0.584 -0.723,-0.987 -1.032,-1.211 -0.213,-0.154 -0.418,-0.23 -0.613,-0.23 -0.197,0 -0.371,0.087 -0.516,0.263 -0.149,0.175 -0.223,0.414 -0.223,0.717 0,0.388 0.124,0.802 0.372,1.243 0.247,0.439 0.573,0.797 0.98,1.072 0.321,0.222 0.616,0.332 0.883,0.332 0.142,0 0.261,-0.027 0.364,-0.085 0.101,-0.057 0.202,-0.151 0.3,-0.285 l 0.382,1.36 c 0.03,0.096 0.052,0.172 0.071,0.23 0.032,0.104 0.047,0.19 0.047,0.258 0,0.054 -0.019,0.1 -0.058,0.136 -0.056,0.045 -0.125,0.067 -0.211,0.067 -0.061,0 -0.158,-0.01 -0.298,-0.027 v 0.144 z m -1.45,-2.773 c 0,0.167 -0.047,0.301 -0.144,0.403 -0.096,0.101 -0.219,0.153 -0.367,0.153 -0.328,0 -0.669,-0.272 -1.026,-0.813 -0.354,-0.543 -0.534,-1.059 -0.534,-1.555 0,-0.196 0.044,-0.345 0.13,-0.448 0.086,-0.101 0.189,-0.154 0.31,-0.154 0.27,0 0.609,0.293 1.018,0.879 0.409,0.586 0.613,1.098 0.613,1.535"
         style="fill:#ff0000;fill-opacity:1;fill-rule:evenodd;stroke:none;stroke-width:0.1"
         id="path95" /><path
         d="m 126.14589,145.03784 c 0.09,-0.15 0.15,-0.292 0.184,-0.422 0.035,-0.132 0.068,-0.391 0.102,-0.775 l 0.172,-1.922 c 0.156,0.186 0.383,0.483 0.681,0.89 0.141,0.198 0.319,0.467 0.529,0.808 0.129,0.208 0.206,0.355 0.235,0.437 0.015,0.042 0.024,0.086 0.024,0.13 0,0.028 -0.009,0.052 -0.028,0.072 -0.018,0.016 -0.065,0.037 -0.142,0.062 -0.077,0.025 -0.142,0.071 -0.193,0.136 -0.05,0.067 -0.076,0.143 -0.076,0.23 0,0.107 0.032,0.192 0.095,0.257 0.061,0.067 0.141,0.097 0.233,0.097 0.116,0 0.212,-0.046 0.294,-0.142 0.081,-0.094 0.121,-0.226 0.121,-0.392 0,-0.205 -0.071,-0.442 -0.211,-0.705 -0.14,-0.264 -0.412,-0.67 -0.813,-1.217 -0.399,-0.548 -0.887,-1.143 -1.455,-1.789 -0.394,-0.445 -0.686,-0.727 -0.877,-0.843 -0.189,-0.114 -0.352,-0.173 -0.487,-0.173 -0.08,0 -0.153,0.031 -0.213,0.092 -0.062,0.062 -0.092,0.132 -0.092,0.214 0,0.101 0.041,0.193 0.128,0.277 0.084,0.083 0.176,0.124 0.273,0.124 0.052,0 0.096,-0.011 0.13,-0.035 0.022,-0.013 0.044,-0.05 0.069,-0.112 0.024,-0.06 0.047,-0.101 0.069,-0.121 0.012,-0.015 0.027,-0.02 0.047,-0.02 0.013,0 0.042,0.012 0.081,0.039 0.143,0.088 0.31,0.23 0.5,0.421 0.251,0.256 0.434,0.464 0.554,0.625 l -0.218,2.477 c -0.036,0.408 -0.092,0.658 -0.164,0.746 -0.074,0.089 -0.196,0.133 -0.368,0.133 -0.053,0 -0.153,-0.008 -0.293,-0.024 l -0.035,0.145 1.144,0.28"
         style="fill:#ff0000;fill-opacity:1;fill-rule:evenodd;stroke:none;stroke-width:0.1"
         id="path97" /><g
         id="g600"
         transform="translate(-0.70405064,-84.955444)"><path
           d="m 77.6918,145.096 v -0.145 c -0.1891,-0.034 -0.3309,-0.094 -0.427,-0.179 -0.1378,-0.128 -0.2609,-0.324 -0.3668,-0.587 l -1.8492,-4.507 h -0.1437 l -1.9832,4.567 c -0.102,0.234 -0.1739,0.377 -0.216,0.429 -0.0641,0.081 -0.1442,0.144 -0.2411,0.189 -0.0937,0.046 -0.2218,0.074 -0.3839,0.088 v 0.145 h 2.164 v -0.145 C 74,144.928 73.841,144.885 73.7688,144.828 c -0.0727,-0.061 -0.1098,-0.139 -0.1098,-0.232 0,-0.131 0.0598,-0.333 0.1801,-0.609 l 1.3488,-3.106 1.2488,3.066 c 0.1231,0.302 0.1832,0.512 0.1832,0.629 0,0.076 -0.0371,0.148 -0.1129,0.217 -0.075,0.068 -0.2031,0.119 -0.3832,0.146 -0.0129,0.002 -0.0347,0.006 -0.066,0.012 v 0.145 h 1.634"
           style="fill:#00adef;fill-opacity:1;fill-rule:evenodd;stroke:none;stroke-width:0.1"
           id="path65" /><path
           d="m 78.757,143.483 c 0.541,0 0.977,-0.207 1.3059,-0.618 0.2781,-0.351 0.418,-0.756 0.418,-1.21 0,-0.321 -0.0782,-0.645 -0.2321,-0.973 -0.1527,-0.328 -0.3648,-0.576 -0.634,-0.743 -0.2699,-0.167 -0.5699,-0.25 -0.9,-0.25 -0.5398,0 -0.9679,0.215 -1.2859,0.644 -0.268,0.363 -0.4012,0.77 -0.4012,1.219 0,0.329 0.0813,0.656 0.2442,0.979 0.1621,0.324 0.3769,0.564 0.641,0.718 0.266,0.156 0.5469,0.234 0.8441,0.234 z m -0.1211,-0.255 c -0.1371,0 -0.275,-0.04 -0.416,-0.123 -0.139,-0.082 -0.2519,-0.225 -0.3371,-0.432 -0.0871,-0.205 -0.1301,-0.468 -0.1301,-0.792 0,-0.521 0.1051,-0.969 0.3121,-1.347 0.2071,-0.378 0.479,-0.567 0.818,-0.567 0.252,0 0.459,0.104 0.625,0.312 0.1641,0.209 0.2449,0.566 0.2449,1.074 0,0.636 -0.1359,1.136 -0.4109,1.5 -0.184,0.251 -0.4188,0.375 -0.7059,0.375"
           style="fill:#00adef;fill-opacity:1;fill-rule:evenodd;stroke:none;stroke-width:0.1"
           id="path67" /><path
           d="m 82.2367,145.353 v -4.746 c 0,-0.224 0.0172,-0.372 0.0492,-0.445 0.0329,-0.073 0.0829,-0.128 0.152,-0.165 0.0672,-0.038 0.193,-0.058 0.3789,-0.058 v -0.14 h -1.7539 v 0.14 c 0.1648,0 0.2762,0.018 0.3351,0.052 0.0586,0.033 0.1071,0.09 0.1399,0.168 0.034,0.077 0.0512,0.227 0.0512,0.448 v 3.25 c 0,0.404 -0.009,0.652 -0.025,0.745 -0.0203,0.091 -0.0481,0.155 -0.0883,0.189 -0.0418,0.034 -0.093,0.05 -0.1559,0.05 -0.0679,0 -0.1531,-0.02 -0.257,-0.062 l -0.0672,0.137 1.0684,0.437 h 0.1726"
           style="fill:#00adef;fill-opacity:1;fill-rule:evenodd;stroke:none;stroke-width:0.1"
           id="path69" /><path
           d="m 86.366,143.378 v -2.169 c 0,-0.414 0.0098,-0.667 0.0309,-0.76 0.0191,-0.093 0.05,-0.157 0.0922,-0.193 0.0437,-0.037 0.0925,-0.053 0.1519,-0.053 0.0809,0 0.1719,0.02 0.2719,0.065 l 0.0551,-0.137 -1.07,-0.442 h -0.175 v 0.758 c -0.3093,-0.334 -0.5421,-0.543 -0.7042,-0.628 -0.161,-0.087 -0.3321,-0.13 -0.511,-0.13 -0.2008,0 -0.375,0.059 -0.5219,0.174 -0.148,0.116 -0.25,0.265 -0.307,0.448 -0.0582,0.184 -0.0859,0.44 -0.0859,0.773 v 1.597 c 0,0.17 -0.0192,0.287 -0.0551,0.352 -0.0352,0.066 -0.0902,0.115 -0.1621,0.151 -0.0699,0.035 -0.2008,0.051 -0.3879,0.048 v 0.146 h 1.2531 v -2.395 c 0,-0.333 0.059,-0.552 0.175,-0.655 0.116,-0.107 0.2559,-0.158 0.4199,-0.158 0.1118,0 0.2379,0.037 0.3801,0.105 0.143,0.071 0.311,0.205 0.507,0.403 v 2.028 c 0,0.202 -0.0371,0.339 -0.1121,0.411 -0.075,0.071 -0.2289,0.11 -0.4621,0.115 v 0.146 h 1.2172"
           style="fill:#00adef;fill-opacity:1;fill-rule:evenodd;stroke:none;stroke-width:0.1"
           id="path71" /><path
           d="m 88.2918,142.72 c 0.2609,0.262 0.4141,0.411 0.4609,0.449 0.1172,0.101 0.2442,0.177 0.3793,0.231 0.1368,0.056 0.27,0.083 0.402,0.083 0.2238,0 0.4168,-0.065 0.5789,-0.195 0.1621,-0.13 0.2691,-0.32 0.325,-0.568 0.2672,0.313 0.4949,0.519 0.6789,0.616 0.184,0.097 0.375,0.147 0.5699,0.147 0.1903,0 0.3582,-0.05 0.5071,-0.147 0.146,-0.097 0.2621,-0.256 0.348,-0.479 0.059,-0.149 0.0859,-0.388 0.0859,-0.71 v -1.54 c 0,-0.224 0.0184,-0.378 0.05,-0.46 0.0274,-0.058 0.075,-0.106 0.1461,-0.147 0.0711,-0.04 0.1832,-0.061 0.3442,-0.061 v -0.14 h -1.7672 v 0.14 h 0.0762 c 0.1519,0 0.2718,0.03 0.3589,0.091 0.0602,0.041 0.1032,0.108 0.1282,0.198 0.0109,0.044 0.0168,0.171 0.0168,0.379 v 1.54 c 0,0.292 -0.036,0.497 -0.1071,0.617 -0.1,0.167 -0.2629,0.25 -0.4879,0.25 -0.139,0 -0.2761,-0.035 -0.416,-0.102 -0.1398,-0.07 -0.3082,-0.199 -0.5058,-0.387 l -0.009,-0.042 0.009,-0.168 v -1.708 c 0,-0.244 0.0148,-0.396 0.041,-0.456 0.0277,-0.06 0.0789,-0.11 0.1547,-0.151 0.075,-0.04 0.2043,-0.061 0.3863,-0.061 v -0.14 h -1.8094 v 0.14 c 0.2,0 0.3352,0.024 0.4102,0.07 0.073,0.047 0.125,0.118 0.1531,0.211 0.0141,0.045 0.0199,0.174 0.0199,0.387 v 1.54 c 0,0.292 -0.0422,0.501 -0.1289,0.628 -0.1152,0.167 -0.275,0.25 -0.4812,0.25 -0.141,0 -0.2789,-0.037 -0.418,-0.112 -0.216,-0.115 -0.3828,-0.245 -0.5,-0.388 v -1.918 c 0,-0.233 0.018,-0.387 0.0492,-0.456 0.032,-0.07 0.0809,-0.124 0.1449,-0.159 0.0629,-0.034 0.1918,-0.053 0.3879,-0.053 v -0.14 h -1.7679 v 0.14 c 0.164,0 0.2781,0.019 0.3429,0.053 0.0641,0.035 0.116,0.091 0.1481,0.169 0.0332,0.077 0.0519,0.225 0.0519,0.446 v 1.368 c 0,0.394 -0.0129,0.648 -0.0359,0.761 -0.0191,0.087 -0.0469,0.145 -0.0859,0.179 -0.0391,0.032 -0.0922,0.048 -0.161,0.048 -0.073,0 -0.1601,-0.02 -0.2601,-0.059 l -0.0598,0.141 1.0777,0.438 h 0.168 v -0.763"
           style="fill:#00adef;fill-opacity:1;fill-rule:evenodd;stroke:none;stroke-width:0.1"
           id="path73" /><path
           d="m 94.0539,142.029 c -0.0031,-0.531 0.127,-0.946 0.3879,-1.25 0.259,-0.302 0.566,-0.451 0.9172,-0.451 0.234,0 0.4379,0.063 0.6109,0.192 0.1739,0.128 0.3168,0.35 0.4352,0.662 l 0.1219,-0.078 c -0.0551,-0.356 -0.2129,-0.682 -0.477,-0.974 -0.2641,-0.294 -0.593,-0.441 -0.9871,-0.441 -0.432,0 -0.8,0.167 -1.1051,0.502 -0.307,0.334 -0.4578,0.785 -0.4578,1.351 0,0.612 0.1551,1.089 0.4699,1.43 0.3141,0.343 0.7071,0.515 1.1828,0.515 0.4,0 0.7293,-0.132 0.9871,-0.397 0.2582,-0.265 0.3872,-0.618 0.3872,-1.061 z m 0,0.227 h 1.6559 c -0.0129,0.229 -0.0399,0.391 -0.0821,0.484 -0.0636,0.145 -0.1617,0.26 -0.291,0.344 -0.1297,0.083 -0.2637,0.125 -0.4027,0.125 -0.2172,0 -0.4102,-0.083 -0.5801,-0.251 -0.1711,-0.168 -0.2719,-0.403 -0.3,-0.702"
           style="fill:#00adef;fill-opacity:1;fill-rule:evenodd;stroke:none;stroke-width:0.1"
           id="path75" /><path
           d="m 98.898,143.249 h 4.21602 v -0.31992 H 98.898 Z m 0,-1.274 h 4.21602 v -0.31992 H 98.898 Z"
           style="fill:#00adef;fill-opacity:1;fill-rule:evenodd;stroke:none;stroke-width:0.1"
           id="path77" /><path
           d="m 109.593,145.353 -1.344,-4.608 c -0.072,-0.25 -0.109,-0.415 -0.109,-0.493 0,-0.027 0.012,-0.049 0.033,-0.074 0.023,-0.023 0.045,-0.035 0.068,-0.035 0.035,0 0.075,0.018 0.121,0.05 0.09,0.063 0.238,0.22 0.447,0.469 l 0.133,-0.081 c -0.189,-0.261 -0.378,-0.473 -0.569,-0.634 -0.191,-0.16 -0.371,-0.24 -0.537,-0.24 -0.09,0 -0.162,0.029 -0.219,0.092 -0.057,0.062 -0.087,0.151 -0.087,0.265 0,0.15 0.04,0.349 0.118,0.598 l 0.152,0.485 c -0.378,-0.584 -0.722,-0.986 -1.03,-1.211 -0.214,-0.154 -0.419,-0.229 -0.615,-0.229 -0.197,0 -0.37,0.086 -0.517,0.261 -0.148,0.176 -0.221,0.415 -0.221,0.718 0,0.388 0.124,0.802 0.372,1.242 0.247,0.441 0.573,0.798 0.981,1.073 0.319,0.222 0.613,0.332 0.882,0.332 0.141,0 0.261,-0.027 0.365,-0.084 0.1,-0.058 0.2,-0.153 0.299,-0.286 l 0.382,1.36 c 0.03,0.096 0.052,0.173 0.072,0.229 0.029,0.105 0.046,0.192 0.046,0.259 0,0.054 -0.021,0.101 -0.059,0.136 -0.055,0.045 -0.125,0.066 -0.211,0.066 -0.06,0 -0.159,-0.009 -0.297,-0.026 v 0.144 z m -1.449,-2.772 c 0,0.167 -0.049,0.3 -0.145,0.402 -0.095,0.101 -0.218,0.152 -0.368,0.152 -0.327,0 -0.669,-0.271 -1.024,-0.812 -0.355,-0.543 -0.534,-1.06 -0.534,-1.555 0,-0.196 0.044,-0.345 0.129,-0.448 0.087,-0.102 0.191,-0.154 0.31,-0.154 0.27,0 0.61,0.293 1.018,0.88 0.411,0.585 0.614,1.097 0.614,1.535"
           style="fill:#00adef;fill-opacity:1;fill-rule:evenodd;stroke:none;stroke-width:0.1"
           id="path79" /><path
           d="m 110.651,143.333 c 0.128,-0.134 0.224,-0.27 0.291,-0.405 0.045,-0.094 0.124,-0.34 0.229,-0.738 l 0.345,0.516 c 0.091,0.124 0.201,0.244 0.331,0.357 0.131,0.113 0.244,0.19 0.344,0.232 0.062,0.026 0.131,0.038 0.208,0.038 0.111,0 0.2,-0.029 0.266,-0.088 0.067,-0.061 0.101,-0.134 0.101,-0.22 0,-0.098 -0.021,-0.166 -0.06,-0.202 -0.073,-0.066 -0.156,-0.099 -0.249,-0.099 -0.054,0 -0.114,0.012 -0.176,0.036 -0.123,0.042 -0.206,0.063 -0.247,0.063 -0.062,0 -0.135,-0.037 -0.222,-0.11 -0.161,-0.135 -0.354,-0.397 -0.578,-0.785 l 0.32,-1.344 c 0.05,-0.205 0.092,-0.329 0.125,-0.369 0.034,-0.04 0.067,-0.06 0.102,-0.06 0.054,0 0.119,0.029 0.191,0.09 0.143,0.119 0.265,0.275 0.367,0.469 l 0.137,-0.071 c -0.164,-0.308 -0.372,-0.562 -0.625,-0.765 -0.144,-0.115 -0.265,-0.171 -0.364,-0.171 -0.145,0 -0.26,0.081 -0.347,0.244 -0.055,0.101 -0.168,0.54 -0.341,1.313 -0.404,-0.707 -0.73,-1.16 -0.976,-1.364 -0.158,-0.129 -0.312,-0.193 -0.461,-0.193 -0.104,0 -0.198,0.037 -0.285,0.112 -0.061,0.057 -0.093,0.134 -0.093,0.23 0,0.086 0.029,0.159 0.086,0.215 0.056,0.058 0.127,0.086 0.211,0.086 0.082,0 0.172,-0.042 0.265,-0.126 0.068,-0.059 0.12,-0.089 0.156,-0.089 0.032,0 0.073,0.021 0.121,0.062 0.123,0.099 0.29,0.312 0.5,0.64 0.211,0.329 0.35,0.566 0.415,0.712 -0.163,0.632 -0.249,0.967 -0.262,1.003 -0.061,0.169 -0.138,0.29 -0.235,0.361 -0.095,0.07 -0.238,0.105 -0.424,0.105 -0.062,0 -0.13,-0.003 -0.208,-0.009 v 0.142 l 1.042,0.182"
           style="fill:#00adef;fill-opacity:1;fill-rule:evenodd;stroke:none;stroke-width:0.1"
           id="path81" /><path
           d="m 119.144,145.353 -1.345,-4.608 c -0.071,-0.25 -0.108,-0.415 -0.108,-0.493 0,-0.027 0.011,-0.049 0.033,-0.074 0.022,-0.023 0.046,-0.035 0.068,-0.035 0.034,0 0.074,0.018 0.121,0.05 0.089,0.063 0.238,0.22 0.446,0.469 l 0.132,-0.081 c -0.188,-0.261 -0.377,-0.473 -0.568,-0.634 -0.191,-0.16 -0.37,-0.24 -0.537,-0.24 -0.089,0 -0.16,0.029 -0.219,0.092 -0.056,0.062 -0.086,0.151 -0.086,0.265 0,0.15 0.04,0.349 0.117,0.598 l 0.153,0.485 c -0.377,-0.584 -0.722,-0.986 -1.031,-1.211 -0.213,-0.154 -0.419,-0.229 -0.614,-0.229 -0.197,0 -0.371,0.086 -0.516,0.261 -0.149,0.176 -0.223,0.415 -0.223,0.718 0,0.388 0.125,0.802 0.373,1.242 0.246,0.441 0.573,0.798 0.98,1.073 0.321,0.222 0.615,0.332 0.882,0.332 0.141,0 0.261,-0.027 0.365,-0.084 0.1,-0.058 0.201,-0.153 0.299,-0.286 l 0.383,1.36 c 0.029,0.096 0.052,0.173 0.07,0.229 0.032,0.105 0.047,0.192 0.047,0.259 0,0.054 -0.019,0.101 -0.058,0.136 -0.055,0.045 -0.125,0.066 -0.211,0.066 -0.06,0 -0.158,-0.009 -0.298,-0.026 v 0.144 z m -1.449,-2.772 c 0,0.167 -0.048,0.3 -0.145,0.402 -0.096,0.101 -0.219,0.152 -0.367,0.152 -0.328,0 -0.67,-0.271 -1.026,-0.812 -0.355,-0.543 -0.534,-1.06 -0.534,-1.555 0,-0.196 0.045,-0.345 0.13,-0.448 0.086,-0.102 0.19,-0.154 0.31,-0.154 0.27,0 0.61,0.293 1.018,0.88 0.409,0.585 0.614,1.097 0.614,1.535"
           style="fill:#00adef;fill-opacity:1;fill-rule:evenodd;stroke:none;stroke-width:0.1"
           id="path83" /><path
           d="m 120.093,143.333 c 0.089,-0.15 0.149,-0.292 0.185,-0.421 0.033,-0.133 0.065,-0.392 0.1,-0.777 l 0.172,-1.921 c 0.156,0.186 0.384,0.483 0.681,0.89 0.142,0.197 0.319,0.467 0.53,0.809 0.129,0.208 0.205,0.354 0.234,0.436 0.015,0.042 0.024,0.086 0.024,0.13 0,0.028 -0.009,0.052 -0.028,0.071 -0.017,0.017 -0.065,0.038 -0.141,0.063 -0.078,0.024 -0.143,0.071 -0.193,0.136 -0.05,0.067 -0.076,0.143 -0.076,0.23 0,0.107 0.032,0.192 0.094,0.257 0.062,0.066 0.141,0.097 0.234,0.097 0.115,0 0.212,-0.045 0.293,-0.142 0.081,-0.095 0.121,-0.226 0.121,-0.392 0,-0.206 -0.07,-0.442 -0.21,-0.706 -0.141,-0.262 -0.412,-0.669 -0.814,-1.216 -0.399,-0.547 -0.886,-1.143 -1.456,-1.789 -0.393,-0.445 -0.685,-0.727 -0.876,-0.842 -0.189,-0.115 -0.352,-0.174 -0.487,-0.174 -0.08,0 -0.153,0.031 -0.213,0.093 -0.062,0.061 -0.092,0.131 -0.092,0.213 0,0.101 0.042,0.193 0.127,0.277 0.084,0.083 0.177,0.124 0.275,0.124 0.052,0 0.096,-0.011 0.129,-0.034 0.022,-0.014 0.044,-0.051 0.069,-0.113 0.025,-0.06 0.047,-0.101 0.068,-0.122 0.013,-0.013 0.028,-0.019 0.048,-0.019 0.014,0 0.043,0.012 0.081,0.039 0.143,0.089 0.31,0.229 0.5,0.421 0.25,0.257 0.434,0.465 0.554,0.625 l -0.218,2.476 c -0.036,0.409 -0.091,0.659 -0.164,0.747 -0.074,0.088 -0.195,0.133 -0.367,0.133 -0.055,0 -0.153,-0.008 -0.293,-0.024 l -0.035,0.144 1.144,0.281"
           style="fill:#00adef;fill-opacity:1;fill-rule:evenodd;stroke:none;stroke-width:0.1"
           id="path85" /><path
           d="m 128.695,145.353 -1.344,-4.608 c -0.073,-0.25 -0.11,-0.415 -0.11,-0.493 0,-0.027 0.012,-0.049 0.034,-0.074 0.022,-0.023 0.044,-0.035 0.067,-0.035 0.035,0 0.075,0.018 0.121,0.05 0.09,0.063 0.238,0.22 0.446,0.469 l 0.133,-0.081 c -0.187,-0.261 -0.377,-0.473 -0.567,-0.634 -0.193,-0.16 -0.371,-0.24 -0.537,-0.24 -0.091,0 -0.162,0.029 -0.22,0.092 -0.057,0.062 -0.086,0.151 -0.086,0.265 0,0.15 0.039,0.349 0.117,0.598 l 0.153,0.485 c -0.377,-0.584 -0.723,-0.986 -1.032,-1.211 -0.213,-0.154 -0.419,-0.229 -0.613,-0.229 -0.197,0 -0.371,0.086 -0.518,0.261 -0.148,0.176 -0.22,0.415 -0.22,0.718 0,0.388 0.124,0.802 0.372,1.242 0.246,0.441 0.572,0.798 0.979,1.073 0.321,0.222 0.616,0.332 0.883,0.332 0.142,0 0.262,-0.027 0.364,-0.084 0.101,-0.058 0.202,-0.153 0.3,-0.286 l 0.382,1.36 c 0.03,0.096 0.053,0.173 0.071,0.229 0.031,0.105 0.047,0.192 0.047,0.259 0,0.054 -0.019,0.101 -0.058,0.136 -0.056,0.045 -0.125,0.066 -0.211,0.066 -0.061,0 -0.159,-0.009 -0.297,-0.026 v 0.144 z m -1.45,-2.772 c 0,0.167 -0.048,0.3 -0.143,0.402 -0.097,0.101 -0.22,0.152 -0.368,0.152 -0.329,0 -0.67,-0.271 -1.027,-0.812 -0.353,-0.543 -0.533,-1.06 -0.533,-1.555 0,-0.196 0.044,-0.345 0.13,-0.448 0.087,-0.102 0.189,-0.154 0.309,-0.154 0.27,0 0.611,0.293 1.019,0.88 0.409,0.585 0.613,1.097 0.613,1.535"
           style="fill:#00adef;fill-opacity:1;fill-rule:evenodd;stroke:none;stroke-width:0.1"
           id="path87" /><path
           d="m 129.038,143.24 h 2.481 v -0.097 l -2.703,-2.813 h 1.143 c 0.272,0 0.444,0.01 0.517,0.032 0.073,0.021 0.139,0.065 0.2,0.133 0.062,0.066 0.131,0.189 0.206,0.367 h 0.145 l -0.34,-1.063 h -2.543 v 0.114 l 2.703,2.811 h -1.125 c -0.236,0 -0.381,-0.007 -0.431,-0.018 -0.072,-0.016 -0.144,-0.058 -0.216,-0.123 -0.072,-0.067 -0.144,-0.177 -0.22,-0.331 h -0.149 l 0.332,0.988"
           style="fill:#00adef;fill-opacity:1;fill-rule:evenodd;stroke:none;stroke-width:0.1"
           id="path89" /></g><path
         d="m 139.608,123.738 -1.345,-4.609 c -0.071,-0.251 -0.11,-0.415 -0.11,-0.492 0,-0.027 0.012,-0.051 0.035,-0.075 0.022,-0.022 0.045,-0.035 0.067,-0.035 0.034,0 0.074,0.018 0.121,0.052 0.09,0.062 0.237,0.218 0.446,0.467 l 0.133,-0.081 c -0.187,-0.259 -0.377,-0.471 -0.568,-0.633 -0.192,-0.162 -0.37,-0.242 -0.536,-0.242 -0.091,0 -0.162,0.032 -0.22,0.093 -0.058,0.064 -0.087,0.151 -0.087,0.266 0,0.149 0.04,0.348 0.117,0.597 l 0.154,0.485 c -0.378,-0.584 -0.723,-0.986 -1.032,-1.21 -0.213,-0.155 -0.419,-0.231 -0.614,-0.231 -0.197,0 -0.37,0.088 -0.516,0.263 -0.149,0.176 -0.221,0.414 -0.221,0.717 0,0.388 0.124,0.804 0.371,1.243 0.247,0.44 0.573,0.797 0.98,1.073 0.321,0.221 0.615,0.332 0.883,0.332 0.142,0 0.261,-0.028 0.364,-0.086 0.101,-0.057 0.202,-0.151 0.299,-0.285 l 0.383,1.361 c 0.029,0.095 0.053,0.171 0.071,0.229 0.031,0.105 0.046,0.19 0.046,0.258 0,0.055 -0.019,0.1 -0.057,0.137 -0.056,0.045 -0.125,0.066 -0.211,0.066 -0.061,0 -0.16,-0.009 -0.298,-0.026 v 0.143 z m -1.451,-2.773 c 0,0.166 -0.046,0.301 -0.144,0.402 -0.095,0.102 -0.218,0.152 -0.367,0.152 -0.327,0 -0.669,-0.27 -1.026,-0.811 -0.353,-0.542 -0.533,-1.061 -0.533,-1.555 0,-0.195 0.044,-0.346 0.129,-0.447 0.087,-0.104 0.19,-0.156 0.31,-0.156 0.27,0 0.61,0.293 1.018,0.88 0.41,0.585 0.613,1.097 0.613,1.535"
         style="fill:#00adef;fill-opacity:1;fill-rule:evenodd;stroke:none;stroke-width:0.1"
         id="path99" /><path
         d="m 139.951,121.625 h 2.481 v -0.098 l -2.703,-2.813 h 1.143 c 0.272,0 0.444,0.011 0.516,0.033 0.073,0.02 0.14,0.064 0.201,0.131 0.062,0.068 0.13,0.191 0.206,0.369 h 0.145 l -0.34,-1.064 h -2.543 v 0.114 l 2.702,2.812 h -1.124 c -0.237,0 -0.382,-0.007 -0.431,-0.019 -0.072,-0.016 -0.144,-0.057 -0.216,-0.124 -0.072,-0.065 -0.145,-0.175 -0.22,-0.329 h -0.149 l 0.332,0.988"
         style="fill:#00adef;fill-opacity:1;fill-rule:evenodd;stroke:none;stroke-width:0.1"
         id="path101" /><g
         id="g828"
         transform="translate(-3,-4.5)"><g
           id="g823"><path
             d="m 129.157,96.5398 -1.343,-4.6097 c -0.073,-0.25 -0.11,-0.4141 -0.11,-0.4922 0,-0.0258 0.011,-0.05 0.033,-0.0738 0.023,-0.0231 0.045,-0.034 0.069,-0.034 0.034,0 0.074,0.016 0.12,0.0488 0.091,0.0629 0.238,0.2191 0.446,0.468 l 0.133,-0.0809 c -0.187,-0.2601 -0.377,-0.4719 -0.567,-0.6332 -0.193,-0.1609 -0.371,-0.241 -0.537,-0.241 -0.09,0 -0.163,0.0301 -0.219,0.0934 -0.058,0.0628 -0.088,0.1507 -0.088,0.2648 0,0.15 0.04,0.348 0.117,0.5969 l 0.153,0.4859 c -0.378,-0.584 -0.721,-0.9867 -1.031,-1.2098 -0.213,-0.155 -0.419,-0.2312 -0.613,-0.2312 -0.197,0 -0.37,0.0871 -0.518,0.2621 -0.148,0.177 -0.22,0.4152 -0.22,0.7191 0,0.3872 0.124,0.8008 0.372,1.2411 0.247,0.4398 0.572,0.7988 0.979,1.073 0.32,0.2219 0.615,0.332 0.883,0.332 0.142,0 0.262,-0.0273 0.364,-0.0851 0.102,-0.057 0.201,-0.152 0.3,-0.2852 l 0.382,1.3602 c 0.029,0.0961 0.053,0.1719 0.071,0.2289 0.03,0.1051 0.047,0.191 0.047,0.2601 0,0.0532 -0.021,0.0989 -0.059,0.1348 -0.054,0.0453 -0.125,0.066 -0.21,0.066 -0.061,0 -0.159,-0.009 -0.297,-0.0258 v 0.1438 z m -1.449,-2.7738 c 0,0.1668 -0.048,0.3008 -0.143,0.4031 -0.097,0.1008 -0.22,0.152 -0.369,0.152 -0.328,0 -0.669,-0.2711 -1.026,-0.8121 -0.353,-0.543 -0.533,-1.0602 -0.533,-1.5539 0,-0.1973 0.045,-0.3461 0.13,-0.4492 0.087,-0.102 0.189,-0.1539 0.309,-0.1539 0.271,0 0.611,0.2929 1.018,0.88 0.41,0.5848 0.614,1.0981 0.614,1.534"
             style="fill:#00adef;fill-opacity:1;fill-rule:evenodd;stroke:none;stroke-width:0.1"
             id="path103" /><path
             d="m 130.216,94.5191 c 0.127,-0.1339 0.224,-0.2703 0.289,-0.405 0.046,-0.0942 0.124,-0.3403 0.231,-0.7379 l 0.344,0.5148 c 0.09,0.1238 0.201,0.2449 0.332,0.3578 0.129,0.1133 0.244,0.1903 0.342,0.2321 0.064,0.0261 0.132,0.0382 0.208,0.0382 0.112,0 0.2,-0.0293 0.268,-0.089 0.066,-0.059 0.099,-0.1332 0.099,-0.218 0,-0.0992 -0.019,-0.1672 -0.058,-0.2031 -0.074,-0.066 -0.157,-0.0981 -0.249,-0.0981 -0.056,0 -0.114,0.011 -0.177,0.0352 -0.123,0.0418 -0.205,0.0629 -0.246,0.0629 -0.064,0 -0.137,-0.0379 -0.224,-0.1102 -0.161,-0.1359 -0.352,-0.3968 -0.577,-0.7847 l 0.32,-1.3442 c 0.049,-0.2051 0.091,-0.3289 0.125,-0.3687 0.034,-0.0403 0.068,-0.0602 0.102,-0.0602 0.056,0 0.118,0.0301 0.19,0.0891 0.144,0.1199 0.266,0.2769 0.369,0.4699 l 0.135,-0.0699 c -0.164,-0.309 -0.372,-0.5641 -0.625,-0.766 -0.142,-0.1153 -0.263,-0.1723 -0.363,-0.1723 -0.145,0 -0.261,0.0812 -0.348,0.2453 -0.053,0.1008 -0.167,0.5399 -0.339,1.3129 -0.406,-0.7059 -0.731,-1.159 -0.976,-1.3641 -0.158,-0.1281 -0.313,-0.1941 -0.462,-0.1941 -0.104,0 -0.197,0.0371 -0.284,0.1133 -0.063,0.057 -0.094,0.1328 -0.094,0.2301 0,0.0859 0.029,0.1578 0.086,0.2148 0.057,0.0578 0.127,0.0871 0.211,0.0871 0.082,0 0.173,-0.0422 0.266,-0.1262 0.067,-0.0609 0.12,-0.0898 0.156,-0.0898 0.031,0 0.071,0.0211 0.121,0.0617 0.122,0.0992 0.289,0.3133 0.5,0.6402 0.211,0.3282 0.349,0.5661 0.414,0.7129 -0.161,0.6309 -0.249,0.9672 -0.262,1.002 -0.06,0.1691 -0.137,0.2902 -0.234,0.3601 -0.097,0.0711 -0.237,0.1071 -0.426,0.1071 -0.06,0 -0.13,-0.0039 -0.207,-0.0102 v 0.1422 l 1.043,0.182"
             style="fill:#00adef;fill-opacity:1;fill-rule:evenodd;stroke:none;stroke-width:0.1"
             id="path105" /></g></g><path
         d="m 94.3711,83.7988 -1.3434,-4.609 C 92.9559,78.9391 92.918,78.775 92.918,78.698 c 0,-0.0269 0.0129,-0.0511 0.034,-0.0742 0.023,-0.0226 0.0449,-0.0347 0.0691,-0.0347 0.0328,0 0.0727,0.0168 0.1207,0.05 0.0891,0.064 0.2359,0.2187 0.4441,0.4679 l 0.134,-0.0808 C 93.532,78.766 93.3418,78.5539 93.152,78.393 c -0.1922,-0.1621 -0.3711,-0.2418 -0.5379,-0.2418 -0.0883,0 -0.1614,0.0308 -0.218,0.0949 -0.0582,0.0609 -0.0863,0.1488 -0.0863,0.2641 0,0.1488 0.0402,0.3476 0.116,0.5968 l 0.1519,0.4852 c -0.3769,-0.5844 -0.7199,-0.9863 -1.0297,-1.2102 -0.214,-0.155 -0.4191,-0.2308 -0.6132,-0.2308 -0.1981,0 -0.3707,0.0879 -0.518,0.2636 -0.1469,0.175 -0.2207,0.4141 -0.2207,0.7161 0,0.3882 0.1238,0.8031 0.3727,1.2429 0.246,0.4403 0.573,0.7973 0.9792,1.0731 0.32,0.2211 0.6137,0.332 0.8829,0.332 0.141,0 0.2609,-0.0277 0.3629,-0.0848 0.1031,-0.0582 0.2023,-0.1523 0.3,-0.2851 l 0.3839,1.3601 c 0.0282,0.095 0.0512,0.1707 0.0692,0.2297 0.0308,0.1043 0.0469,0.1891 0.0469,0.2571 0,0.055 -0.02,0.1 -0.0579,0.1359 -0.0539,0.0461 -0.1261,0.0672 -0.2109,0.0672 -0.059,0 -0.159,-0.009 -0.2973,-0.027 v 0.1442 z m -1.4492,-2.7726 c 0,0.1668 -0.0481,0.3019 -0.1442,0.4019 -0.0949,0.102 -0.2168,0.1539 -0.3679,0.1539 -0.3278,0 -0.6688,-0.2718 -1.025,-0.814 -0.3547,-0.5418 -0.5328,-1.059 -0.5328,-1.5539 0,-0.1961 0.0449,-0.345 0.13,-0.4481 0.086,-0.1019 0.1879,-0.1551 0.3078,-0.1551 0.2719,0 0.611,0.293 1.02,0.8801 0.4082,0.5871 0.6121,1.0969 0.6121,1.5352"
         style="fill:#00adef;fill-opacity:1;fill-rule:evenodd;stroke:none;stroke-width:0.1"
         id="path107" /><path
         d="m 95.3211,81.7789 c 0.0879,-0.1508 0.1488,-0.2918 0.184,-0.423 0.0328,-0.1309 0.066,-0.3899 0.1019,-0.7739 l 0.1707,-1.923 c 0.1571,0.1871 0.3832,0.484 0.6801,0.891 0.1442,0.198 0.3199,0.466 0.5313,0.8078 0.1277,0.2082 0.2058,0.3543 0.2347,0.4371 0.0141,0.0422 0.0223,0.0852 0.0223,0.1289 0,0.0293 -0.0082,0.0532 -0.0273,0.0723 -0.018,0.0168 -0.0649,0.0379 -0.1418,0.0629 -0.0782,0.0238 -0.1411,0.0711 -0.1922,0.1359 -0.0508,0.0672 -0.075,0.143 -0.075,0.2289 0,0.1071 0.0312,0.193 0.0929,0.2582 0.0621,0.066 0.1403,0.0969 0.234,0.0969 0.1141,0 0.2133,-0.0461 0.2942,-0.143 0.08,-0.0941 0.1199,-0.2238 0.1199,-0.391 0,-0.2051 -0.0688,-0.4418 -0.2098,-0.7051 -0.141,-0.2648 -0.4121,-0.6687 -0.8133,-1.2168 -0.4,-0.548 -0.8859,-1.1441 -1.4558,-1.789 -0.3942,-0.4449 -0.686,-0.727 -0.877,-0.843 -0.189,-0.1129 -0.3519,-0.173 -0.4871,-0.173 -0.0808,0 -0.1519,0.0308 -0.214,0.0922 -0.0598,0.0609 -0.0911,0.1316 -0.0911,0.2128 0,0.1008 0.0422,0.1938 0.1274,0.277 0.084,0.0828 0.1758,0.125 0.2758,0.125 0.0519,0 0.0961,-0.0109 0.1289,-0.0352 0.0211,-0.0136 0.0441,-0.0507 0.0672,-0.1109 0.0257,-0.0609 0.048,-0.1019 0.0699,-0.123 0.0109,-0.0141 0.0289,-0.0188 0.0461,-0.0188 0.0148,0 0.0429,0.0117 0.0808,0.0379 0.1442,0.0879 0.311,0.2309 0.5,0.4211 0.2512,0.257 0.4352,0.4641 0.5551,0.6258 l -0.218,2.4769 C 95,80.907 94.9449,81.157 94.8711,81.2449 c -0.0731,0.0879 -0.1941,0.1332 -0.366,0.1332 -0.0551,0 -0.1524,-0.007 -0.2934,-0.0242 l -0.0347,0.1449 1.1441,0.2801"
         style="fill:#00adef;fill-opacity:1;fill-rule:evenodd;stroke:none;stroke-width:0.1"
         id="path109" /><path
         d="m 61.512885,88.117367 -1.3449,-4.6079 c -0.0711,-0.2512 -0.109,-0.4152 -0.109,-0.493 0,-0.0269 0.0109,-0.05 0.0328,-0.075 0.0231,-0.0222 0.0461,-0.034 0.0684,-0.034 0.0347,0 0.075,0.018 0.1207,0.05 0.0902,0.0629 0.239,0.22 0.4472,0.4688 l 0.1321,-0.0809 c -0.1883,-0.2609 -0.3774,-0.473 -0.5684,-0.634 -0.1906,-0.1609 -0.3707,-0.241 -0.5367,-0.241 -0.0902,0 -0.1621,0.0301 -0.2191,0.093 -0.0559,0.0621 -0.0871,0.15 -0.0871,0.2648 0,0.1493 0.0402,0.3493 0.1171,0.5981 l 0.1539,0.484 c -0.3789,-0.584 -0.723,-0.9848 -1.0308,-1.2098 -0.2129,-0.1551 -0.4192,-0.2301 -0.6141,-0.2301 -0.198,0 -0.3711,0.0871 -0.5172,0.2621 -0.1488,0.1758 -0.2218,0.4137 -0.2218,0.7168 0,0.3879 0.1242,0.8032 0.3718,1.243 0.2473,0.441 0.5731,0.7973 0.9813,1.0731 0.3187,0.221 0.6129,0.332 0.882,0.332 0.141,0 0.261,-0.0281 0.3649,-0.0852 0.1,-0.0578 0.2011,-0.1519 0.2992,-0.2847 l 0.3816,1.3599 c 0.0301,0.095 0.0524,0.172 0.0711,0.229 0.0301,0.105 0.0473,0.191 0.0473,0.258 0,0.055 -0.0211,0.101 -0.0582,0.136 -0.0559,0.047 -0.125,0.067 -0.2121,0.067 -0.0598,0 -0.1571,-0.009 -0.2969,-0.027 v 0.144 z m -1.45,-2.772 c 0,0.1668 -0.0469,0.3 -0.1449,0.4008 -0.0949,0.1024 -0.218,0.1531 -0.366,0.1531 -0.3281,0 -0.6711,-0.2711 -1.027,-0.8129 -0.3539,-0.5421 -0.5332,-1.0589 -0.5332,-1.5539 0,-0.1961 0.0442,-0.3461 0.1293,-0.448 0.0867,-0.1031 0.191,-0.1551 0.311,-0.1551 0.2691,0 0.6089,0.293 1.0168,0.8801 0.4101,0.5859 0.614,1.0969 0.614,1.5359"
         style="fill:#ff0000;fill-opacity:1;fill-rule:evenodd;stroke:none;stroke-width:0.1"
         id="path111" /><path
         d="m 62.460985,86.097367 c 0.0879,-0.1512 0.1488,-0.2922 0.1851,-0.4219 0.034,-0.132 0.0656,-0.391 0.1008,-0.7762 l 0.1711,-1.9218 c 0.157,0.1871 0.384,0.4839 0.6809,0.891 0.1421,0.1969 0.3191,0.466 0.53,0.809 0.1282,0.2078 0.2051,0.3527 0.2352,0.4359 0.014,0.041 0.023,0.0852 0.023,0.1289 0,0.0281 -0.009,0.0531 -0.0273,0.0711 -0.0188,0.018 -0.0649,0.0391 -0.143,0.0641 -0.0758,0.0238 -0.141,0.0711 -0.1918,0.1359 -0.05,0.0668 -0.0761,0.143 -0.0761,0.2289 0,0.107 0.032,0.193 0.0949,0.2582 0.0621,0.0649 0.1414,0.0969 0.2332,0.0969 0.116,0 0.2121,-0.0449 0.2929,-0.143 0.0821,-0.0941 0.1219,-0.225 0.1219,-0.3922 0,-0.2047 -0.0711,-0.441 -0.2109,-0.7047 -0.141,-0.2632 -0.4121,-0.6691 -0.8129,-1.216 -0.3992,-0.5472 -0.8871,-1.1441 -1.4563,-1.789 -0.3937,-0.445 -0.6847,-0.727 -0.8757,-0.8422 -0.1891,-0.1149 -0.352,-0.1739 -0.4871,-0.1739 -0.0801,0 -0.1532,0.0309 -0.2149,0.093 -0.0609,0.0602 -0.0902,0.1309 -0.0902,0.2121 0,0.1008 0.0414,0.1938 0.1261,0.277 0.084,0.0828 0.1782,0.125 0.275,0.125 0.052,0 0.0961,-0.011 0.129,-0.034 0.023,-0.0152 0.0449,-0.052 0.0691,-0.1133 0.025,-0.0598 0.048,-0.1008 0.0687,-0.1226 0.0133,-0.0122 0.0282,-0.0184 0.0461,-0.0184 0.0161,0 0.0442,0.0121 0.0821,0.0383 0.1441,0.089 0.3101,0.2301 0.5,0.4211 0.25,0.2566 0.4351,0.4648 0.555,0.6269 l -0.2179,2.475 c -0.036,0.409 -0.0918,0.659 -0.1641,0.7457 -0.0738,0.0891 -0.1961,0.134 -0.3668,0.134 -0.0551,0 -0.1543,-0.0078 -0.293,-0.0238 l -0.0363,0.1441 1.1442,0.2809"
         style="fill:#ff0000;fill-opacity:1;fill-rule:evenodd;stroke:none;stroke-width:0.1"
         id="path113" /><path
         d="m 69.562885,88.117367 -1.343,-4.6079 c -0.0718,-0.2512 -0.1109,-0.4152 -0.1109,-0.493 0,-0.0269 0.0121,-0.05 0.0352,-0.075 0.0207,-0.0222 0.0449,-0.034 0.0668,-0.034 0.0339,0 0.0742,0.018 0.1211,0.05 0.089,0.0629 0.2371,0.22 0.4449,0.4688 l 0.1332,-0.0809 c -0.1863,-0.2609 -0.3774,-0.473 -0.5684,-0.634 -0.1918,-0.1609 -0.3687,-0.241 -0.5359,-0.241 -0.0899,0 -0.161,0.0301 -0.2199,0.093 -0.0571,0.0621 -0.086,0.15 -0.086,0.2648 0,0.1493 0.0399,0.3493 0.1168,0.5981 l 0.1531,0.484 c -0.3769,-0.584 -0.7218,-0.9848 -1.0308,-1.2098 -0.2141,-0.1551 -0.4192,-0.2301 -0.6141,-0.2301 -0.1961,0 -0.3711,0.0871 -0.5172,0.2621 -0.1476,0.1758 -0.2207,0.4137 -0.2207,0.7168 0,0.3879 0.125,0.8032 0.3719,1.243 0.2461,0.441 0.5731,0.7973 0.9801,1.0731 0.3211,0.221 0.6148,0.332 0.882,0.332 0.1418,0 0.261,-0.0281 0.3641,-0.0852 0.1008,-0.0578 0.2019,-0.1519 0.3,-0.2847 l 0.3828,1.3599 c 0.0289,0.095 0.0531,0.172 0.0699,0.229 0.032,0.105 0.0473,0.191 0.0473,0.258 0,0.055 -0.0192,0.101 -0.0582,0.136 -0.0551,0.047 -0.125,0.067 -0.2102,0.067 -0.0609,0 -0.159,-0.009 -0.2969,-0.027 v 0.144 z m -1.45,-2.772 c 0,0.1668 -0.0469,0.3 -0.143,0.4008 -0.0968,0.1024 -0.2187,0.1531 -0.3679,0.1531 -0.3281,0 -0.6692,-0.2711 -1.0262,-0.8129 -0.3539,-0.5421 -0.534,-1.0589 -0.534,-1.5539 0,-0.1961 0.0453,-0.3461 0.1301,-0.448 0.0859,-0.1031 0.1891,-0.1551 0.3102,-0.1551 0.2699,0 0.6097,0.293 1.0179,0.8801 0.409,0.5859 0.6129,1.0969 0.6129,1.5359"
         style="fill:#ff0000;fill-opacity:1;fill-rule:evenodd;stroke:none;stroke-width:0.1"
         id="path115" /><path
         d="m 69.907085,86.004367 h 2.48 v -0.0969 l -2.7019,-2.8132 h 1.1429 c 0.271,0 0.443,0.0101 0.517,0.0308 0.072,0.0211 0.139,0.0653 0.2,0.1332 0.061,0.0672 0.129,0.1899 0.205,0.3668 h 0.145 l -0.34,-1.0617 h -2.5422 v 0.1141 l 2.7012,2.8109 h -1.1231 c -0.2371,0 -0.382,-0.007 -0.4308,-0.018 -0.0723,-0.0172 -0.1442,-0.0582 -0.216,-0.1242 -0.0723,-0.066 -0.1453,-0.1769 -0.2203,-0.3297 h -0.15 l 0.3332,0.9879"
         style="fill:#ff0000;fill-opacity:1;fill-rule:evenodd;stroke:none;stroke-width:0.1"
         id="path117" /><path
         d="m 132.847,101.979 -1.344,-4.6079 c -0.071,-0.2512 -0.108,-0.4152 -0.108,-0.493 0,-0.0269 0.011,-0.05 0.032,-0.075 0.023,-0.0222 0.047,-0.034 0.068,-0.034 0.035,0 0.075,0.018 0.122,0.05 0.089,0.0629 0.238,0.22 0.446,0.4688 l 0.132,-0.0809 c -0.188,-0.2609 -0.376,-0.473 -0.568,-0.634 -0.191,-0.1609 -0.37,-0.241 -0.537,-0.241 -0.089,0 -0.161,0.0301 -0.219,0.093 -0.056,0.0621 -0.086,0.15 -0.086,0.2648 0,0.1493 0.04,0.3493 0.117,0.5981 l 0.152,0.484 c -0.377,-0.584 -0.722,-0.9848 -1.03,-1.2098 -0.213,-0.1551 -0.418,-0.2301 -0.614,-0.2301 -0.197,0 -0.371,0.0871 -0.516,0.2621 -0.149,0.1758 -0.223,0.4137 -0.223,0.7168 0,0.3879 0.124,0.8032 0.372,1.243 0.247,0.441 0.573,0.7973 0.981,1.0731 0.319,0.221 0.614,0.332 0.882,0.332 0.141,0 0.261,-0.0281 0.365,-0.0852 0.1,-0.0578 0.201,-0.1519 0.299,-0.2847 l 0.382,1.3599 c 0.031,0.095 0.052,0.172 0.072,0.229 0.03,0.105 0.046,0.191 0.046,0.258 0,0.055 -0.02,0.101 -0.059,0.136 -0.055,0.047 -0.125,0.067 -0.21,0.067 -0.061,0 -0.158,-0.009 -0.298,-0.027 v 0.144 z m -1.448,-2.772 c 0,0.1668 -0.048,0.3 -0.145,0.4008 -0.096,0.1024 -0.219,0.1531 -0.368,0.1531 -0.327,0 -0.669,-0.2711 -1.025,-0.8129 -0.355,-0.5421 -0.534,-1.0589 -0.534,-1.5539 0,-0.1961 0.044,-0.3461 0.13,-0.448 0.086,-0.1031 0.19,-0.1551 0.31,-0.1551 0.27,0 0.609,0.293 1.018,0.8801 0.41,0.5859 0.614,1.0969 0.614,1.5359"
         style="fill:#ff0000;fill-opacity:1;fill-rule:evenodd;stroke:none;stroke-width:0.1"
         id="path119" /><path
         d="m 133.906,99.959 c 0.128,-0.1352 0.224,-0.2699 0.289,-0.4051 0.047,-0.0949 0.125,-0.3398 0.231,-0.7391 l 0.345,0.5172 c 0.09,0.1239 0.201,0.243 0.332,0.3571 0.129,0.1129 0.244,0.1898 0.342,0.2308 0.062,0.027 0.131,0.0391 0.208,0.0391 0.112,0 0.2,-0.0289 0.266,-0.0879 0.067,-0.0609 0.101,-0.1352 0.101,-0.2199 0,-0.0981 -0.021,-0.1672 -0.06,-0.2032 -0.073,-0.0652 -0.156,-0.098 -0.249,-0.098 -0.055,0 -0.112,0.0121 -0.176,0.0359 -0.123,0.0411 -0.205,0.0621 -0.246,0.0621 -0.062,0 -0.136,-0.0359 -0.222,-0.1089 -0.163,-0.1352 -0.354,-0.3973 -0.579,-0.7852 l 0.321,-1.3437 c 0.05,-0.2051 0.091,-0.3293 0.126,-0.3692 0.032,-0.041 0.065,-0.0601 0.1,-0.0601 0.055,0 0.119,0.0293 0.192,0.0902 0.143,0.1187 0.264,0.275 0.367,0.468 l 0.137,-0.0711 c -0.164,-0.3071 -0.372,-0.561 -0.626,-0.7649 -0.143,-0.114 -0.265,-0.1711 -0.363,-0.1711 -0.145,0 -0.261,0.0821 -0.347,0.2442 -0.056,0.1019 -0.168,0.5398 -0.341,1.3136 -0.405,-0.707 -0.731,-1.1597 -0.976,-1.3636 -0.159,-0.1301 -0.311,-0.1942 -0.462,-0.1942 -0.104,0 -0.198,0.0371 -0.285,0.1129 -0.06,0.0571 -0.093,0.134 -0.093,0.2301 0,0.0852 0.03,0.1578 0.086,0.2148 0.056,0.0571 0.127,0.0852 0.211,0.0852 0.083,0 0.172,-0.041 0.265,-0.125 0.068,-0.059 0.12,-0.0898 0.156,-0.0898 0.033,0 0.072,0.0218 0.122,0.0628 0.123,0.0989 0.289,0.3122 0.5,0.6399 0.21,0.3281 0.349,0.566 0.415,0.7121 -0.163,0.632 -0.25,0.9668 -0.262,1.0031 -0.061,0.1688 -0.139,0.2891 -0.236,0.361 -0.095,0.0687 -0.237,0.1039 -0.425,0.1039 -0.06,0 -0.129,-0.0032 -0.207,-0.0078 v 0.141 l 1.043,0.1828"
         style="fill:#ff0000;fill-opacity:1;fill-rule:evenodd;stroke:none;stroke-width:0.1"
         id="path121" /><path
         d="m 140.899,101.979 -1.345,-4.6079 c -0.071,-0.2512 -0.109,-0.4152 -0.109,-0.493 0,-0.0269 0.011,-0.05 0.034,-0.075 0.021,-0.0222 0.045,-0.034 0.067,-0.034 0.034,0 0.074,0.018 0.121,0.05 0.089,0.0629 0.237,0.22 0.445,0.4688 l 0.134,-0.0809 c -0.187,-0.2609 -0.378,-0.473 -0.568,-0.634 -0.192,-0.1609 -0.37,-0.241 -0.536,-0.241 -0.091,0 -0.162,0.0301 -0.22,0.093 -0.058,0.0621 -0.087,0.15 -0.087,0.2648 0,0.1493 0.04,0.3493 0.117,0.5981 l 0.154,0.484 c -0.378,-0.584 -0.723,-0.9848 -1.032,-1.2098 -0.213,-0.1551 -0.419,-0.2301 -0.614,-0.2301 -0.197,0 -0.37,0.0871 -0.516,0.2621 -0.149,0.1758 -0.222,0.4137 -0.222,0.7168 0,0.3879 0.125,0.8032 0.372,1.243 0.247,0.441 0.573,0.7973 0.98,1.0731 0.321,0.221 0.615,0.332 0.883,0.332 0.142,0 0.261,-0.0281 0.363,-0.0852 0.102,-0.0578 0.203,-0.1519 0.3,-0.2847 l 0.383,1.3599 c 0.029,0.095 0.053,0.172 0.071,0.229 0.031,0.105 0.046,0.191 0.046,0.258 0,0.055 -0.019,0.101 -0.057,0.136 -0.056,0.047 -0.126,0.067 -0.211,0.067 -0.061,0 -0.159,-0.009 -0.298,-0.027 v 0.144 z m -1.451,-2.772 c 0,0.1668 -0.047,0.3 -0.144,0.4008 -0.095,0.1024 -0.218,0.1531 -0.367,0.1531 -0.328,0 -0.669,-0.2711 -1.026,-0.8129 -0.353,-0.5421 -0.533,-1.0589 -0.533,-1.5539 0,-0.1961 0.044,-0.3461 0.129,-0.448 0.087,-0.1031 0.19,-0.1551 0.31,-0.1551 0.27,0 0.61,0.293 1.018,0.8801 0.41,0.5859 0.613,1.0969 0.613,1.5359"
         style="fill:#ff0000;fill-opacity:1;fill-rule:evenodd;stroke:none;stroke-width:0.1"
         id="path123" /><path
         d="m 141.242,99.866 h 2.48 v -0.0969 l -2.702,-2.8132 h 1.143 c 0.272,0 0.444,0.0101 0.516,0.0308 0.073,0.0211 0.141,0.0653 0.201,0.1332 0.063,0.0672 0.13,0.1899 0.206,0.3668 h 0.145 l -0.34,-1.0617 h -2.544 v 0.1141 l 2.703,2.8109 h -1.124 c -0.237,0 -0.382,-0.007 -0.431,-0.018 -0.072,-0.0172 -0.144,-0.0582 -0.216,-0.1242 -0.072,-0.066 -0.145,-0.1769 -0.22,-0.3297 h -0.149 l 0.332,0.9879"
         style="fill:#ff0000;fill-opacity:1;fill-rule:evenodd;stroke:none;stroke-width:0.1"
         id="path125" /><g
         id="g832"
         transform="matrix(0.65407315,-0.18000988,0.17529101,0.63692695,21.527506,63.760295)"><path
           d="m 148.453,101.511 -16.737,8.285"
           style="fill:none;stroke:#ff0000;stroke-width:0.283;stroke-linecap:butt;stroke-linejoin:miter;stroke-miterlimit:2.613;stroke-dasharray:none;stroke-opacity:1"
           id="path127" /><path
           d="m 128.451,111.413 3.146,-2.943 c -0.161,1.003 0.205,1.745 1.1,2.225 l -4.246,0.718"
           style="fill:#ff0000;fill-opacity:1;fill-rule:evenodd;stroke:none;stroke-width:0.1"
           id="path129" /></g><path
         d="M 119.51408,138.79306 103.38776,124.75151"
         style="fill:none;stroke:#ff0000;stroke-width:0.36164;stroke-linecap:butt;stroke-linejoin:miter;stroke-miterlimit:2.613;stroke-dasharray:none;stroke-opacity:1"
         id="path127-5" /><path
         d="m 100.24189,122.01099 3.03121,4.98785 c -0.15512,-1.6999 0.19752,-2.95746 1.05987,-3.77097 l -4.09108,-1.21688"
         style="fill:#ff0000;fill-opacity:1;fill-rule:evenodd;stroke:none;stroke-width:0.127788"
         id="path129-4" /><g
         id="g884"><path
           d="M 66.012885,89.617367 83.33785,98.290554"
           style="fill:none;stroke:#ff0000;stroke-width:0.294596;stroke-linecap:butt;stroke-linejoin:miter;stroke-miterlimit:2.613;stroke-dasharray:none;stroke-opacity:1"
           id="path127-0" /><path
           d="M 86.717548,99.983317 83.46103,96.902425 c 0.166656,1.049995 -0.212202,1.826761 -1.138643,2.329251 l 4.395161,0.751641"
           style="fill:#ff0000;fill-opacity:1;fill-rule:evenodd;stroke:none;stroke-width:0.104098"
           id="path129-5" /></g></g></g></svg>
