Reference, Quantity, Value, Footprint, Datasheet, MFN, MFP
C1 C10 ,2,"4.7u","Capacitor_SMD:C_0805_2012Metric","~","TDK","C2012X5R1H475K125AB"
C2 ,1,"100n","Capacitor_SMD:C_0805_2012Metric","~","Kemet","C0805C104M5RACTU"
C3 ,1,"15n","Capacitor_SMD:C_0805_2012Metric","~","TDK","CGA4F2C0G1H153J085AA"
C4 ,1,"470n","Capacitor_SMD:C_0805_2012Metric","~","Murata","GRM21BR71H474KA88L"
C5 ,1,"2.2u","Capacitor_SMD:C_0805_2012Metric","~","Taiyo Yuden","EMK212BJ225KG-T"
C6 ,1,"100p","Capacitor_SMD:C_0805_2012Metric","~","Kemet","C0805C101K5GACTU"
C7 C8 C9 ,3,"22u","Capacitor_SMD:C_2220_5650Metric_Pad1.97x5.40mm_HandSolder","~","TDK","CKG57NX5R1H226M500JH"
J6 J7 J5 J8 J9 J10 J11 J12 J13 J2 J1 J4 J3 ,13,"Screw_Terminal_01x01","lsf-kicad-lib:KEYSTONE-1502-2","~"
L1 ,1,"4.7u","lsf-kicad-lib:SRP1270","~","Bourns","SRP1270-4R7M"
Q1 ,1,"NTMFS5C673NL","lsf-kicad-lib:SO-8FL","https://www.onsemi.com/pub/Collateral/NTMFS5C673NL-D.PDF","ON Semiconductor","NTMFS5C673NLT1G"
Q2 ,1,"CSD19534Q5A","Package_TO_SOT_SMD:TDSON-8-1","http://www.ti.com/lit/gpn/csd19534q5a","Texas Instruments","CSD19534Q5A"
R1 ,1,"187k","Resistor_SMD:R_0805_2012Metric","~","Vishay-Dale","CRCW0805187KFKEA"
R2 ,1,"3.4k","Resistor_SMD:R_0805_2012Metric","~","Panasonic","ERJ-6ENF3401V"
R3 ,1,"191k","Resistor_SMD:R_0805_2012Metric","~","Panasonic","ERJ-6ENF1913V"
R4 ,1,"10k","Resistor_SMD:R_0805_2012Metric","~","Vishay-Dale","CRCW080510K0FKEA"
SW1 ,1,"SW_SPDT","lsf-kicad-lib:D2F-L","~","Omron","D2F-L"
U1 ,1,"LM3150MH","lsf-kicad-lib:HTSSOP-14","http://www.ti.com/lit/ds/snvs561g/snvs561g.pdf","Texas Instruments","LM3150MH/NOPB"