ISO-10303-21;
HEADER;
/* Generated by software containing ST-Developer
 * from STEP Tools, Inc. (www.steptools.com) 
 */
/* OPTION: using custom renumber hook */

FILE_DESCRIPTION(
/* description */ ('STEP AP214'),
/* implementation_level */ '2;1');

FILE_NAME(
/* name */ 'SCLGHN6-33.0',
/* time_stamp */ '2025-02-10T12:11:57+01:00',
/* author */ ('License CC BY-ND 4.0'),
/* organization */ ('CADENAS'),
/* preprocessor_version */ 'ST-DEVELOPER v19.3',
/* originating_system */ 'PARTsolutions',
/* authorisation */ '  ');

FILE_SCHEMA (('AUTOMOTIVE_DESIGN {1 0 10303 214 3 1 1}'));
ENDSEC;

DATA;
#10=PROPERTY_DEFINITION_REPRESENTATION(#14,#12);
#11=PROPERTY_DEFINITION_REPRESENTATION(#15,#13);
#12=REPRESENTATION('',(#16),#696);
#13=REPRESENTATION('',(#17),#696);
#14=PROPERTY_DEFINITION('pmi validation property','',#705);
#15=PROPERTY_DEFINITION('pmi validation property','',#705);
#16=VALUE_REPRESENTATION_ITEM('number of annotations',COUNT_MEASURE(0.));
#17=VALUE_REPRESENTATION_ITEM('number of views',COUNT_MEASURE(0.));
#18=LINE('',#649,#36);
#19=LINE('',#651,#37);
#20=LINE('',#653,#38);
#21=LINE('',#654,#39);
#22=LINE('',#656,#40);
#23=LINE('',#658,#41);
#24=LINE('',#660,#42);
#25=LINE('',#662,#43);
#26=LINE('',#664,#44);
#27=LINE('',#666,#45);
#28=LINE('',#667,#46);
#29=LINE('',#669,#47);
#30=LINE('',#674,#48);
#31=LINE('',#678,#49);
#32=LINE('',#680,#50);
#33=LINE('',#681,#51);
#34=LINE('',#683,#52);
#35=LINE('',#684,#53);
#36=VECTOR('',#472,1000.);
#37=VECTOR('',#473,1000.);
#38=VECTOR('',#474,1000.);
#39=VECTOR('',#475,1000.);
#40=VECTOR('',#476,1000.);
#41=VECTOR('',#477,1000.);
#42=VECTOR('',#480,1000.);
#43=VECTOR('',#481,1000.);
#44=VECTOR('',#482,1000.);
#45=VECTOR('',#483,1000.);
#46=VECTOR('',#484,1000.);
#47=VECTOR('',#485,1000.);
#48=VECTOR('',#490,1000.);
#49=VECTOR('',#493,1000.);
#50=VECTOR('',#496,1000.);
#51=VECTOR('',#497,1000.);
#52=VECTOR('',#500,1000.);
#53=VECTOR('',#501,1000.);
#54=SPHERICAL_SURFACE('',#400,1.4);
#55=CONTEXT_DEPENDENT_SHAPE_REPRESENTATION(#61,#707);
#56=CONTEXT_DEPENDENT_SHAPE_REPRESENTATION(#62,#709);
#57=CONTEXT_DEPENDENT_SHAPE_REPRESENTATION(#63,#710);
#58=NEXT_ASSEMBLY_USAGE_OCCURRENCE('NAUO1','SCLGHN6-33.0_b',
'SCLGHN6-33.0_b',#711,#712,'');
#59=NEXT_ASSEMBLY_USAGE_OCCURRENCE('NAUO2','NSPN1.6-10','NSPN1.6-10',#711,
#713,'');
#60=NEXT_ASSEMBLY_USAGE_OCCURRENCE('NAUO3','NSPN1.6-10','NSPN1.6-10',#711,
#713,'');
#61=(
REPRESENTATION_RELATIONSHIP(' ',' ',#385,#384)
REPRESENTATION_RELATIONSHIP_WITH_TRANSFORMATION(#64)
SHAPE_REPRESENTATION_RELATIONSHIP()
);
#62=(
REPRESENTATION_RELATIONSHIP(' ',' ',#386,#384)
REPRESENTATION_RELATIONSHIP_WITH_TRANSFORMATION(#65)
SHAPE_REPRESENTATION_RELATIONSHIP()
);
#63=(
REPRESENTATION_RELATIONSHIP(' ',' ',#386,#384)
REPRESENTATION_RELATIONSHIP_WITH_TRANSFORMATION(#66)
SHAPE_REPRESENTATION_RELATIONSHIP()
);
#64=ITEM_DEFINED_TRANSFORMATION(' ',' ',#387,#399);
#65=ITEM_DEFINED_TRANSFORMATION(' ',' ',#387,#424);
#66=ITEM_DEFINED_TRANSFORMATION(' ',' ',#387,#425);
#67=SHAPE_REPRESENTATION_RELATIONSHIP('','',#385,#69);
#68=SHAPE_REPRESENTATION_RELATIONSHIP('','',#386,#70);
#69=ADVANCED_BREP_SHAPE_REPRESENTATION('',(#379),#697);
#70=ADVANCED_BREP_SHAPE_REPRESENTATION('',(#380),#698);
#71=CONICAL_SURFACE('',#393,2.5,0.785398163397448);
#72=CONICAL_SURFACE('',#394,3.,0.785398163397448);
#73=CONICAL_SURFACE('',#405,1.26666003841925,0.439987070568521);
#74=CONICAL_SURFACE('',#407,1.26666003841925,0.439987070568521);
#75=PLANE('',#391);
#76=PLANE('',#396);
#77=PLANE('',#409);
#78=PLANE('',#410);
#79=PLANE('',#414);
#80=PLANE('',#415);
#81=PLANE('',#416);
#82=PLANE('',#417);
#83=PLANE('',#420);
#84=PLANE('',#423);
#85=B_SPLINE_CURVE_WITH_KNOTS('',3,(#528,#529,#530,#531,#532,#533,#534,
#535,#536,#537,#538),.UNSPECIFIED.,.T.,.F.,(1,1,1,1,1,1,1,1,1,1,1,1,1,1,
1),(-0.00188417893556718,-0.00125611929037812,-0.00062805964518906,0.,0.000628059645189059,
0.00125611929037812,0.00188417893556718,0.00251223858075624,0.0031402982259453,
0.00376835787113436,0.00439641751632342,0.00502447716151247,0.00565253680670153,
0.00628059645189059,0.00690865609707965),.UNSPECIFIED.);
#86=B_SPLINE_CURVE_WITH_KNOTS('',3,(#540,#541,#542,#543,#544,#545,#546,
#547,#548,#549,#550),.UNSPECIFIED.,.T.,.F.,(1,1,1,1,1,1,1,1,1,1,1,1,1,1,
1),(-0.00188417893556717,-0.00125611929037812,-0.000628059645189058,0.,
0.000628059645189058,0.00125611929037812,0.00188417893556717,0.00251223858075623,
0.00314029822594529,0.00376835787113435,0.0043964175163234,0.00502447716151246,
0.00565253680670152,0.00628059645189058,0.00690865609707963),
 .UNSPECIFIED.);
#87=B_SPLINE_CURVE_WITH_KNOTS('',3,(#552,#553,#554,#555,#556,#557,#558,
#559,#560,#561,#562),.UNSPECIFIED.,.T.,.F.,(1,1,1,1,1,1,1,1,1,1,1,1,1,1,
1),(-0.00188417893556718,-0.00125611929037812,-0.000628059645189061,0.,
0.000628059645189061,0.00125611929037812,0.00188417893556718,0.00251223858075624,
0.00314029822594531,0.00376835787113437,0.00439641751632343,0.00502447716151249,
0.00565253680670155,0.00628059645189061,0.00690865609707967),
 .UNSPECIFIED.);
#88=B_SPLINE_CURVE_WITH_KNOTS('',3,(#564,#565,#566,#567,#568,#569,#570,
#571,#572,#573,#574),.UNSPECIFIED.,.T.,.F.,(1,1,1,1,1,1,1,1,1,1,1,1,1,1,
1),(-0.00188417893556718,-0.00125611929037812,-0.000628059645189061,0.,
0.000628059645189061,0.00125611929037812,0.00188417893556718,0.00251223858075624,
0.00314029822594531,0.00376835787113437,0.00439641751632343,0.00502447716151249,
0.00565253680670155,0.00628059645189061,0.00690865609707967),
 .UNSPECIFIED.);
#89=B_SPLINE_CURVE_WITH_KNOTS('',3,(#597,#598,#599,#600,#601,#602),
 .UNSPECIFIED.,.F.,.F.,(4,1,1,4),(8.03700861895826E-7,0.000754794000182066,
0.00113178914984215,0.00150878429950224),.UNSPECIFIED.);
#90=B_SPLINE_CURVE_WITH_KNOTS('',3,(#604,#605,#606,#607),.UNSPECIFIED.,
 .F.,.F.,(4,4),(0.00313426905190564,0.00316688479741741),.UNSPECIFIED.);
#91=B_SPLINE_CURVE_WITH_KNOTS('',3,(#611,#612,#613,#614),.UNSPECIFIED.,
 .F.,.F.,(4,4),(0.000322876338014609,0.000355543217338694),
 .UNSPECIFIED.);
#92=B_SPLINE_CURVE_WITH_KNOTS('',3,(#616,#617,#618,#619,#620,#621),
 .UNSPECIFIED.,.F.,.F.,(4,1,1,4),(0.000143748324603187,0.000520534591411176,
0.000897320858219165,0.00165089339183514),.UNSPECIFIED.);
#93=B_SPLINE_CURVE_WITH_KNOTS('',3,(#623,#624,#625,#626),.UNSPECIFIED.,
 .F.,.F.,(4,4),(0.000322876338014608,0.000355543217338694),
 .UNSPECIFIED.);
#94=B_SPLINE_CURVE_WITH_KNOTS('',3,(#629,#630,#631,#632,#633,#634),
 .UNSPECIFIED.,.F.,.F.,(4,1,1,4),(0.000143748324603189,0.000520534591417188,
0.000897320858231187,0.00165089339185919),.UNSPECIFIED.);
#95=B_SPLINE_CURVE_WITH_KNOTS('',3,(#635,#636,#637,#638,#639,#640),
 .UNSPECIFIED.,.F.,.F.,(4,1,1,4),(8.03700861893297E-7,0.000754794000182064,
0.00113178914984215,0.00150878429950224),.UNSPECIFIED.);
#96=B_SPLINE_CURVE_WITH_KNOTS('',3,(#642,#643,#644,#645),.UNSPECIFIED.,
 .F.,.F.,(4,4),(0.00313426905190564,0.00316688479741741),.UNSPECIFIED.);
#97=ORIENTED_EDGE('',*,*,#185,.F.);
#98=ORIENTED_EDGE('',*,*,#186,.T.);
#99=ORIENTED_EDGE('',*,*,#187,.F.);
#100=ORIENTED_EDGE('',*,*,#188,.F.);
#101=ORIENTED_EDGE('',*,*,#189,.F.);
#102=ORIENTED_EDGE('',*,*,#190,.F.);
#103=ORIENTED_EDGE('',*,*,#191,.F.);
#104=ORIENTED_EDGE('',*,*,#186,.F.);
#105=ORIENTED_EDGE('',*,*,#191,.T.);
#106=ORIENTED_EDGE('',*,*,#192,.F.);
#107=ORIENTED_EDGE('',*,*,#185,.T.);
#108=ORIENTED_EDGE('',*,*,#192,.T.);
#109=ORIENTED_EDGE('',*,*,#187,.T.);
#110=ORIENTED_EDGE('',*,*,#188,.T.);
#111=ORIENTED_EDGE('',*,*,#189,.T.);
#112=ORIENTED_EDGE('',*,*,#190,.T.);
#113=ORIENTED_EDGE('',*,*,#193,.F.);
#114=ORIENTED_EDGE('',*,*,#194,.F.);
#115=ORIENTED_EDGE('',*,*,#195,.F.);
#116=ORIENTED_EDGE('',*,*,#196,.F.);
#117=ORIENTED_EDGE('',*,*,#194,.T.);
#118=ORIENTED_EDGE('',*,*,#197,.T.);
#119=ORIENTED_EDGE('',*,*,#198,.F.);
#120=ORIENTED_EDGE('',*,*,#199,.F.);
#121=ORIENTED_EDGE('',*,*,#200,.F.);
#122=ORIENTED_EDGE('',*,*,#201,.T.);
#123=ORIENTED_EDGE('',*,*,#202,.F.);
#124=ORIENTED_EDGE('',*,*,#203,.T.);
#125=ORIENTED_EDGE('',*,*,#196,.T.);
#126=ORIENTED_EDGE('',*,*,#204,.T.);
#127=ORIENTED_EDGE('',*,*,#205,.F.);
#128=ORIENTED_EDGE('',*,*,#206,.F.);
#129=ORIENTED_EDGE('',*,*,#207,.F.);
#130=ORIENTED_EDGE('',*,*,#208,.F.);
#131=ORIENTED_EDGE('',*,*,#209,.F.);
#132=ORIENTED_EDGE('',*,*,#200,.T.);
#133=ORIENTED_EDGE('',*,*,#210,.F.);
#134=ORIENTED_EDGE('',*,*,#211,.F.);
#135=ORIENTED_EDGE('',*,*,#212,.T.);
#136=ORIENTED_EDGE('',*,*,#198,.T.);
#137=ORIENTED_EDGE('',*,*,#213,.F.);
#138=ORIENTED_EDGE('',*,*,#202,.T.);
#139=ORIENTED_EDGE('',*,*,#214,.F.);
#140=ORIENTED_EDGE('',*,*,#215,.F.);
#141=ORIENTED_EDGE('',*,*,#216,.T.);
#142=ORIENTED_EDGE('',*,*,#205,.T.);
#143=ORIENTED_EDGE('',*,*,#217,.F.);
#144=ORIENTED_EDGE('',*,*,#218,.T.);
#145=ORIENTED_EDGE('',*,*,#219,.F.);
#146=ORIENTED_EDGE('',*,*,#220,.F.);
#147=ORIENTED_EDGE('',*,*,#221,.F.);
#148=ORIENTED_EDGE('',*,*,#222,.T.);
#149=ORIENTED_EDGE('',*,*,#223,.F.);
#150=ORIENTED_EDGE('',*,*,#222,.F.);
#151=ORIENTED_EDGE('',*,*,#224,.F.);
#152=ORIENTED_EDGE('',*,*,#208,.T.);
#153=ORIENTED_EDGE('',*,*,#225,.F.);
#154=ORIENTED_EDGE('',*,*,#218,.F.);
#155=ORIENTED_EDGE('',*,*,#226,.F.);
#156=ORIENTED_EDGE('',*,*,#220,.T.);
#157=ORIENTED_EDGE('',*,*,#209,.T.);
#158=ORIENTED_EDGE('',*,*,#224,.T.);
#159=ORIENTED_EDGE('',*,*,#221,.T.);
#160=ORIENTED_EDGE('',*,*,#226,.T.);
#161=ORIENTED_EDGE('',*,*,#217,.T.);
#162=ORIENTED_EDGE('',*,*,#204,.F.);
#163=ORIENTED_EDGE('',*,*,#195,.T.);
#164=ORIENTED_EDGE('',*,*,#201,.F.);
#165=ORIENTED_EDGE('',*,*,#207,.T.);
#166=ORIENTED_EDGE('',*,*,#197,.F.);
#167=ORIENTED_EDGE('',*,*,#193,.T.);
#168=ORIENTED_EDGE('',*,*,#203,.F.);
#169=ORIENTED_EDGE('',*,*,#213,.T.);
#170=ORIENTED_EDGE('',*,*,#225,.T.);
#171=ORIENTED_EDGE('',*,*,#219,.T.);
#172=ORIENTED_EDGE('',*,*,#223,.T.);
#173=ORIENTED_EDGE('',*,*,#214,.T.);
#174=ORIENTED_EDGE('',*,*,#206,.T.);
#175=ORIENTED_EDGE('',*,*,#216,.F.);
#176=ORIENTED_EDGE('',*,*,#227,.F.);
#177=ORIENTED_EDGE('',*,*,#227,.T.);
#178=ORIENTED_EDGE('',*,*,#215,.T.);
#179=ORIENTED_EDGE('',*,*,#199,.T.);
#180=ORIENTED_EDGE('',*,*,#212,.F.);
#181=ORIENTED_EDGE('',*,*,#228,.F.);
#182=ORIENTED_EDGE('',*,*,#210,.T.);
#183=ORIENTED_EDGE('',*,*,#211,.T.);
#184=ORIENTED_EDGE('',*,*,#228,.T.);
#185=EDGE_CURVE('',#229,#229,#261,.T.);
#186=EDGE_CURVE('',#230,#230,#262,.T.);
#187=EDGE_CURVE('',#231,#231,#85,.T.);
#188=EDGE_CURVE('',#232,#232,#86,.T.);
#189=EDGE_CURVE('',#233,#233,#87,.T.);
#190=EDGE_CURVE('',#234,#234,#88,.T.);
#191=EDGE_CURVE('',#235,#235,#263,.T.);
#192=EDGE_CURVE('',#236,#236,#264,.T.);
#193=EDGE_CURVE('',#237,#238,#265,.F.);
#194=EDGE_CURVE('',#239,#237,#266,.T.);
#195=EDGE_CURVE('',#240,#239,#267,.F.);
#196=EDGE_CURVE('',#238,#240,#268,.T.);
#197=EDGE_CURVE('',#237,#241,#89,.T.);
#198=EDGE_CURVE('',#242,#241,#90,.T.);
#199=EDGE_CURVE('',#243,#242,#269,.T.);
#200=EDGE_CURVE('',#244,#243,#91,.T.);
#201=EDGE_CURVE('',#244,#239,#92,.T.);
#202=EDGE_CURVE('',#245,#246,#93,.T.);
#203=EDGE_CURVE('',#245,#238,#94,.T.);
#204=EDGE_CURVE('',#240,#247,#95,.T.);
#205=EDGE_CURVE('',#248,#247,#96,.T.);
#206=EDGE_CURVE('',#246,#248,#270,.T.);
#207=EDGE_CURVE('',#249,#241,#18,.T.);
#208=EDGE_CURVE('',#250,#249,#19,.T.);
#209=EDGE_CURVE('',#244,#250,#20,.T.);
#210=EDGE_CURVE('',#251,#243,#21,.T.);
#211=EDGE_CURVE('',#252,#251,#22,.T.);
#212=EDGE_CURVE('',#252,#242,#23,.T.);
#213=EDGE_CURVE('',#245,#253,#24,.T.);
#214=EDGE_CURVE('',#254,#246,#25,.T.);
#215=EDGE_CURVE('',#255,#254,#26,.T.);
#216=EDGE_CURVE('',#255,#248,#27,.T.);
#217=EDGE_CURVE('',#256,#247,#28,.T.);
#218=EDGE_CURVE('',#256,#253,#29,.T.);
#219=EDGE_CURVE('',#257,#258,#271,.T.);
#220=EDGE_CURVE('',#259,#257,#30,.T.);
#221=EDGE_CURVE('',#260,#259,#272,.T.);
#222=EDGE_CURVE('',#260,#258,#31,.T.);
#223=EDGE_CURVE('',#258,#249,#32,.T.);
#224=EDGE_CURVE('',#250,#260,#33,.T.);
#225=EDGE_CURVE('',#253,#257,#34,.T.);
#226=EDGE_CURVE('',#259,#256,#35,.T.);
#227=EDGE_CURVE('',#254,#255,#273,.T.);
#228=EDGE_CURVE('',#251,#252,#274,.T.);
#229=VERTEX_POINT('',#525);
#230=VERTEX_POINT('',#527);
#231=VERTEX_POINT('',#539);
#232=VERTEX_POINT('',#551);
#233=VERTEX_POINT('',#563);
#234=VERTEX_POINT('',#575);
#235=VERTEX_POINT('',#578);
#236=VERTEX_POINT('',#582);
#237=VERTEX_POINT('',#589);
#238=VERTEX_POINT('',#590);
#239=VERTEX_POINT('',#592);
#240=VERTEX_POINT('',#594);
#241=VERTEX_POINT('',#603);
#242=VERTEX_POINT('',#608);
#243=VERTEX_POINT('',#610);
#244=VERTEX_POINT('',#615);
#245=VERTEX_POINT('',#627);
#246=VERTEX_POINT('',#628);
#247=VERTEX_POINT('',#641);
#248=VERTEX_POINT('',#646);
#249=VERTEX_POINT('',#650);
#250=VERTEX_POINT('',#652);
#251=VERTEX_POINT('',#655);
#252=VERTEX_POINT('',#657);
#253=VERTEX_POINT('',#661);
#254=VERTEX_POINT('',#663);
#255=VERTEX_POINT('',#665);
#256=VERTEX_POINT('',#668);
#257=VERTEX_POINT('',#672);
#258=VERTEX_POINT('',#673);
#259=VERTEX_POINT('',#675);
#260=VERTEX_POINT('',#677);
#261=CIRCLE('',#389,3.);
#262=CIRCLE('',#390,3.);
#263=CIRCLE('',#392,2.5);
#264=CIRCLE('',#395,2.5);
#265=CIRCLE('',#401,1.21243556529821);
#266=CIRCLE('',#402,1.26666003841925);
#267=CIRCLE('',#403,1.21243556529821);
#268=CIRCLE('',#404,1.26666003841925);
#269=CIRCLE('',#406,0.7);
#270=CIRCLE('',#408,0.7);
#271=CIRCLE('',#412,0.7);
#272=CIRCLE('',#413,0.7);
#273=CIRCLE('',#419,0.7);
#274=CIRCLE('',#422,0.7);
#275=EDGE_LOOP('',(#97));
#276=EDGE_LOOP('',(#98));
#277=EDGE_LOOP('',(#99));
#278=EDGE_LOOP('',(#100));
#279=EDGE_LOOP('',(#101));
#280=EDGE_LOOP('',(#102));
#281=EDGE_LOOP('',(#103));
#282=EDGE_LOOP('',(#104));
#283=EDGE_LOOP('',(#105));
#284=EDGE_LOOP('',(#106));
#285=EDGE_LOOP('',(#107));
#286=EDGE_LOOP('',(#108));
#287=EDGE_LOOP('',(#109));
#288=EDGE_LOOP('',(#110));
#289=EDGE_LOOP('',(#111));
#290=EDGE_LOOP('',(#112));
#291=EDGE_LOOP('',(#113,#114,#115,#116));
#292=EDGE_LOOP('',(#117,#118,#119,#120,#121,#122));
#293=EDGE_LOOP('',(#123,#124,#125,#126,#127,#128));
#294=EDGE_LOOP('',(#129,#130,#131,#132,#133,#134,#135,#136));
#295=EDGE_LOOP('',(#137,#138,#139,#140,#141,#142,#143,#144));
#296=EDGE_LOOP('',(#145,#146,#147,#148));
#297=EDGE_LOOP('',(#149,#150,#151,#152));
#298=EDGE_LOOP('',(#153,#154,#155,#156));
#299=EDGE_LOOP('',(#157,#158,#159,#160,#161,#162,#163,#164));
#300=EDGE_LOOP('',(#165,#166,#167,#168,#169,#170,#171,#172));
#301=EDGE_LOOP('',(#173,#174,#175,#176));
#302=EDGE_LOOP('',(#177,#178));
#303=EDGE_LOOP('',(#179,#180,#181,#182));
#304=EDGE_LOOP('',(#183,#184));
#305=FACE_BOUND('',#275,.T.);
#306=FACE_BOUND('',#276,.T.);
#307=FACE_BOUND('',#277,.T.);
#308=FACE_BOUND('',#278,.T.);
#309=FACE_BOUND('',#279,.T.);
#310=FACE_BOUND('',#280,.T.);
#311=FACE_BOUND('',#281,.T.);
#312=FACE_BOUND('',#282,.T.);
#313=FACE_BOUND('',#283,.T.);
#314=FACE_BOUND('',#284,.T.);
#315=FACE_BOUND('',#285,.T.);
#316=FACE_BOUND('',#286,.T.);
#317=FACE_BOUND('',#287,.T.);
#318=FACE_BOUND('',#288,.T.);
#319=FACE_BOUND('',#289,.T.);
#320=FACE_BOUND('',#290,.T.);
#321=FACE_BOUND('',#291,.T.);
#322=FACE_BOUND('',#292,.T.);
#323=FACE_BOUND('',#293,.T.);
#324=FACE_BOUND('',#294,.T.);
#325=FACE_BOUND('',#295,.T.);
#326=FACE_BOUND('',#296,.T.);
#327=FACE_BOUND('',#297,.T.);
#328=FACE_BOUND('',#298,.T.);
#329=FACE_BOUND('',#299,.T.);
#330=FACE_BOUND('',#300,.T.);
#331=FACE_BOUND('',#301,.T.);
#332=FACE_BOUND('',#302,.T.);
#333=FACE_BOUND('',#303,.T.);
#334=FACE_BOUND('',#304,.T.);
#335=CYLINDRICAL_SURFACE('',#388,3.);
#336=CYLINDRICAL_SURFACE('',#397,0.8);
#337=CYLINDRICAL_SURFACE('',#398,0.8);
#338=CYLINDRICAL_SURFACE('',#411,0.7);
#339=CYLINDRICAL_SURFACE('',#418,0.7);
#340=CYLINDRICAL_SURFACE('',#421,0.7);
#341=ADVANCED_FACE('',(#305,#306,#307,#308,#309,#310),#335,.T.);
#342=ADVANCED_FACE('',(#311),#75,.F.);
#343=ADVANCED_FACE('',(#312,#313),#71,.T.);
#344=ADVANCED_FACE('',(#314,#315),#72,.T.);
#345=ADVANCED_FACE('',(#316),#76,.F.);
#346=ADVANCED_FACE('',(#317,#318),#336,.F.);
#347=ADVANCED_FACE('',(#319,#320),#337,.F.);
#348=ADVANCED_FACE('',(#321),#54,.T.);
#349=ADVANCED_FACE('',(#322),#73,.T.);
#350=ADVANCED_FACE('',(#323),#74,.T.);
#351=ADVANCED_FACE('',(#324),#77,.T.);
#352=ADVANCED_FACE('',(#325),#78,.T.);
#353=ADVANCED_FACE('',(#326),#338,.F.);
#354=ADVANCED_FACE('',(#327),#79,.T.);
#355=ADVANCED_FACE('',(#328),#80,.T.);
#356=ADVANCED_FACE('',(#329),#81,.F.);
#357=ADVANCED_FACE('',(#330),#82,.F.);
#358=ADVANCED_FACE('',(#331),#339,.T.);
#359=ADVANCED_FACE('',(#332),#83,.T.);
#360=ADVANCED_FACE('',(#333),#340,.T.);
#361=ADVANCED_FACE('',(#334),#84,.T.);
#362=CLOSED_SHELL('',(#341,#342,#343,#344,#345,#346,#347));
#363=CLOSED_SHELL('',(#348,#349,#350,#351,#352,#353,#354,#355,#356,#357,
#358,#359,#360,#361));
#364=STYLED_ITEM('',(#366),#379);
#365=STYLED_ITEM('',(#367),#380);
#366=PRESENTATION_STYLE_ASSIGNMENT((#368));
#367=PRESENTATION_STYLE_ASSIGNMENT((#369));
#368=SURFACE_STYLE_USAGE(.BOTH.,#370);
#369=SURFACE_STYLE_USAGE(.BOTH.,#371);
#370=SURFACE_SIDE_STYLE('',(#372));
#371=SURFACE_SIDE_STYLE('',(#373));
#372=SURFACE_STYLE_FILL_AREA(#374);
#373=SURFACE_STYLE_FILL_AREA(#375);
#374=FILL_AREA_STYLE('',(#376));
#375=FILL_AREA_STYLE('',(#377));
#376=FILL_AREA_STYLE_COLOUR('',#378);
#377=FILL_AREA_STYLE_COLOUR('',#378);
#378=COLOUR_RGB('',0.689999997615814,0.689999997615814,0.689999997615814);
#379=MANIFOLD_SOLID_BREP('SCLGHN6-33.0_b',#362);
#380=MANIFOLD_SOLID_BREP('NSPN1.6-10',#363);
#381=SHAPE_DEFINITION_REPRESENTATION(#705,#384);
#382=SHAPE_DEFINITION_REPRESENTATION(#706,#385);
#383=SHAPE_DEFINITION_REPRESENTATION(#708,#386);
#384=SHAPE_REPRESENTATION('SCLGHN6-33.0',(#387,#399,#424,#425),#696);
#385=SHAPE_REPRESENTATION('SCLGHN6-33.0_b',(#387),#697);
#386=SHAPE_REPRESENTATION('NSPN1.6-10',(#387),#698);
#387=AXIS2_PLACEMENT_3D('',#522,#426,#427);
#388=AXIS2_PLACEMENT_3D('',#523,#428,#429);
#389=AXIS2_PLACEMENT_3D('',#524,#430,#431);
#390=AXIS2_PLACEMENT_3D('',#526,#432,#433);
#391=AXIS2_PLACEMENT_3D('',#576,#434,#435);
#392=AXIS2_PLACEMENT_3D('',#577,#436,#437);
#393=AXIS2_PLACEMENT_3D('',#579,#438,#439);
#394=AXIS2_PLACEMENT_3D('',#580,#440,#441);
#395=AXIS2_PLACEMENT_3D('',#581,#442,#443);
#396=AXIS2_PLACEMENT_3D('',#583,#444,#445);
#397=AXIS2_PLACEMENT_3D('',#584,#446,#447);
#398=AXIS2_PLACEMENT_3D('',#585,#448,#449);
#399=AXIS2_PLACEMENT_3D('',#586,#450,#451);
#400=AXIS2_PLACEMENT_3D('',#587,#452,#453);
#401=AXIS2_PLACEMENT_3D('',#588,#454,#455);
#402=AXIS2_PLACEMENT_3D('',#591,#456,#457);
#403=AXIS2_PLACEMENT_3D('',#593,#458,#459);
#404=AXIS2_PLACEMENT_3D('',#595,#460,#461);
#405=AXIS2_PLACEMENT_3D('',#596,#462,#463);
#406=AXIS2_PLACEMENT_3D('',#609,#464,#465);
#407=AXIS2_PLACEMENT_3D('',#622,#466,#467);
#408=AXIS2_PLACEMENT_3D('',#647,#468,#469);
#409=AXIS2_PLACEMENT_3D('',#648,#470,#471);
#410=AXIS2_PLACEMENT_3D('',#659,#478,#479);
#411=AXIS2_PLACEMENT_3D('',#670,#486,#487);
#412=AXIS2_PLACEMENT_3D('',#671,#488,#489);
#413=AXIS2_PLACEMENT_3D('',#676,#491,#492);
#414=AXIS2_PLACEMENT_3D('',#679,#494,#495);
#415=AXIS2_PLACEMENT_3D('',#682,#498,#499);
#416=AXIS2_PLACEMENT_3D('',#685,#502,#503);
#417=AXIS2_PLACEMENT_3D('',#686,#504,#505);
#418=AXIS2_PLACEMENT_3D('',#687,#506,#507);
#419=AXIS2_PLACEMENT_3D('',#688,#508,#509);
#420=AXIS2_PLACEMENT_3D('',#689,#510,#511);
#421=AXIS2_PLACEMENT_3D('',#690,#512,#513);
#422=AXIS2_PLACEMENT_3D('',#691,#514,#515);
#423=AXIS2_PLACEMENT_3D('',#692,#516,#517);
#424=AXIS2_PLACEMENT_3D('',#693,#518,#519);
#425=AXIS2_PLACEMENT_3D('',#694,#520,#521);
#426=DIRECTION('',(0.,0.,1.));
#427=DIRECTION('',(1.,0.,0.));
#428=DIRECTION('',(1.,0.,0.));
#429=DIRECTION('',(0.,0.,-1.));
#430=DIRECTION('',(1.,0.,0.));
#431=DIRECTION('',(0.,0.,-1.));
#432=DIRECTION('',(1.,0.,0.));
#433=DIRECTION('',(0.,0.,-1.));
#434=DIRECTION('',(1.,0.,0.));
#435=DIRECTION('',(0.,0.,-1.));
#436=DIRECTION('',(1.,0.,0.));
#437=DIRECTION('',(0.,0.,-1.));
#438=DIRECTION('',(1.,0.,0.));
#439=DIRECTION('',(0.,0.,-1.));
#440=DIRECTION('',(-1.,0.,0.));
#441=DIRECTION('',(0.,0.,1.));
#442=DIRECTION('',(1.,0.,0.));
#443=DIRECTION('',(0.,0.,-1.));
#444=DIRECTION('',(-1.,0.,0.));
#445=DIRECTION('',(0.,0.,1.));
#446=DIRECTION('',(0.,0.,-1.));
#447=DIRECTION('',(-1.,0.,0.));
#448=DIRECTION('',(0.,0.,-1.));
#449=DIRECTION('',(-1.,0.,0.));
#450=DIRECTION('',(0.,0.,1.));
#451=DIRECTION('',(1.,0.,0.));
#452=DIRECTION('',(1.,0.,0.));
#453=DIRECTION('',(0.,1.,0.));
#454=DIRECTION('',(0.,0.,1.));
#455=DIRECTION('',(1.,0.,0.));
#456=DIRECTION('',(1.,0.,0.));
#457=DIRECTION('',(0.,0.,-1.));
#458=DIRECTION('',(0.,0.,-1.));
#459=DIRECTION('',(-1.,0.,0.));
#460=DIRECTION('',(1.,0.,0.));
#461=DIRECTION('',(0.,0.,-1.));
#462=DIRECTION('',(-1.,0.,0.));
#463=DIRECTION('',(0.,0.,1.));
#464=DIRECTION('',(1.,0.,0.));
#465=DIRECTION('',(0.,0.,-1.));
#466=DIRECTION('',(-1.,0.,0.));
#467=DIRECTION('',(0.,0.,1.));
#468=DIRECTION('',(1.,0.,0.));
#469=DIRECTION('',(0.,0.,-1.));
#470=DIRECTION('',(2.5410988417629E-16,1.,0.));
#471=DIRECTION('',(-1.,2.5410988417629E-16,0.));
#472=DIRECTION('',(1.,-2.5410988417629E-16,0.));
#473=DIRECTION('',(0.,0.,-1.));
#474=DIRECTION('',(-1.,2.5410988417629E-16,0.));
#475=DIRECTION('',(-1.,0.,0.));
#476=DIRECTION('',(0.,0.,1.));
#477=DIRECTION('',(-1.,0.,0.));
#478=DIRECTION('',(2.5410988417629E-16,-1.,0.));
#479=DIRECTION('',(1.,2.5410988417629E-16,0.));
#480=DIRECTION('',(-1.,-2.5410988417629E-16,0.));
#481=DIRECTION('',(-1.,0.,0.));
#482=DIRECTION('',(0.,0.,-1.));
#483=DIRECTION('',(-1.,0.,0.));
#484=DIRECTION('',(1.,2.5410988417629E-16,0.));
#485=DIRECTION('',(0.,0.,-1.));
#486=DIRECTION('',(0.,0.,-1.));
#487=DIRECTION('',(-1.,0.,0.));
#488=DIRECTION('',(0.,0.,1.));
#489=DIRECTION('',(1.,0.,0.));
#490=DIRECTION('',(0.,0.,-1.));
#491=DIRECTION('',(0.,0.,-1.));
#492=DIRECTION('',(-1.,0.,0.));
#493=DIRECTION('',(0.,0.,-1.));
#494=DIRECTION('',(-0.385697611456807,0.922625250313752,0.));
#495=DIRECTION('',(-0.922625250313752,-0.385697611456807,0.));
#496=DIRECTION('',(0.922625250313752,0.385697611456807,0.));
#497=DIRECTION('',(-0.922625250313752,-0.385697611456807,0.));
#498=DIRECTION('',(-0.385697611456807,-0.922625250313752,0.));
#499=DIRECTION('',(0.922625250313752,-0.385697611456807,0.));
#500=DIRECTION('',(-0.922625250313752,0.385697611456807,0.));
#501=DIRECTION('',(0.922625250313752,-0.385697611456807,0.));
#502=DIRECTION('',(0.,0.,-1.));
#503=DIRECTION('',(-1.,0.,0.));
#504=DIRECTION('',(0.,0.,1.));
#505=DIRECTION('',(1.,0.,0.));
#506=DIRECTION('',(-1.,0.,0.));
#507=DIRECTION('',(0.,0.,1.));
#508=DIRECTION('',(1.,0.,0.));
#509=DIRECTION('',(0.,0.,-1.));
#510=DIRECTION('',(1.,0.,0.));
#511=DIRECTION('',(0.,0.,-1.));
#512=DIRECTION('',(-1.,0.,0.));
#513=DIRECTION('',(0.,0.,1.));
#514=DIRECTION('',(1.,0.,0.));
#515=DIRECTION('',(0.,0.,-1.));
#516=DIRECTION('',(1.,0.,0.));
#517=DIRECTION('',(0.,0.,-1.));
#518=DIRECTION('',(-1.,0.,0.));
#519=DIRECTION('',(0.,0.,-1.));
#520=DIRECTION('',(-1.,0.,0.));
#521=DIRECTION('',(0.,0.,-1.));
#522=CARTESIAN_POINT('',(0.,0.,0.));
#523=CARTESIAN_POINT('',(41.6,0.,0.));
#524=CARTESIAN_POINT('',(41.1,0.,0.));
#525=CARTESIAN_POINT('',(41.1,0.,-3.));
#526=CARTESIAN_POINT('',(0.5,0.,0.));
#527=CARTESIAN_POINT('',(0.5,0.,-3.));
#528=CARTESIAN_POINT('',(2.8736405944677,0.627459479208389,2.9465713155982));
#529=CARTESIAN_POINT('',(2.61319000803045,-0.000100157499076473,3.0266983885174));
#530=CARTESIAN_POINT('',(2.8735993734105,-0.627058849212083,2.94663513033221));
#531=CARTESIAN_POINT('',(3.4990465225589,-0.886523405093416,2.86372159374441));
#532=CARTESIAN_POINT('',(4.12712212613796,-0.62684653426822,2.94667752407071));
#533=CARTESIAN_POINT('',(4.38636670023564,-0.000413816784003745,3.02663166718467));
#534=CARTESIAN_POINT('',(4.12741063702626,0.626456178049352,2.94679569095243));
#535=CARTESIAN_POINT('',(3.50028259371498,0.886520961742698,2.86370797109608));
#536=CARTESIAN_POINT('',(2.8736405944677,0.627459479208389,2.9465713155982));
#537=CARTESIAN_POINT('',(2.61319000803045,-0.000100157499076473,3.0266983885174));
#538=CARTESIAN_POINT('',(2.8735993734105,-0.627058849212083,2.94663513033221));
#539=CARTESIAN_POINT('',(2.7,0.,3.));
#540=CARTESIAN_POINT('',(2.8736405944677,-0.627459479208395,-2.9465713155982));
#541=CARTESIAN_POINT('',(2.61319000803046,0.000100157499078167,-3.0266983885174));
#542=CARTESIAN_POINT('',(2.8735993734105,0.627058849212082,-2.94663513033222));
#543=CARTESIAN_POINT('',(3.4990465225589,0.886523405093416,-2.86372159374441));
#544=CARTESIAN_POINT('',(4.12712212613796,0.62684653426822,-2.94667752407071));
#545=CARTESIAN_POINT('',(4.38636670023564,0.000413816784005794,-3.02663166718467));
#546=CARTESIAN_POINT('',(4.12741063702626,-0.626456178049354,-2.94679569095243));
#547=CARTESIAN_POINT('',(3.50028259371498,-0.886520961742696,-2.86370797109608));
#548=CARTESIAN_POINT('',(2.8736405944677,-0.627459479208395,-2.9465713155982));
#549=CARTESIAN_POINT('',(2.61319000803046,0.000100157499078167,-3.0266983885174));
#550=CARTESIAN_POINT('',(2.8735993734105,0.627058849212082,-2.94663513033222));
#551=CARTESIAN_POINT('',(2.7,0.,-3.));
#552=CARTESIAN_POINT('',(37.4736405944677,0.627459479208387,2.9465713155982));
#553=CARTESIAN_POINT('',(37.2131900080305,-0.000100157499074372,3.0266983885174));
#554=CARTESIAN_POINT('',(37.4735993734105,-0.627058849212089,2.94663513033221));
#555=CARTESIAN_POINT('',(38.0990465225589,-0.886523405093414,2.86372159374441));
#556=CARTESIAN_POINT('',(38.727122126138,-0.626846534268219,2.94667752407071));
#557=CARTESIAN_POINT('',(38.9863667002356,-0.000413816784003899,3.02663166718467));
#558=CARTESIAN_POINT('',(38.7274106370263,0.626456178049358,2.94679569095243));
#559=CARTESIAN_POINT('',(38.100282593715,0.886520961742697,2.86370797109608));
#560=CARTESIAN_POINT('',(37.4736405944677,0.627459479208387,2.9465713155982));
#561=CARTESIAN_POINT('',(37.2131900080305,-0.000100157499074372,3.0266983885174));
#562=CARTESIAN_POINT('',(37.4735993734105,-0.627058849212089,2.94663513033221));
#563=CARTESIAN_POINT('',(37.3,0.,3.));
#564=CARTESIAN_POINT('',(37.4736405944677,-0.627459479208387,-2.9465713155982));
#565=CARTESIAN_POINT('',(37.2131900080305,0.000100157499074372,-3.0266983885174));
#566=CARTESIAN_POINT('',(37.4735993734105,0.627058849212089,-2.94663513033221));
#567=CARTESIAN_POINT('',(38.0990465225589,0.886523405093414,-2.86372159374441));
#568=CARTESIAN_POINT('',(38.727122126138,0.626846534268219,-2.94667752407071));
#569=CARTESIAN_POINT('',(38.9863667002356,0.000413816784003899,-3.02663166718467));
#570=CARTESIAN_POINT('',(38.7274106370263,-0.626456178049358,-2.94679569095243));
#571=CARTESIAN_POINT('',(38.100282593715,-0.886520961742697,-2.86370797109608));
#572=CARTESIAN_POINT('',(37.4736405944677,-0.627459479208387,-2.9465713155982));
#573=CARTESIAN_POINT('',(37.2131900080305,0.000100157499074372,-3.0266983885174));
#574=CARTESIAN_POINT('',(37.4735993734105,0.627058849212089,-2.94663513033221));
#575=CARTESIAN_POINT('',(37.3,0.,-3.));
#576=CARTESIAN_POINT('',(0.,0.,0.));
#577=CARTESIAN_POINT('',(0.,0.,0.));
#578=CARTESIAN_POINT('',(0.,0.,-2.5));
#579=CARTESIAN_POINT('',(0.,0.,0.));
#580=CARTESIAN_POINT('',(41.1,0.,0.));
#581=CARTESIAN_POINT('',(41.6,0.,0.));
#582=CARTESIAN_POINT('',(41.6,0.,-2.5));
#583=CARTESIAN_POINT('',(41.6,2.5,0.));
#584=CARTESIAN_POINT('',(3.5,0.,6.));
#585=CARTESIAN_POINT('',(38.1,0.,6.));
#586=CARTESIAN_POINT('',(0.,0.,0.));
#587=CARTESIAN_POINT('',(-1.8,5.42101086242752E-16,0.));
#588=CARTESIAN_POINT('',(-1.8,5.42101086242752E-16,-0.7));
#589=CARTESIAN_POINT('',(-1.20370112605193,-1.055664555116,-0.7));
#590=CARTESIAN_POINT('',(-1.20370112607288,1.05566455512783,-0.7));
#591=CARTESIAN_POINT('',(-1.20370112605193,0.,0.));
#592=CARTESIAN_POINT('',(-1.20370112605193,-1.055664555116,0.7));
#593=CARTESIAN_POINT('',(-1.8,5.42101086242752E-16,0.7));
#594=CARTESIAN_POINT('',(-1.20370112605193,1.055664555116,0.7));
#595=CARTESIAN_POINT('',(-1.20370112605193,0.,0.));
#596=CARTESIAN_POINT('',(-1.20370112605193,0.,0.));
#597=CARTESIAN_POINT('',(-1.20370112605193,-1.05566455511601,-0.7));
#598=CARTESIAN_POINT('',(-0.98480310102412,-0.932018606030227,-0.7));
#599=CARTESIAN_POINT('',(-0.65828207453241,-0.740830751160256,-0.7));
#600=CARTESIAN_POINT('',(-0.255913598560201,-0.442271827850243,-0.7));
#601=CARTESIAN_POINT('',(-0.0781620034169642,-0.256936746170024,-0.7));
#602=CARTESIAN_POINT('',(-0.0294472609156155,-0.139999999999999,-0.7));
#603=CARTESIAN_POINT('',(-0.029447260915616,-0.139999999999999,-0.7));
#604=CARTESIAN_POINT('',(9.40806529831864E-17,-0.14,-0.68585712797929));
#605=CARTESIAN_POINT('',(-0.00981500121573725,-0.14,-0.690572963628147));
#606=CARTESIAN_POINT('',(-0.0196307699444045,-0.14,-0.695287223316641));
#607=CARTESIAN_POINT('',(-0.0294472609156149,-0.14,-0.699999999999999));
#608=CARTESIAN_POINT('',(0.,-0.14,-0.68585712797929));
#609=CARTESIAN_POINT('',(0.,0.,0.));
#610=CARTESIAN_POINT('',(0.,-0.14,0.68585712797929));
#611=CARTESIAN_POINT('',(-0.0294472609156158,-0.14,0.7));
#612=CARTESIAN_POINT('',(-0.0196307692913817,-0.14,0.695287223003133));
#613=CARTESIAN_POINT('',(-0.00981500054944972,-0.14,0.690572963308015));
#614=CARTESIAN_POINT('',(1.92449937715548E-16,-0.14,0.68585712797929));
#615=CARTESIAN_POINT('',(-0.0294472609156158,-0.139999999999998,0.7));
#616=CARTESIAN_POINT('',(-0.0294472609156155,-0.139999999999998,0.7));
#617=CARTESIAN_POINT('',(-0.0786105951074931,-0.258013562960093,0.7));
#618=CARTESIAN_POINT('',(-0.257403563305624,-0.443318143001463,0.7));
#619=CARTESIAN_POINT('',(-0.657854597839255,-0.740524334856283,0.7));
#620=CARTESIAN_POINT('',(-0.984883134658973,-0.932063813540628,0.7));
#621=CARTESIAN_POINT('',(-1.20370112605192,-1.05566455511602,0.7));
#622=CARTESIAN_POINT('',(-1.20370112605193,0.,0.));
#623=CARTESIAN_POINT('',(-0.0294472609156168,0.14,-0.7));
#624=CARTESIAN_POINT('',(-0.0196307692913824,0.14,-0.695287223003133));
#625=CARTESIAN_POINT('',(-0.00981500054945032,0.14,-0.690572963308015));
#626=CARTESIAN_POINT('',(-7.48923739719031E-17,0.14,-0.68585712797929));
#627=CARTESIAN_POINT('',(-0.0294472609156167,0.14,-0.7));
#628=CARTESIAN_POINT('',(0.,0.14,-0.68585712797929));
#629=CARTESIAN_POINT('',(-0.0294472609156163,0.14,-0.7));
#630=CARTESIAN_POINT('',(-0.0786105951082788,0.258013562961978,-0.7));
#631=CARTESIAN_POINT('',(-0.257403563310119,0.443318143005548,-0.7));
#632=CARTESIAN_POINT('',(-0.657854597850962,0.740524334864025,-0.7));
#633=CARTESIAN_POINT('',(-0.984883134676236,0.932063813550802,-0.7));
#634=CARTESIAN_POINT('',(-1.20370112607287,1.05566455512785,-0.7));
#635=CARTESIAN_POINT('',(-1.20370112605193,1.05566455511601,0.7));
#636=CARTESIAN_POINT('',(-0.984803101024122,0.932018606030228,0.7));
#637=CARTESIAN_POINT('',(-0.658282074532412,0.740830751160258,0.7));
#638=CARTESIAN_POINT('',(-0.255913598560201,0.442271827850243,0.7));
#639=CARTESIAN_POINT('',(-0.0781620034169648,0.256936746170025,0.7));
#640=CARTESIAN_POINT('',(-0.0294472609156158,0.140000000000001,0.7));
#641=CARTESIAN_POINT('',(-0.0294472609156167,0.14,0.7));
#642=CARTESIAN_POINT('',(3.0654692711859E-16,0.14,0.68585712797929));
#643=CARTESIAN_POINT('',(-0.00981500121573733,0.14,0.690572963628147));
#644=CARTESIAN_POINT('',(-0.0196307699444072,0.14,0.695287223316643));
#645=CARTESIAN_POINT('',(-0.0294472609156179,0.14,0.700000000000001));
#646=CARTESIAN_POINT('',(0.,0.14,0.68585712797929));
#647=CARTESIAN_POINT('',(0.,0.,0.));
#648=CARTESIAN_POINT('',(-0.32,-0.14,3.2));
#649=CARTESIAN_POINT('',(-0.32,-0.14,-0.7));
#650=CARTESIAN_POINT('',(-0.32,-0.14,-0.7));
#651=CARTESIAN_POINT('',(-0.32,-0.14,3.2));
#652=CARTESIAN_POINT('',(-0.32,-0.14,0.7));
#653=CARTESIAN_POINT('',(-0.32,-0.14,0.7));
#654=CARTESIAN_POINT('',(12.5,-0.14,0.68585712797929));
#655=CARTESIAN_POINT('',(12.5,-0.14,0.68585712797929));
#656=CARTESIAN_POINT('',(12.5,-0.14,-0.68585712797929));
#657=CARTESIAN_POINT('',(12.5,-0.14,-0.68585712797929));
#658=CARTESIAN_POINT('',(12.5,-0.14,-0.68585712797929));
#659=CARTESIAN_POINT('',(0.,0.14,3.2));
#660=CARTESIAN_POINT('',(0.,0.14,-0.7));
#661=CARTESIAN_POINT('',(-0.32,0.14,-0.7));
#662=CARTESIAN_POINT('',(10.,0.14,-0.68585712797929));
#663=CARTESIAN_POINT('',(10.,0.14,-0.68585712797929));
#664=CARTESIAN_POINT('',(10.,0.14,0.68585712797929));
#665=CARTESIAN_POINT('',(10.,0.14,0.68585712797929));
#666=CARTESIAN_POINT('',(10.,0.14,0.68585712797929));
#667=CARTESIAN_POINT('',(0.,0.14,0.7));
#668=CARTESIAN_POINT('',(-0.32,0.14,0.7));
#669=CARTESIAN_POINT('',(-0.32,0.14,3.2));
#670=CARTESIAN_POINT('',(-1.8,-4.33680868994202E-16,3.2));
#671=CARTESIAN_POINT('',(-1.8,-4.33680868994202E-16,-0.7));
#672=CARTESIAN_POINT('',(-1.53001167198024,0.645837675219626,-0.7));
#673=CARTESIAN_POINT('',(-1.53001167198024,-0.645837675219626,-0.7));
#674=CARTESIAN_POINT('',(-1.53001167198024,0.645837675219626,3.2));
#675=CARTESIAN_POINT('',(-1.53001167198024,0.645837675219626,0.7));
#676=CARTESIAN_POINT('',(-1.8,3.79470760369927E-16,0.7));
#677=CARTESIAN_POINT('',(-1.53001167198024,-0.645837675219626,0.7));
#678=CARTESIAN_POINT('',(-1.53001167198024,-0.645837675219626,3.2));
#679=CARTESIAN_POINT('',(-1.53001167198024,-0.645837675219626,3.2));
#680=CARTESIAN_POINT('',(-1.53001167198024,-0.645837675219626,-0.7));
#681=CARTESIAN_POINT('',(-1.53001167198024,-0.645837675219626,0.7));
#682=CARTESIAN_POINT('',(-0.32,0.14,3.2));
#683=CARTESIAN_POINT('',(-0.32,0.14,-0.7));
#684=CARTESIAN_POINT('',(-0.32,0.14,0.7));
#685=CARTESIAN_POINT('',(-3.52,3.2,0.7));
#686=CARTESIAN_POINT('',(0.,3.2,-0.7));
#687=CARTESIAN_POINT('',(10.,-3.25260651745651E-16,0.));
#688=CARTESIAN_POINT('',(10.,-3.25260651745651E-16,0.));
#689=CARTESIAN_POINT('',(10.,-3.25260651745651E-16,0.));
#690=CARTESIAN_POINT('',(12.5,3.25260651745651E-16,0.));
#691=CARTESIAN_POINT('',(12.5,3.25260651745651E-16,0.));
#692=CARTESIAN_POINT('',(12.5,3.25260651745651E-16,0.));
#693=CARTESIAN_POINT('',(3.5,-6.12323399573677E-16,5.));
#694=CARTESIAN_POINT('',(38.1,-6.12323399573677E-16,5.));
#695=MECHANICAL_DESIGN_GEOMETRIC_PRESENTATION_REPRESENTATION('',(#364,#365),
#696);
#696=(
GEOMETRIC_REPRESENTATION_CONTEXT(3)
GLOBAL_UNCERTAINTY_ASSIGNED_CONTEXT((#699))
GLOBAL_UNIT_ASSIGNED_CONTEXT((#704,#703,#702))
REPRESENTATION_CONTEXT('SCLGHN6-33.0','TOP_LEVEL_ASSEMBLY_PART')
);
#697=(
GEOMETRIC_REPRESENTATION_CONTEXT(3)
GLOBAL_UNCERTAINTY_ASSIGNED_CONTEXT((#700))
GLOBAL_UNIT_ASSIGNED_CONTEXT((#704,#703,#702))
REPRESENTATION_CONTEXT('SCLGHN6-33.0_b','COMPONENT_PART')
);
#698=(
GEOMETRIC_REPRESENTATION_CONTEXT(3)
GLOBAL_UNCERTAINTY_ASSIGNED_CONTEXT((#701))
GLOBAL_UNIT_ASSIGNED_CONTEXT((#704,#703,#702))
REPRESENTATION_CONTEXT('NSPN1.6-10','COMPONENT_PART')
);
#699=UNCERTAINTY_MEASURE_WITH_UNIT(LENGTH_MEASURE(0.005),#704,
'DISTANCE_ACCURACY_VALUE','Maximum Tolerance applied to model');
#700=UNCERTAINTY_MEASURE_WITH_UNIT(LENGTH_MEASURE(0.005),#704,
'DISTANCE_ACCURACY_VALUE','Maximum Tolerance applied to model');
#701=UNCERTAINTY_MEASURE_WITH_UNIT(LENGTH_MEASURE(0.005),#704,
'DISTANCE_ACCURACY_VALUE','Maximum Tolerance applied to model');
#702=(
NAMED_UNIT(*)
SI_UNIT($,.STERADIAN.)
SOLID_ANGLE_UNIT()
);
#703=(
NAMED_UNIT(*)
PLANE_ANGLE_UNIT()
SI_UNIT($,.RADIAN.)
);
#704=(
LENGTH_UNIT()
NAMED_UNIT(*)
SI_UNIT(.MILLI.,.METRE.)
);
#705=PRODUCT_DEFINITION_SHAPE('','',#711);
#706=PRODUCT_DEFINITION_SHAPE('','',#712);
#707=PRODUCT_DEFINITION_SHAPE(' ','NAUO PRDDFN',#58);
#708=PRODUCT_DEFINITION_SHAPE('','',#713);
#709=PRODUCT_DEFINITION_SHAPE(' ','NAUO PRDDFN',#59);
#710=PRODUCT_DEFINITION_SHAPE(' ','NAUO PRDDFN',#60);
#711=PRODUCT_DEFINITION('','',#717,#714);
#712=PRODUCT_DEFINITION('','',#718,#715);
#713=PRODUCT_DEFINITION('','',#719,#716);
#714=PRODUCT_DEFINITION_CONTEXT('',#733,'design');
#715=PRODUCT_DEFINITION_CONTEXT('',#733,'design');
#716=PRODUCT_DEFINITION_CONTEXT('',#733,'design');
#717=PRODUCT_DEFINITION_FORMATION_WITH_SPECIFIED_SOURCE('','',#723,
 .NOT_KNOWN.);
#718=PRODUCT_DEFINITION_FORMATION_WITH_SPECIFIED_SOURCE('','',#724,
 .NOT_KNOWN.);
#719=PRODUCT_DEFINITION_FORMATION_WITH_SPECIFIED_SOURCE('','',#725,
 .NOT_KNOWN.);
#720=PRODUCT_RELATED_PRODUCT_CATEGORY('','',(#723));
#721=PRODUCT_RELATED_PRODUCT_CATEGORY('','',(#724));
#722=PRODUCT_RELATED_PRODUCT_CATEGORY('','',(#725));
#723=PRODUCT('SCLGHN6-33.0','SCLGHN6-33.0','SCLGHN6-33.0',(#729));
#724=PRODUCT('SCLGHN6-33.0_b','SCLGHN6-33.0_b','SCLGHN6-33.0_b',(#730));
#725=PRODUCT('NSPN1.6-10','NSPN1.6-10','NSPN1.6-10',(#731));
#726=PRODUCT_CATEGORY('','');
#727=PRODUCT_CATEGORY('','');
#728=PRODUCT_CATEGORY('','');
#729=PRODUCT_CONTEXT('',#733,'mechanical');
#730=PRODUCT_CONTEXT('',#733,'mechanical');
#731=PRODUCT_CONTEXT('',#733,'mechanical');
#732=APPLICATION_PROTOCOL_DEFINITION('international standard',
'automotive_design',2010,#733);
#733=APPLICATION_CONTEXT(
'core data for automotive mechanical design processes');
ENDSEC;
END-ISO-10303-21;
