<?xml version="1.0" encoding="UTF-8" standalone="no"?>
<!-- Created with Inkscape (http://www.inkscape.org/) -->

<svg
   width="174.99832mm"
   height="34.862514mm"
   viewBox="0 0 174.99832 34.862515"
   version="1.1"
   id="svg1"
   sodipodi:docname="picobus2 logo.svg"
   inkscape:version="1.4 (e7c3feb100, 2024-10-09)"
   xmlns:inkscape="http://www.inkscape.org/namespaces/inkscape"
   xmlns:sodipodi="http://sodipodi.sourceforge.net/DTD/sodipodi-0.dtd"
   xmlns="http://www.w3.org/2000/svg"
   xmlns:svg="http://www.w3.org/2000/svg">
  <sodipodi:namedview
     id="namedview1"
     pagecolor="#505050"
     bordercolor="#eeeeee"
     borderopacity="1"
     inkscape:showpageshadow="0"
     inkscape:pageopacity="0"
     inkscape:pagecheckerboard="0"
     inkscape:deskcolor="#505050"
     inkscape:document-units="mm"
     inkscape:zoom="3.1842604"
     inkscape:cx="186.38551"
     inkscape:cy="61.23871"
     inkscape:window-width="2560"
     inkscape:window-height="1371"
     inkscape:window-x="0"
     inkscape:window-y="0"
     inkscape:window-maximized="1"
     inkscape:current-layer="svg1" />
  <defs
     id="defs1" />
  <g
     id="g9"
     transform="matrix(1.0879799,0,0,1.0967091,-59.927119,-309.15244)"
     style="stroke-width:0.383817;stroke-dasharray:none">
    <rect
       style="fill:none;stroke:#000000;stroke-width:0.383817;stroke-miterlimit:10;stroke-dasharray:none"
       id="rect2"
       width="25"
       height="15"
       x="84.773422"
       y="298.48706"
       ry="1.1274796"
       rx="1.1365256" />
    <path
       id="path2"
       style="fill:none;stroke:#000000;stroke-width:0.383817;stroke-miterlimit:10;stroke-dasharray:none"
       d="m 83.27192,300.98739 v -0.43564 c 0,-1.14374 -0.920732,-2.06447 -2.064474,-2.06447 H 60.336369 c -1.143742,0 -2.064474,0.92073 -2.064474,2.06447 v 10.87066 c 0,1.14374 0.920732,2.06499 2.064474,2.06499 h 20.871077 c 1.143742,0 2.064474,-0.92125 2.064474,-2.06499 v -0.43512" />
    <path
       style="fill:none;stroke:#000000;stroke-width:0.383817;stroke-linecap:butt;stroke-linejoin:miter;stroke-dasharray:none;stroke-opacity:1"
       d="m 56.770637,298.48713 v 14.99999"
       id="path3" />
    <path
       id="path4"
       style="fill:none;stroke:#000000;stroke-width:0.383817;stroke-miterlimit:10;stroke-dasharray:none"
       d="m 134.2103,297.78504 c 1.14374,0 2.06452,-0.92078 2.06452,-2.06452 v -11.57308 c 0,-1.14374 -0.92078,-2.06452 -2.06452,-2.06452 h -22.93548 v 15.70212 m 0,15.7021 h 22.93548 c 1.14374,0 2.06452,-0.92077 2.06452,-2.06452 v -11.57308 c 0,-1.14374 -0.92078,-2.06451 -2.06452,-2.06451 l -22.93548,10e-6 z" />
    <path
       id="path5"
       style="fill:none;stroke:#000000;stroke-width:0.383817;stroke-miterlimit:10;stroke-dasharray:none"
       d="m 164.27783,310.98729 v 0.43512 c 0,1.14374 0.92073,2.06447 2.06447,2.06447 h 20.87056 c 1.14374,0 2.06499,-0.92073 2.06499,-2.06447 v -11.57294 c 0,-1.14374 -0.92125,-2.06447 -2.06499,-2.06447 H 166.3423 c -1.14374,0 -2.06447,-0.92073 -2.06447,-2.06448 v -11.57293 c 0,-1.14374 0.92073,-2.06448 2.06447,-2.06448 h 20.87056 c 1.14374,0 2.06499,0.92074 2.06499,2.06448 v 0.78651" />
    <path
       id="path7"
       style="fill:none;stroke:#000000;stroke-width:0.383817;stroke-miterlimit:10;stroke-dasharray:none"
       d="m 162.77621,282.08292 v 29.3397 c 0,1.14375 -0.92077,2.06452 -2.06451,2.06452 h -20.87097 c -1.14374,0 -2.06452,-0.92077 -2.06452,-2.06452 v -29.3397" />
    <path
       id="path8"
       style="fill:none;stroke:#000000;stroke-width:0.383817;stroke-miterlimit:10;stroke-dasharray:none"
       d="m 55.272999,297.08292 v -15 H 107.708 c 1.14401,0 2.065,0.92099 2.065,2.065 v 10.87 c 0,1.14401 -0.92099,2.065 -2.065,2.065 z m 0,0 1e-6,16.4042" />
    <path
       id="path9"
       style="fill:none;stroke:#000000;stroke-width:0.383817;stroke-miterlimit:10;stroke-dasharray:none"
       d="m 215.7362,310.98729 v 0.43512 c 0,1.14374 -0.92073,2.06447 -2.06447,2.06447 h -20.87056 c -1.14374,0 -2.06499,-0.92073 -2.06499,-2.06447 v -11.57294 c 0,-1.14374 0.92125,-2.06447 2.06499,-2.06447 h 20.87056 c 1.14374,0 2.06447,-0.92073 2.06447,-2.06448 v -11.57293 c 0,-1.14374 -0.92073,-2.06448 -2.06447,-2.06448 h -20.87056 c -1.14374,0 -2.06499,0.92074 -2.06499,2.06448 v 0.78651" />
  </g>
</svg>
