{
  "menu": {
    "menuId": "menu-1",
    "menuName": "DashBoard Home",
    "link": "/"
  },
  "siderbar": {
    "dashboards": [
      {
        "siderbarId": "dashboard-1",
        "siderbarName": "Analytics",
        "link": "/analytics",
        "exact": true
      },
      {
        "siderbarId": "dashboard-2",
        "siderbarName": "Online Store",
        "link": "/online-store",
        "exact": false
      },
      {
        "siderbarId": "dashboard-3",
        "siderbarName": "Personal Blog",
        "link": "/personal-blog",
        "exact": false
      }
    ],
    "templates": []
  },
  "tables": [
    {
      "employee_name": "jdhgasdhjgas",
      "employee_salary": "22222",
      "employee_age": "22222",
      "profile_image": "",
      "id": "1"
    },
    {
      "employee_name": "Lam",
      "employee_salary": "13000",
      "employee_age": "25",
      "id": "2"
    },
    {
      "employee_name": "Lam1",
      "employee_salary": "5000",
      "employee_age": "34",
      "id": "h2Acb7_"
    },
    {
      "employee_name": "A",
      "employee_salary": "A",
      "employee_age": "A",
      "id": "WP1qb1J"
    }
  ]
}