<svg width="512" height="513" viewBox="0 0 512 513" fill="none" xmlns="http://www.w3.org/2000/svg">
<path fill-rule="evenodd" clip-rule="evenodd" d="M260.7 45.6509C271.887 28.9107 290.339 22.9118 304.066 28.8901C320.886 36.2591 329.949 55.4152 333.528 78.8921C335.24 90.119 334.835 106.412 333.501 123.4C332.179 140.246 329.994 157.223 328.357 169.62L341.352 171.336C342.99 158.93 345.216 141.65 346.568 124.426C347.909 107.343 348.443 89.7501 346.486 76.9167C342.73 52.2754 332.581 27.0677 309.319 16.881L309.308 16.8763C288.364 7.74979 263.59 17.7333 249.801 38.3691L249.801 38.3698C242.022 50.0146 237.742 64.1085 234.287 77.142L234.285 77.1504C228.304 99.8312 222.62 130.692 219.751 153.956L232.76 155.56C235.567 132.8 241.149 102.529 246.958 80.4953C250.402 67.5055 254.245 55.3141 260.7 45.6509Z" fill="#0154A0"/>
<path d="M347.484 499.892L453.026 455.92L418.235 102.73L166.704 70.3428V93.6608L103.169 101.695L347.484 499.892Z" fill="#2669A6"/>
<path d="M52.7197 462.146L347.522 500.15L370.229 358.757V142.083L103.163 101.691L52.7197 462.146Z" fill="#0088EC"/>
<path d="M204.037 310.514L262.671 319.015L304.771 267.877L275.884 223.514L204.037 310.514Z" fill="white"/>
<path d="M276.119 382.54L259.316 331.372L194.583 321.986L158.855 365.538L276.119 382.54Z" fill="white"/>
<path d="M218.223 276.398L159.589 267.897L118.377 318.063L147.264 362.426L218.223 276.398Z" fill="white"/>
<path d="M146.129 204.377L162.932 255.545L227.665 264.931L263.393 221.379L146.129 204.377Z" fill="white"/>
<path d="M370.227 142.081V117.715L418.551 102.718L166.173 71.9956L157.614 90.947L103.162 101.689L370.227 142.081Z" fill="#09415D"/>
<path d="M453.026 455.918C451.192 455.918 389.797 407.23 389.797 407.23L347.528 500.152L356.61 351.991L370.365 142.085L453.026 455.918Z" fill="#0154A0"/>
<path d="M166.97 74.7932L160.507 89.7272L159.678 91.6922L157.625 92.2162L125.094 100.557L365.872 137.018V114.312L369.19 113.482L409.713 103.264L166.97 74.7932ZM164.219 70.0771L417.295 103.264L370.195 117.718V142.127L103.173 101.692L156.49 87.9805L164.219 70.0771Z" fill="#2669A6"/>
<path fill-rule="evenodd" clip-rule="evenodd" d="M226.907 45.6509C238.094 28.9107 256.546 22.9118 270.273 28.8901C287.093 36.2591 296.156 55.4152 299.735 78.8921C301.447 90.119 301.042 106.412 299.708 123.4C298.386 140.246 296.201 157.223 294.564 169.62L307.559 171.336C309.197 158.93 311.423 141.65 312.775 124.426C314.116 107.343 314.65 89.7501 312.693 76.9167C308.937 52.2754 298.788 27.0677 275.526 16.881L275.515 16.8763C254.571 7.74979 229.798 17.7333 216.008 38.3691L216.008 38.3698C208.229 50.0146 203.949 64.1085 200.494 77.142L200.492 77.1504C194.511 99.8312 188.827 130.692 185.958 153.956L198.967 155.56C201.774 132.8 207.356 102.529 213.165 80.4953C216.609 67.5055 220.452 55.3141 226.907 45.6509Z" fill="#0088EC"/>
</svg>
