<svg width="18" height="18" viewBox="0 0 18 18" fill="none" xmlns="http://www.w3.org/2000/svg">
<g clip-path="url(#clip0_3220_11548)">
<path d="M18 0H0V18H18V0Z" fill="white" fill-opacity="0.01"/>
<path fill-rule="evenodd" clip-rule="evenodd" d="M3 6H15L14.3333 15H3.66667L3 6Z" stroke="#2F2F2F" stroke-width="1.5" stroke-linejoin="round"/>
<path d="M6.33301 7.33333V3H11.6663V7.33333" stroke="#2F2F2F" stroke-width="1.5" stroke-linecap="round" stroke-linejoin="round"/>
<path d="M6.33301 12.3335H11.6663" stroke="#2F2F2F" stroke-width="1.5" stroke-linecap="round"/>
</g>
<defs>
<clipPath id="clip0_3220_11548">
<rect width="18" height="18" fill="white"/>
</clipPath>
</defs>
</svg>
