<svg width="24" height="20" viewBox="0 0 24 20" fill="none" xmlns="http://www.w3.org/2000/svg">
<g clip-path="url(#clip0_6761_22087)">
<path d="M11.9132 20L0.372 12.2692C0.222462 12.1625 0.109846 12.0192 0.048 11.855L0.0461538 11.8483C0.0166154 11.7733 0 11.6875 0 11.5975C0 11.5075 0.0166154 11.4217 0.048 11.3408L0.0461538 11.3467L1.39662 7.64917L11.9132 20ZM4.88585 0.295L7.53877 7.6475H1.39569L4.00154 0.295C4.06615 0.1225 4.24431 0.000833333 4.45385 0.000833333H4.46769H4.46677C4.47415 0.000833333 4.48246 0 4.49077 0C4.68646 0 4.84892 0.125833 4.88492 0.2925V0.295H4.88585ZM7.53877 7.6475H16.2886L11.9142 20L7.53877 7.6475ZM23.7803 11.3442C23.8098 11.4192 23.8265 11.505 23.8265 11.595C23.8265 11.685 23.8098 11.7708 23.7785 11.8517L23.7803 11.8458C23.7166 12.0167 23.604 12.1592 23.4563 12.265L23.4545 12.2667L11.9132 20L22.4308 7.6475L23.7803 11.3442ZM19.8249 0.295L22.4308 7.6475H16.2877L18.9406 0.295C18.9775 0.125833 19.14 0 19.3357 0C19.344 0 19.3523 0 19.3606 0.000833333H19.3597H19.3726C19.5822 0.000833333 19.7594 0.1225 19.824 0.291667L19.8249 0.295Z" fill="white"/>
</g>
<defs>
<clipPath id="clip0_6761_22087">
<rect width="24" height="20" fill="white"/>
</clipPath>
</defs>
</svg>
