<svg width="32" height="32" viewBox="0 0 32 32" fill="none" xmlns="http://www.w3.org/2000/svg">
<path fill-rule="evenodd" clip-rule="evenodd" d="M15.5316 26.7314C14.9067 27.3563 13.8937 27.3563 13.2688 26.7314L3.66883 17.1314C3.04399 16.5066 3.04399 15.4935 3.66883 14.8687L13.2688 5.26868C13.8937 4.64384 14.9067 4.64384 15.5316 5.26868C16.1564 5.89352 16.1564 6.90658 15.5316 7.53142L8.66294 14.4H27.2002C28.0839 14.4 28.8002 15.1164 28.8002 16C28.8002 16.8837 28.0839 17.6 27.2002 17.6L8.66294 17.6L15.5316 24.4687C16.1564 25.0935 16.1564 26.1066 15.5316 26.7314Z" fill="#FCFCFD"/>
</svg>
