<?xml version="1.0" encoding="UTF-8" standalone="no"?>
<!-- Created with Inkscape (http://www.inkscape.org/) -->

<svg
   version="1.1"
   id="svg292"
   xml:space="preserve"
   width="210.57359"
   height="192.45306"
   viewBox="0 0 210.5736 192.45306"
   sodipodi:docname="cartesian_b.svg"
   inkscape:version="1.1 (c68e22c387, 2021-05-23)"
   xmlns:inkscape="http://www.inkscape.org/namespaces/inkscape"
   xmlns:sodipodi="http://sodipodi.sourceforge.net/DTD/sodipodi-0.dtd"
   xmlns="http://www.w3.org/2000/svg"
   xmlns:svg="http://www.w3.org/2000/svg"><defs
     id="defs296" /><sodipodi:namedview
     id="namedview294"
     pagecolor="#ffffff"
     bordercolor="#666666"
     borderopacity="1.0"
     inkscape:pageshadow="2"
     inkscape:pageopacity="0.0"
     inkscape:pagecheckerboard="0"
     showgrid="false"
     fit-margin-top="0"
     fit-margin-left="0"
     fit-margin-right="0"
     fit-margin-bottom="0"
     inkscape:zoom="2.3482782"
     inkscape:cx="98.795792"
     inkscape:cy="77.290674"
     inkscape:window-width="1680"
     inkscape:window-height="971"
     inkscape:window-x="-9"
     inkscape:window-y="-9"
     inkscape:window-maximized="1"
     inkscape:current-layer="layer1" /><g
     inkscape:groupmode="layer"
     id="layer2"
     inkscape:label="ink_ext_XXXXXX 2"
     transform="translate(-12.7308)" /><g
     id="g298"
     inkscape:groupmode="layer"
     inkscape:label="ink_ext_XXXXXX"
     transform="matrix(1.3333333,0,0,-1.3333333,-37.591732,210.47599)"
     style="display:inline" /><g
     inkscape:groupmode="layer"
     id="layer1"
     inkscape:label="ink_ext_XXXXXX 1"
     style="display:inline"
     transform="translate(-12.7308)"><g
       id="g407"><path
         d="M 28.9047,98.8367 60.0285,136.143 V 64.7602 L 28.9047,27.4539 v 71.3828"
         style="display:inline;fill:#f5f4f5;fill-opacity:1;fill-rule:evenodd;stroke:none;stroke-width:0.1"
         id="path306"
         transform="matrix(1.3333333,0,0,-1.3333333,-24.860933,210.47599)" /><path
         d="m 59.834,64.7852 h 97.284 v 71.0734 H 59.834 Z"
         style="display:inline;fill:#efeeee;fill-opacity:1;fill-rule:nonzero;stroke:none;stroke-width:0.1"
         id="path302"
         transform="matrix(1.3333333,0,0,-1.3333333,-24.860932,210.47599)" /><path
         d="m 59.834,65.116 h 97.283 L 129.256,27.8082 H 28.1938 L 59.834,65.116"
         style="display:inline;fill:#f3f3f3;fill-opacity:1;fill-rule:evenodd;stroke:none;stroke-width:0.1"
         id="path304"
         transform="matrix(1.3333333,0,0,-1.3333333,-24.860932,210.47599)" /><g
         id="g232"
         transform="matrix(1.3333333,0,0,-1.3333333,-111.52017,238.11033)"
         style="display:inline"><path
           d="m 160.86,115.439 h 2.085 c 0.546,0 0.957,-0.118 1.227,-0.352 0.271,-0.236 0.406,-0.524 0.406,-0.862 0,-0.27 -0.087,-0.529 -0.258,-0.781 -0.173,-0.253 -0.427,-0.459 -0.766,-0.616 -0.338,-0.157 -0.704,-0.236 -1.097,-0.236 -0.245,0 -0.555,0.044 -0.934,0.133 l -0.422,-1.445 c -0.099,-0.344 -0.148,-0.57 -0.148,-0.68 0,-0.084 0.035,-0.152 0.105,-0.207 0.072,-0.055 0.24,-0.091 0.504,-0.106 l -0.039,-0.144 h -2.106 l 0.045,0.144 c 0.275,0 0.467,0.049 0.575,0.142 0.108,0.096 0.224,0.358 0.349,0.788 l 0.875,3.015 c 0.104,0.363 0.156,0.606 0.156,0.728 0,0.09 -0.035,0.165 -0.111,0.225 -0.075,0.06 -0.236,0.095 -0.491,0.111 z m 0.73,-2.469 c 0.293,-0.076 0.531,-0.113 0.711,-0.113 0.282,0 0.541,0.059 0.774,0.175 0.234,0.118 0.416,0.294 0.547,0.528 0.133,0.235 0.198,0.478 0.198,0.729 0,0.265 -0.081,0.473 -0.242,0.627 -0.163,0.153 -0.406,0.23 -0.735,0.23 -0.177,0 -0.392,-0.023 -0.645,-0.066 l -0.608,-2.11"
           style="fill:#231f20;fill-opacity:1;fill-rule:evenodd;stroke:none;stroke-width:0.1"
           id="path308" /><path
           d="m 167.619,108.576 v -0.144 c -0.393,0.198 -0.721,0.429 -0.984,0.695 -0.374,0.378 -0.664,0.821 -0.866,1.337 -0.204,0.512 -0.305,1.043 -0.305,1.595 0,0.809 0.199,1.545 0.597,2.21 0.398,0.665 0.918,1.141 1.558,1.427 v -0.164 c -0.32,-0.177 -0.582,-0.418 -0.789,-0.727 -0.205,-0.305 -0.359,-0.695 -0.46,-1.166 -0.101,-0.47 -0.152,-0.966 -0.152,-1.476 0,-0.558 0.043,-1.065 0.128,-1.52 0.068,-0.361 0.151,-0.648 0.247,-0.866 0.096,-0.218 0.226,-0.426 0.388,-0.626 0.162,-0.203 0.376,-0.392 0.638,-0.575"
           style="fill:#231f20;fill-opacity:1;fill-rule:evenodd;stroke:none;stroke-width:0.1"
           id="path310" /><path
           d="m 168.737,114.921 1.29,0.627 h 0.128 v -4.472 c 0,-0.296 0.012,-0.481 0.037,-0.556 0.025,-0.072 0.077,-0.127 0.154,-0.168 0.079,-0.038 0.237,-0.059 0.477,-0.065 v -0.144 h -1.993 v 0.144 c 0.251,0.006 0.412,0.026 0.485,0.065 0.072,0.037 0.123,0.087 0.152,0.153 0.028,0.063 0.043,0.254 0.043,0.571 v 2.86 c 0,0.385 -0.013,0.632 -0.039,0.741 -0.018,0.084 -0.052,0.146 -0.1,0.184 -0.048,0.039 -0.105,0.06 -0.173,0.06 -0.096,0 -0.231,-0.041 -0.402,-0.123 l -0.059,0.123"
           style="fill:#231f20;fill-opacity:1;fill-rule:evenodd;stroke:none;stroke-width:0.1"
           id="path312" /><path
           d="m 172.229,108.811 v 0.171 c 0.268,0.089 0.476,0.225 0.624,0.413 0.146,0.185 0.22,0.384 0.22,0.592 0,0.049 -0.012,0.09 -0.035,0.125 -0.019,0.023 -0.037,0.034 -0.054,0.034 -0.03,0 -0.093,-0.026 -0.188,-0.078 -0.047,-0.022 -0.097,-0.036 -0.149,-0.036 -0.128,0 -0.229,0.039 -0.305,0.114 -0.075,0.077 -0.113,0.181 -0.113,0.314 0,0.128 0.049,0.236 0.146,0.327 0.097,0.092 0.218,0.136 0.359,0.136 0.17,0 0.324,-0.075 0.458,-0.225 0.134,-0.15 0.201,-0.347 0.201,-0.594 0,-0.267 -0.094,-0.516 -0.279,-0.749 -0.187,-0.23 -0.481,-0.411 -0.885,-0.544"
           style="fill:#231f20;fill-opacity:1;fill-rule:evenodd;stroke:none;stroke-width:0.1"
           id="path314" /><path
           d="m 179.467,111.163 -0.37,-1.02 h -3.126 v 0.143 c 0.919,0.839 1.567,1.525 1.942,2.055 0.375,0.532 0.562,1.016 0.562,1.457 0,0.336 -0.101,0.611 -0.308,0.829 -0.205,0.214 -0.451,0.323 -0.738,0.323 -0.262,0 -0.495,-0.077 -0.702,-0.229 -0.206,-0.151 -0.359,-0.375 -0.458,-0.669 h -0.145 c 0.065,0.482 0.231,0.852 0.502,1.109 0.269,0.26 0.605,0.387 1.009,0.387 0.43,0 0.789,-0.139 1.077,-0.414 0.287,-0.275 0.431,-0.602 0.431,-0.977 0,-0.266 -0.062,-0.537 -0.187,-0.805 -0.193,-0.42 -0.506,-0.868 -0.938,-1.339 -0.648,-0.708 -1.052,-1.134 -1.215,-1.281 h 1.383 c 0.281,0 0.479,0.011 0.592,0.032 0.113,0.02 0.217,0.063 0.307,0.127 0.09,0.064 0.171,0.155 0.238,0.272 h 0.144"
           style="fill:#231f20;fill-opacity:1;fill-rule:evenodd;stroke:none;stroke-width:0.1"
           id="path316" /><path
           d="m 180.229,108.811 v 0.171 c 0.268,0.089 0.477,0.225 0.624,0.413 0.146,0.185 0.22,0.384 0.22,0.592 0,0.049 -0.012,0.09 -0.035,0.125 -0.019,0.023 -0.037,0.034 -0.055,0.034 -0.029,0 -0.092,-0.026 -0.187,-0.078 -0.047,-0.022 -0.096,-0.036 -0.149,-0.036 -0.128,0 -0.228,0.039 -0.305,0.114 -0.075,0.077 -0.113,0.181 -0.113,0.314 0,0.128 0.049,0.236 0.147,0.327 0.096,0.092 0.217,0.136 0.357,0.136 0.172,0 0.325,-0.075 0.459,-0.225 0.135,-0.15 0.201,-0.347 0.201,-0.594 0,-0.267 -0.094,-0.516 -0.279,-0.749 -0.187,-0.23 -0.481,-0.411 -0.885,-0.544"
           style="fill:#231f20;fill-opacity:1;fill-rule:evenodd;stroke:none;stroke-width:0.1"
           id="path318" /><path
           d="m 184.206,114.432 c 0.151,0.356 0.342,0.632 0.572,0.825 0.231,0.195 0.518,0.291 0.861,0.291 0.424,0 0.75,-0.138 0.977,-0.413 0.172,-0.206 0.258,-0.425 0.258,-0.662 0,-0.384 -0.242,-0.784 -0.727,-1.193 0.326,-0.128 0.571,-0.311 0.738,-0.548 0.166,-0.236 0.25,-0.515 0.25,-0.836 0,-0.457 -0.144,-0.855 -0.437,-1.191 -0.379,-0.437 -0.931,-0.657 -1.651,-0.657 -0.358,0 -0.601,0.045 -0.73,0.132 -0.128,0.091 -0.193,0.184 -0.193,0.287 0,0.077 0.031,0.142 0.092,0.201 0.062,0.055 0.134,0.085 0.221,0.085 0.064,0 0.13,-0.012 0.198,-0.032 0.044,-0.014 0.145,-0.061 0.302,-0.142 0.156,-0.083 0.265,-0.131 0.324,-0.147 0.096,-0.029 0.199,-0.043 0.308,-0.043 0.266,0 0.498,0.103 0.693,0.307 0.198,0.207 0.295,0.45 0.295,0.732 0,0.204 -0.046,0.408 -0.135,0.601 -0.069,0.144 -0.144,0.256 -0.224,0.332 -0.111,0.103 -0.265,0.199 -0.461,0.283 -0.195,0.085 -0.395,0.127 -0.598,0.127 h -0.125 v 0.118 c 0.205,0.025 0.412,0.1 0.619,0.223 0.208,0.12 0.358,0.27 0.452,0.441 0.093,0.172 0.14,0.36 0.14,0.565 0,0.27 -0.084,0.486 -0.252,0.651 -0.168,0.166 -0.376,0.248 -0.627,0.248 -0.404,0 -0.74,-0.216 -1.011,-0.648 l -0.129,0.063"
           style="fill:#231f20;fill-opacity:1;fill-rule:evenodd;stroke:none;stroke-width:0.1"
           id="path320" /><path
           d="m 187.979,115.532 v 0.164 c 0.397,-0.192 0.727,-0.425 0.988,-0.691 0.373,-0.38 0.661,-0.825 0.864,-1.336 0.203,-0.514 0.304,-1.046 0.304,-1.601 0,-0.807 -0.198,-1.543 -0.595,-2.208 -0.398,-0.665 -0.918,-1.142 -1.561,-1.428 v 0.144 c 0.32,0.181 0.584,0.422 0.791,0.729 0.206,0.306 0.362,0.695 0.461,1.168 0.1,0.472 0.151,0.966 0.151,1.478 0,0.554 -0.043,1.06 -0.128,1.519 -0.067,0.36 -0.148,0.647 -0.246,0.864 -0.097,0.216 -0.226,0.423 -0.388,0.625 -0.162,0.201 -0.375,0.392 -0.641,0.573"
           style="fill:#231f20;fill-opacity:1;fill-rule:evenodd;stroke:none;stroke-width:0.1"
           id="path322" /></g><path
         d="M 60.1918,64.8852 H 174.868"
         style="display:inline;fill:none;stroke:#a8a6a7;stroke-width:0.567;stroke-linecap:butt;stroke-linejoin:miter;stroke-miterlimit:2.613;stroke-dasharray:none;stroke-opacity:1"
         id="path324"
         transform="matrix(1.3333333,0,0,-1.3333333,-24.860932,210.47599)" /><path
         d="m 179.27,64.8852 -5.639,1.6976 c 0.804,-1.1316 0.804,-2.2637 0,-3.3957 l 5.639,1.6981"
         style="display:inline;fill:#a8a6a7;fill-opacity:1;fill-rule:evenodd;stroke:none;stroke-width:0.1"
         id="path326"
         transform="matrix(1.3333333,0,0,-1.3333333,-24.860932,210.47599)" /><path
         d="M 109.335,146.469 V 64.8852 L 73.4996,22.618"
         style="display:inline;fill:none;stroke:#a8a6a7;stroke-width:0.567;stroke-linecap:butt;stroke-linejoin:miter;stroke-miterlimit:2.613;stroke-dasharray:none;stroke-opacity:1"
         id="path328"
         transform="matrix(1.3333333,0,0,-1.3333333,-24.860932,210.47599)" /><path
         d="m 109.335,150.871 1.698,-5.641 c -1.131,0.806 -2.264,0.806 -3.396,0 l 1.698,5.641"
         style="display:inline;fill:#a8a6a7;fill-opacity:1;fill-rule:evenodd;stroke:none;stroke-width:0.1"
         id="path330"
         transform="matrix(1.3333333,0,0,-1.3333333,-24.860932,210.47599)" /><path
         d="m 70.6527,19.2602 4.943,3.2046 c -1.384,0.1172 -2.248,0.85 -2.5891,2.1961 l -2.3539,-5.4007"
         style="display:inline;fill:#a8a6a7;fill-opacity:1;fill-rule:evenodd;stroke:none;stroke-width:0.1"
         id="path332"
         transform="matrix(1.3333333,0,0,-1.3333333,-24.860932,210.47599)" /><path
         d="M 70.8457,131.759 V 64.8852 L 33.9879,21.4121 M 90.2078,131.759 V 64.8852 L 53.3508,21.4121 M 128.933,131.759 V 64.8852 L 92.0746,21.4121 M 148.296,131.759 V 64.8852 L 111.438,21.4121 M 63.1387,83.9594 H 154.995 M 63.1387,103.32 H 154.995 M 63.1387,122.682 H 154.995 M 49.6797,49.7199 H 141.536 M 38.8188,34.8441 h 91.8552"
         style="display:inline;fill:none;stroke:#a8a6a7;stroke-width:0.283;stroke-linecap:butt;stroke-linejoin:miter;stroke-miterlimit:2.613;stroke-dasharray:none;stroke-opacity:1"
         id="path334"
         transform="matrix(1.3333333,0,0,-1.3333333,-24.860932,210.47599)" /><path
         d="m 109.231,66.227 c 0.776,0 1.407,-0.6321 1.407,-1.4071 0,-0.7738 -0.631,-1.407 -1.407,-1.407 -0.775,0 -1.407,0.6332 -1.407,1.407 0,0.775 0.632,1.4071 1.407,1.4071"
         style="display:inline;fill:#231f20;fill-opacity:1;fill-rule:evenodd;stroke:none;stroke-width:0.1"
         id="path338"
         transform="matrix(1.3333333,0,0,-1.3333333,-24.860932,210.47599)" /><path
         d="m 109.231,66.227 c 0.776,0 1.407,-0.6321 1.407,-1.4071 0,-0.7738 -0.631,-1.407 -1.407,-1.407 -0.775,0 -1.407,0.6332 -1.407,1.407 0,0.775 0.632,1.4071 1.407,1.4071 z"
         style="display:inline;fill:none;stroke:#231f20;stroke-width:0.567;stroke-linecap:butt;stroke-linejoin:miter;stroke-miterlimit:2.613;stroke-dasharray:none;stroke-opacity:1"
         id="path340"
         transform="matrix(1.3333333,0,0,-1.3333333,-24.860932,210.47599)" /><path
         d="m 183.892,65.2609 c 0.088,-0.1507 0.15,-0.2918 0.184,-0.4218 0.035,-0.1332 0.067,-0.3922 0.102,-0.777 l 0.172,-1.9211 c 0.157,0.186 0.382,0.484 0.68,0.891 0.143,0.1969 0.32,0.466 0.53,0.8078 0.128,0.2082 0.206,0.3543 0.236,0.4372 0.014,0.041 0.023,0.0851 0.023,0.1289 0,0.0281 -0.009,0.0519 -0.028,0.0711 -0.019,0.0171 -0.065,0.0378 -0.143,0.064 -0.077,0.0238 -0.141,0.0711 -0.192,0.136 -0.05,0.066 -0.076,0.1429 -0.076,0.2289 0,0.107 0.032,0.1921 0.095,0.257 0.061,0.066 0.14,0.098 0.233,0.098 0.115,0 0.213,-0.0461 0.295,-0.1429 0.081,-0.095 0.121,-0.225 0.121,-0.3918 0,-0.2051 -0.072,-0.441 -0.212,-0.7051 -0.141,-0.2641 -0.412,-0.6691 -0.813,-1.216 -0.4,-0.5481 -0.886,-1.1442 -1.456,-1.7891 -0.393,-0.4461 -0.685,-0.7269 -0.876,-0.843 C 182.578,60.0578 182.415,60 182.279,60 c -0.08,0 -0.152,0.0301 -0.212,0.0922 -0.062,0.0609 -0.092,0.1316 -0.092,0.2129 0,0.1008 0.041,0.1929 0.127,0.2769 0.084,0.0828 0.176,0.1239 0.274,0.1239 0.052,0 0.096,-0.0098 0.131,-0.034 0.021,-0.0141 0.043,-0.0508 0.067,-0.1117 0.025,-0.0602 0.048,-0.1024 0.069,-0.1231 0.012,-0.0133 0.029,-0.018 0.047,-0.018 0.014,0 0.042,0.011 0.081,0.0379 0.144,0.0891 0.311,0.2289 0.5,0.4219 0.251,0.2551 0.435,0.4633 0.555,0.625 l -0.219,2.475 c -0.036,0.4102 -0.091,0.659 -0.163,0.7473 -0.074,0.0879 -0.196,0.134 -0.368,0.134 -0.054,0 -0.152,-0.009 -0.293,-0.0231 l -0.035,0.143 1.144,0.2808"
         style="display:inline;fill:#bdbbbc;fill-opacity:1;fill-rule:evenodd;stroke:none;stroke-width:0.1"
         id="path344"
         transform="matrix(1.3333333,0,0,-1.3333333,-24.860932,210.47599)" /><path
         d="m 107.652,157.857 h 2.48 v -0.096 l -2.703,-2.813 h 1.144 c 0.27,0 0.442,0.009 0.517,0.032 0.072,0.021 0.139,0.065 0.2,0.132 0.061,0.067 0.129,0.19 0.205,0.368 h 0.144 l -0.34,-1.062 h -2.542 v 0.112 l 2.702,2.811 h -1.124 c -0.237,0 -0.381,-0.006 -0.43,-0.018 -0.072,-0.016 -0.146,-0.057 -0.216,-0.123 -0.072,-0.066 -0.146,-0.177 -0.222,-0.33 h -0.147 l 0.332,0.987"
         style="display:inline;fill:#bdbbbc;fill-opacity:1;fill-rule:evenodd;stroke:none;stroke-width:0.1"
         id="path346"
         transform="matrix(1.3333333,0,0,-1.3333333,-24.860932,210.47599)" /><path
         d="m 67.4027,17.1449 c 0.127,-0.1347 0.2231,-0.2699 0.2891,-0.4051 0.0461,-0.0949 0.123,-0.3398 0.2309,-0.7378 l 0.3429,0.5152 c 0.091,0.1238 0.2012,0.2437 0.3321,0.3578 0.1289,0.1129 0.2441,0.1898 0.3441,0.2309 0.0621,0.0273 0.1309,0.039 0.207,0.039 0.1117,0 0.2,-0.0289 0.266,-0.089 0.0668,-0.0598 0.1,-0.1329 0.1,-0.218 0,-0.1 -0.0199,-0.1668 -0.0582,-0.2039 -0.0738,-0.0649 -0.1558,-0.0981 -0.25,-0.0981 -0.0539,0 -0.1128,0.0121 -0.1757,0.036 -0.1219,0.041 -0.2051,0.0621 -0.2461,0.0621 -0.0629,0 -0.136,-0.0371 -0.2231,-0.109 -0.1601,-0.1359 -0.3527,-0.3961 -0.5769,-0.7852 l 0.3199,-1.3437 c 0.0488,-0.2063 0.0898,-0.3289 0.125,-0.3691 0.034,-0.0411 0.0672,-0.061 0.1012,-0.061 0.0558,0 0.1199,0.0301 0.191,0.0899 0.1437,0.1203 0.2648,0.2761 0.3687,0.4691 l 0.1352,-0.0711 c -0.1641,-0.3078 -0.3723,-0.5617 -0.6262,-0.7648 -0.1418,-0.1153 -0.2617,-0.1719 -0.3617,-0.1719 -0.1461,0 -0.2613,0.0816 -0.3481,0.2449 -0.055,0.102 -0.1679,0.5399 -0.3402,1.3141 -0.4051,-0.7071 -0.7301,-1.1602 -0.9758,-1.3633 -0.159,-0.1309 -0.3121,-0.1957 -0.4609,-0.1957 -0.1051,0 -0.1992,0.0367 -0.2859,0.1148 -0.0614,0.0559 -0.0922,0.1321 -0.0922,0.2289 0,0.0852 0.0281,0.1571 0.0859,0.2153 0.0563,0.057 0.1262,0.0847 0.2102,0.0847 0.0828,0 0.1718,-0.041 0.266,-0.125 0.0679,-0.0597 0.1199,-0.0898 0.1558,-0.0898 0.0328,0 0.0731,0.0219 0.1211,0.0629 0.1231,0.0988 0.2891,0.3121 0.5,0.6398 0.211,0.3282 0.35,0.566 0.4149,0.7121 -0.1629,0.6321 -0.25,0.9672 -0.2629,1.0032 -0.0602,0.1687 -0.1371,0.289 -0.2352,0.3597 -0.0961,0.0711 -0.2359,0.1051 -0.4238,0.1051 -0.0602,0 -0.1301,-0.0027 -0.207,-0.0078 v 0.1418 l 1.0429,0.182"
         style="display:inline;fill:#bdbbbc;fill-opacity:1;fill-rule:evenodd;stroke:none;stroke-width:0.1"
         id="path348"
         transform="matrix(1.3333333,0,0,-1.3333333,-24.860932,210.47599)" /><path
         d="m 135.32,111.8 c 0.775,0 1.406,-0.631 1.406,-1.407 0,-0.775 -0.631,-1.407 -1.406,-1.407 -0.774,0 -1.407,0.632 -1.407,1.407 0,0.776 0.633,1.407 1.407,1.407"
         style="display:inline;fill:#00adef;fill-opacity:1;fill-rule:evenodd;stroke:none;stroke-width:0.1"
         id="path350"
         transform="matrix(1.3333333,0,0,-1.3333333,-24.860932,210.47599)" /><path
         d="m 135.32,111.8 c 0.775,0 1.406,-0.631 1.406,-1.407 0,-0.775 -0.631,-1.407 -1.406,-1.407 -0.774,0 -1.407,0.632 -1.407,1.407 0,0.776 0.633,1.407 1.407,1.407 z"
         style="display:inline;fill:none;stroke:#00adef;stroke-width:0.567;stroke-linecap:butt;stroke-linejoin:miter;stroke-miterlimit:2.613;stroke-dasharray:none;stroke-opacity:1"
         id="path352"
         transform="matrix(1.3333333,0,0,-1.3333333,-24.860932,210.47599)" /><path
         d="m 64.836552,54.006683 c 0.775,0 1.4071,-0.6309 1.4071,-1.407 0,-0.7739 -0.6321,-1.4059 -1.4071,-1.4059 -0.775,0 -1.407,0.632 -1.407,1.4059 0,0.7761 0.632,1.407 1.407,1.407"
         style="display:inline;fill:#00adef;fill-opacity:1;fill-rule:evenodd;stroke:none;stroke-width:0.1"
         id="path354"
         transform="matrix(1.3333333,0,0,-1.3333333,-24.860932,210.47599)" /><path
         d="m 64.836552,54.006683 c 0.775,0 1.4071,-0.6309 1.4071,-1.407 0,-0.7739 -0.6321,-1.4059 -1.4071,-1.4059 -0.775,0 -1.407,0.632 -1.407,1.4059 0,0.7761 0.632,1.407 1.407,1.407 z"
         style="display:inline;fill:none;stroke:#00adef;stroke-width:0.567;stroke-linecap:butt;stroke-linejoin:miter;stroke-miterlimit:2.613;stroke-dasharray:none;stroke-opacity:1"
         id="path356"
         transform="matrix(1.3333333,0,0,-1.3333333,-24.860932,210.47599)" /><path
         d="m 40.280352,68.317283 -1.009,-0.8168 c 0.1582,0.0281 0.3063,0.0429 0.441,0.0429 0.1321,0 0.2512,-0.0082 0.3621,-0.0218 0.1102,-0.0172 0.3469,-0.0672 0.7102,-0.1481 0.3637,-0.082 0.6809,-0.1242 0.9519,-0.1242 0.2879,0 0.5348,0.0512 0.736,0.1512 0.2008,0.1 0.3969,0.2679 0.5879,0.5031 l 0.1289,-0.0633 c -0.2688,-0.3859 -0.5848,-0.6641 -0.9481,-0.8352 -0.366,-0.1699 -0.7519,-0.2558 -1.1617,-0.2558 -0.2262,0 -0.5359,0.0461 -0.9301,0.134 -0.6011,0.1332 -1.0211,0.198 -1.2609,0.198 -0.091,0 -0.1652,-0.0051 -0.223,-0.0168 -0.0571,-0.0152 -0.1422,-0.0461 -0.2571,-0.0961 l -0.091,0.1071 1.602,1.2648 c -0.4942,0.068 -0.8692,0.2852 -1.1239,0.652 -0.2562,0.3671 -0.3832,0.7582 -0.3832,1.1761 0,0.5711 0.1723,1.1598 0.5172,1.7699 0.3438,0.609 0.7879,1.0801 1.3238,1.4161 0.5379,0.3351 1.0661,0.5011 1.584,0.5011 0.386,0 0.7153,-0.0781 0.9871,-0.2343 0.2719,-0.1559 0.4809,-0.3836 0.6309,-0.6809 0.1473,-0.2988 0.223,-0.6039 0.223,-0.9168 0,-0.5992 -0.1699,-1.2062 -0.5128,-1.8203 -0.3411,-0.6149 -0.7653,-1.0797 -1.2719,-1.3957 -0.5063,-0.3172 -1.0442,-0.4801 -1.6133,-0.4902 z m 1.4641,5.289 c -0.261,0 -0.5161,-0.0648 -0.7641,-0.1941 -0.25,-0.1297 -0.4957,-0.3399 -0.7391,-0.6336 -0.2457,-0.2922 -0.466,-0.6762 -0.6617,-1.1492 -0.2351,-0.584 -0.3551,-1.134 -0.3551,-1.6532 0,-0.3687 0.095,-0.6968 0.286,-0.9828 0.189,-0.284 0.4808,-0.4261 0.875,-0.4261 0.234,0 0.466,0.0582 0.6941,0.175 0.2289,0.1171 0.466,0.3171 0.7117,0.598 0.3121,0.359 0.5743,0.816 0.7852,1.3711 0.2109,0.5539 0.316,1.0699 0.316,1.5461 0,0.3519 -0.0949,0.6637 -0.2852,0.9379 -0.191,0.273 -0.4777,0.4109 -0.8628,0.4109"
         style="display:inline;fill:#231f20;fill-opacity:1;fill-rule:evenodd;stroke:none;stroke-width:0.1"
         id="path358"
         transform="matrix(1.3333333,0,0,-1.3333333,-24.860932,210.47599)" /><path
         d="m 46.840552,66.871583 v -0.1442 c -0.393,0.1969 -0.7219,0.4289 -0.984,0.6938 -0.375,0.3781 -0.6641,0.823 -0.866,1.3363 -0.2051,0.5148 -0.3059,1.0461 -0.3059,1.5988 0,0.8059 0.2008,1.5442 0.5976,2.209 0.3981,0.6652 0.918,1.1402 1.5583,1.427 v -0.1641 c -0.32,-0.1777 -0.5821,-0.4188 -0.7891,-0.727 -0.2059,-0.3058 -0.359,-0.6957 -0.459,-1.1679 -0.1019,-0.47 -0.1539,-0.9637 -0.1539,-1.4758 0,-0.557 0.043,-1.0641 0.1289,-1.5192 0.0691,-0.3609 0.1512,-0.6488 0.2461,-0.866 0.0961,-0.2168 0.2258,-0.4257 0.3879,-0.6269 0.1641,-0.2012 0.3762,-0.3918 0.6391,-0.5738"
         style="display:inline;fill:#231f20;fill-opacity:1;fill-rule:evenodd;stroke:none;stroke-width:0.1"
         id="path360"
         transform="matrix(1.3333333,0,0,-1.3333333,-24.860932,210.47599)" /><path
         d="m 50.688552,69.457483 -0.3711,-1.0192 h -3.125 v 0.143 c 0.9191,0.8391 1.568,1.525 1.9422,2.0551 0.375,0.532 0.5629,1.0172 0.5629,1.457 0,0.336 -0.1031,0.6117 -0.3102,0.8278 -0.2058,0.2164 -0.4508,0.3242 -0.7379,0.3242 -0.2609,0 -0.4929,-0.0762 -0.7,-0.2281 -0.2082,-0.152 -0.3609,-0.3758 -0.4589,-0.6688 h -0.145 c 0.0641,0.4809 0.2309,0.85 0.5008,1.109 0.2699,0.2566 0.6063,0.3871 1.0102,0.3871 0.4289,0 0.7879,-0.1395 1.0757,-0.4152 0.2883,-0.2758 0.4333,-0.6012 0.4333,-0.9762 0,-0.268 -0.0629,-0.5367 -0.1879,-0.8039 -0.193,-0.4231 -0.5063,-0.8688 -0.9371,-1.341 -0.6481,-0.7078 -1.0551,-1.1352 -1.2161,-1.2809 h 1.384 c 0.2801,0 0.4781,0.0098 0.5903,0.032 0.1148,0.0188 0.2156,0.0618 0.3066,0.1258 0.091,0.0641 0.1711,0.1551 0.2391,0.2723 h 0.1441"
         style="display:inline;fill:#231f20;fill-opacity:1;fill-rule:evenodd;stroke:none;stroke-width:0.1"
         id="path362"
         transform="matrix(1.3333333,0,0,-1.3333333,-24.860932,210.47599)" /><path
         d="m 51.449452,67.106283 v 0.1711 c 0.2692,0.0879 0.477,0.2262 0.625,0.4129 0.1461,0.1859 0.2192,0.3832 0.2192,0.591 0,0.05 -0.0114,0.091 -0.0332,0.1262 -0.0192,0.0219 -0.0391,0.0348 -0.0559,0.0348 -0.0289,0 -0.091,-0.027 -0.1883,-0.079 -0.0457,-0.023 -0.0957,-0.0351 -0.1476,-0.0351 -0.1274,0 -0.2293,0.0371 -0.3063,0.1141 -0.073,0.075 -0.1129,0.1793 -0.1129,0.3113 0,0.1277 0.05,0.2379 0.1469,0.3277 0.0973,0.0918 0.2172,0.1371 0.357,0.1371 0.1723,0 0.325,-0.073 0.459,-0.225 0.1352,-0.1488 0.202,-0.3468 0.202,-0.5929 0,-0.2704 -0.0938,-0.5192 -0.2797,-0.7493 -0.1863,-0.2308 -0.4813,-0.4129 -0.8852,-0.5449"
         style="display:inline;fill:#231f20;fill-opacity:1;fill-rule:evenodd;stroke:none;stroke-width:0.1"
         id="path364"
         transform="matrix(1.3333333,0,0,-1.3333333,-24.860932,210.47599)" /><path
         d="m 55.313552,69.991483 h 4.13672 v 0.327734 h -4.13672 z"
         style="display:inline;fill:#231f20;fill-opacity:1;fill-rule:nonzero;stroke:none;stroke-width:0.1"
         id="path366"
         transform="matrix(1.3333333,0,0,-1.3333333,-24.860932,210.47599)" /><path
         d="m 64.449452,67.106283 v 0.1711 c 0.2692,0.0879 0.477,0.2262 0.625,0.4129 0.1461,0.1859 0.2192,0.3832 0.2192,0.591 0,0.05 -0.0114,0.091 -0.0332,0.1262 -0.0192,0.0219 -0.0391,0.0348 -0.0559,0.0348 -0.0289,0 -0.091,-0.027 -0.1883,-0.079 -0.0457,-0.023 -0.0957,-0.0351 -0.1476,-0.0351 -0.1274,0 -0.2293,0.0371 -0.3063,0.1141 -0.073,0.075 -0.1129,0.1793 -0.1129,0.3113 0,0.1277 0.05,0.2379 0.1469,0.3277 0.0973,0.0918 0.2172,0.1371 0.357,0.1371 0.1723,0 0.325,-0.073 0.459,-0.225 0.1352,-0.1488 0.202,-0.3468 0.202,-0.5929 0,-0.2704 -0.0938,-0.5192 -0.2789,-0.7493 -0.1871,-0.2308 -0.4821,-0.4129 -0.886,-0.5449"
         style="display:inline;fill:#231f20;fill-opacity:1;fill-rule:evenodd;stroke:none;stroke-width:0.1"
         id="path370"
         transform="matrix(1.3333333,0,0,-1.3333333,-24.860932,210.47599)" /><path
         d="m 67.957652,73.214483 1.2899,0.6301 h 0.1289 v -4.473 c 0,-0.2973 0.0121,-0.4821 0.0359,-0.5543 0.025,-0.0727 0.0782,-0.1278 0.1551,-0.168 0.0781,-0.0399 0.2371,-0.0621 0.477,-0.068 v -0.143 h -1.9918 v 0.143 c 0.25,0.0059 0.4097,0.0281 0.4839,0.066 0.0719,0.0371 0.1231,0.0879 0.152,0.152 0.0289,0.0633 0.043,0.2543 0.043,0.5723 v 2.8597 c 0,0.3852 -0.0129,0.6313 -0.0391,0.741 -0.0191,0.084 -0.0519,0.145 -0.0988,0.184 -0.0492,0.0391 -0.1051,0.0582 -0.1742,0.0582 -0.0961,0 -0.2309,-0.0402 -0.4032,-0.1211 l -0.0586,0.1211"
         style="display:inline;fill:#231f20;fill-opacity:1;fill-rule:evenodd;stroke:none;stroke-width:0.1"
         id="path372"
         transform="matrix(1.3333333,0,0,-1.3333333,-24.860932,210.47599)" /><path
         d="m 60.125655,73.194725 1.2899,0.6301 h 0.1289 v -4.473 c 0,-0.2973 0.0121,-0.4821 0.0359,-0.5543 0.025,-0.0727 0.0782,-0.1278 0.1551,-0.168 0.0781,-0.0399 0.2371,-0.0621 0.477,-0.068 v -0.143 h -1.9918 v 0.143 c 0.25,0.0059 0.4097,0.0281 0.4839,0.066 0.0719,0.0371 0.1231,0.0879 0.152,0.152 0.0289,0.0633 0.043,0.2543 0.043,0.5723 v 2.8597 c 0,0.3852 -0.0129,0.6313 -0.0391,0.741 -0.0191,0.084 -0.0519,0.145 -0.0988,0.184 -0.0492,0.0391 -0.1051,0.0582 -0.1742,0.0582 -0.0961,0 -0.2309,-0.0402 -0.4032,-0.1211 l -0.0586,0.1211"
         style="display:inline;fill:#231f20;fill-opacity:1;fill-rule:evenodd;stroke:none;stroke-width:0.1"
         id="path372-3"
         transform="matrix(1.3333333,0,0,-1.3333333,-24.860932,210.47599)" /><path
         d="m 71.200252,73.828583 v 0.1637 c 0.3961,-0.195 0.7262,-0.425 0.9883,-0.6918 0.3719,-0.3801 0.6598,-0.825 0.8641,-1.3383 0.2019,-0.5117 0.3039,-1.0449 0.3039,-1.5996 0,-0.8063 -0.1981,-1.5422 -0.595,-2.2071 -0.3972,-0.666 -0.9179,-1.1422 -1.5613,-1.4281 v 0.1442 c 0.3203,0.1796 0.5844,0.4218 0.791,0.7289 0.2071,0.305 0.3614,0.6949 0.4614,1.1679 0.1007,0.4719 0.15,0.966 0.15,1.477 0,0.5551 -0.043,1.0609 -0.1293,1.5199 -0.0649,0.3602 -0.1457,0.6473 -0.2438,0.8641 -0.0992,0.216 -0.2281,0.4242 -0.389,0.6242 -0.161,0.2008 -0.375,0.393 -0.6403,0.575"
         style="display:inline;fill:#231f20;fill-opacity:1;fill-rule:evenodd;stroke:none;stroke-width:0.1"
         id="path374"
         transform="matrix(1.3333333,0,0,-1.3333333,-24.860932,210.47599)" /><path
         d="m 54.274452,64.883283 6.22,-7.0676"
         style="display:inline;fill:none;stroke:#ff0000;stroke-width:0.5;stroke-linecap:butt;stroke-linejoin:miter;stroke-miterlimit:2.613;stroke-dasharray:none;stroke-opacity:1"
         id="path376"
         transform="matrix(1.3333333,0,0,-1.3333333,-24.860932,210.47599)" /><path
         d="m 62.901452,55.079783 -1.7918,3.9152 c -0.232,-0.9883 -0.8543,-1.5352 -1.8641,-1.6383 l 3.6559,-2.2769"
         style="display:inline;fill:#ff0000;fill-opacity:1;fill-rule:evenodd;stroke:none;stroke-width:0.1"
         id="path378"
         transform="matrix(1.3333333,0,0,-1.3333333,-24.860932,210.47599)" /><g
         id="g236"
         transform="matrix(-1.1934459,0.52302932,0.70487908,1.8396086,236.95827,-210.06639)"
         style="display:inline"><path
           d="m 159.102,112.532 -16.586,-1.207"
           style="fill:none;stroke:#ff0000;stroke-width:0.283;stroke-linecap:butt;stroke-linejoin:miter;stroke-miterlimit:2.613;stroke-dasharray:none;stroke-opacity:1"
           id="path380" /><path
           d="m 138.882,111.062 4.203,-0.939 c -0.648,0.782 -0.708,1.607 -0.18,2.475 l -4.023,-1.536"
           style="fill:#ff0000;fill-opacity:1;fill-rule:evenodd;stroke:none;stroke-width:0.1"
           id="path382" /></g><path
         d="m 135.394,50.193 v 59.977 l 12.637,12.637 M 64.916397,34.841363 64.836552,52.506679 90.141469,83.769491"
         style="display:inline;fill:none;stroke:#00adef;stroke-width:0.567;stroke-linecap:butt;stroke-linejoin:miter;stroke-miterlimit:2.613;stroke-dasharray:5.669, 1.701;stroke-dashoffset:0;stroke-opacity:1"
         id="path336"
         transform="matrix(1.3333333,0,0,-1.3333333,-24.860933,210.47599)"
         sodipodi:nodetypes="cccccc" /></g></g></svg>
