module kafka-consume

go 1.20

require (
	github.com/klauspost/compress v1.16.5 // indirect
	github.com/pierrec/lz4/v4 v4.1.17 // indirect
	github.com/segmentio/kafka-go v0.4.39 // indirect
	github.com/xdg/scram v1.0.5 // indirect
	github.com/xdg/stringprep v1.0.3 // indirect
	golang.org/x/crypto v0.0.0-20220622213112-05595931fe9d // indirect
	golang.org/x/text v0.3.7 // indirect
)
