<?xml version="1.0" encoding="UTF-8" standalone="no"?>
<!-- Created with Inkscape (http://www.inkscape.org/) -->

<svg
   version="1.1"
   id="svg292"
   xml:space="preserve"
   width="220.65359"
   height="194.21452"
   viewBox="0 0 220.6536 194.21452"
   sodipodi:docname="cyline_cartesian.svg"
   inkscape:version="1.1 (c68e22c387, 2021-05-23)"
   xmlns:inkscape="http://www.inkscape.org/namespaces/inkscape"
   xmlns:sodipodi="http://sodipodi.sourceforge.net/DTD/sodipodi-0.dtd"
   xmlns="http://www.w3.org/2000/svg"
   xmlns:svg="http://www.w3.org/2000/svg"><defs
     id="defs296"><clipPath
       clipPathUnits="userSpaceOnUse"
       id="clipPath25"><path
         d="m 1513.51,1300 0.7,-687.371 C 1405.54,460 1171.83,317.789 903.348,243.551 716.586,191.91 525.566,177.871 376.098,203.262 v 685.996 c 149.468,-25.399 340.5,-11.328 527.25,40.289 C 1171.81,1003.77 1402.1,1147.38 1513.51,1300"
         clip-rule="evenodd"
         id="path23" /></clipPath><clipPath
       clipPathUnits="userSpaceOnUse"
       id="clipPath31"><path
         d="m 376.094,177.871 h 1138.12 v 1122.13 H 376.094 Z"
         id="path29" /></clipPath><linearGradient
       x1="0"
       y1="0"
       x2="1"
       y2="0"
       gradientUnits="userSpaceOnUse"
       gradientTransform="matrix(1138.11,0,0,-1162.13,376.093,1319.99)"
       spreadMethod="pad"
       id="linearGradient37"><stop
         style="stop-opacity:1;stop-color:#bfeafb"
         offset="0"
         id="stop33" /><stop
         style="stop-opacity:1;stop-color:#f2fbfe"
         offset="1"
         id="stop35" /></linearGradient><clipPath
       clipPathUnits="userSpaceOnUse"
       id="clipPath47"><path
         d="M 1515.97,1301.97 786.418,1300 376.098,889.258 c 152.679,-27.289 337.429,-15.32 527.918,37.359 273.854,75.723 502.154,218.463 611.954,375.353"
         clip-rule="evenodd"
         id="path45" /></clipPath><clipPath
       clipPathUnits="userSpaceOnUse"
       id="clipPath53"><path
         d="M 1735.97,1081.97 946.031,292.031 156.094,1081.97 946.031,1871.9 Z"
         id="path51" /></clipPath><radialGradient
       fx="0"
       fy="0"
       cx="0"
       cy="0"
       r="1"
       gradientUnits="userSpaceOnUse"
       gradientTransform="matrix(-443.804,-443.804,-443.804,443.804,781.528,1298.03)"
       spreadMethod="pad"
       id="radialGradient59"><stop
         style="stop-opacity:1;stop-color:#b2e6fa"
         offset="0"
         id="stop55" /><stop
         style="stop-opacity:1;stop-color:#f2fbfe"
         offset="1"
         id="stop57" /></radialGradient></defs><sodipodi:namedview
     id="namedview294"
     pagecolor="#ffffff"
     bordercolor="#666666"
     borderopacity="1.0"
     inkscape:pageshadow="2"
     inkscape:pageopacity="0.0"
     inkscape:pagecheckerboard="0"
     showgrid="false"
     fit-margin-top="0"
     fit-margin-left="0"
     fit-margin-right="0"
     fit-margin-bottom="0"
     inkscape:zoom="4"
     inkscape:cx="144.375"
     inkscape:cy="107.375"
     inkscape:window-width="1280"
     inkscape:window-height="995"
     inkscape:window-x="1351"
     inkscape:window-y="-9"
     inkscape:window-maximized="1"
     inkscape:current-layer="g298" /><g
     inkscape:groupmode="layer"
     id="layer2"
     inkscape:label="ink_ext_XXXXXX 2"
     transform="translate(-12.7308)"
     style="display:inline"><path
       d="M 28.9047,98.8367 60.0285,136.143 V 64.7602 L 28.9047,27.4539 v 71.3828"
       style="display:inline;fill:#f5f4f5;fill-opacity:1;fill-rule:evenodd;stroke:none;stroke-width:0.1"
       id="path306"
       transform="matrix(1.3333333,0,0,-1.3333333,-24.860933,210.47599)" /></g><g
     id="g298"
     inkscape:groupmode="layer"
     inkscape:label="ink_ext_XXXXXX"
     transform="matrix(1.3333333,0,0,-1.3333333,-37.591732,210.47599)"
     style="display:inline"><path
       d="m 59.834,64.7852 h 97.284 v 71.0734 H 59.834 Z"
       style="fill:#efeeee;fill-opacity:1;fill-rule:nonzero;stroke:none;stroke-width:0.1"
       id="path302" /><path
       d="m 59.834,65.116 h 97.283 L 129.256,27.8082 H 28.1938 L 59.834,65.116"
       style="fill:#f3f3f3;fill-opacity:1;fill-rule:evenodd;stroke:none;stroke-width:0.1"
       id="path304" /><path
       d="M 60.1918,64.8852 H 174.868"
       style="fill:none;stroke:#a8a6a7;stroke-width:0.567;stroke-linecap:butt;stroke-linejoin:miter;stroke-miterlimit:2.613;stroke-dasharray:none;stroke-opacity:1"
       id="path324" /><path
       d="m 179.27,64.8852 -5.639,1.6976 c 0.804,-1.1316 0.804,-2.2637 0,-3.3957 l 5.639,1.6981"
       style="fill:#a8a6a7;fill-opacity:1;fill-rule:evenodd;stroke:none;stroke-width:0.1"
       id="path326" /><path
       d="M 109.335,146.469 V 64.8852 L 73.4996,22.618"
       style="fill:none;stroke:#a8a6a7;stroke-width:0.567;stroke-linecap:butt;stroke-linejoin:miter;stroke-miterlimit:2.613;stroke-dasharray:none;stroke-opacity:1"
       id="path328" /><path
       d="m 109.335,150.871 1.698,-5.641 c -1.131,0.806 -2.264,0.806 -3.396,0 l 1.698,5.641"
       style="fill:#a8a6a7;fill-opacity:1;fill-rule:evenodd;stroke:none;stroke-width:0.1"
       id="path330" /><path
       d="m 70.6527,19.2602 4.943,3.2046 c -1.384,0.1172 -2.248,0.85 -2.5891,2.1961 l -2.3539,-5.4007"
       style="fill:#a8a6a7;fill-opacity:1;fill-rule:evenodd;stroke:none;stroke-width:0.1"
       id="path332" /><path
       d="M 70.8457,131.759 V 64.8852 L 33.9879,21.4121 M 90.2078,131.759 V 64.8852 L 53.3508,21.4121 M 128.933,131.759 V 64.8852 L 92.0746,21.4121 M 148.296,131.759 V 64.8852 L 111.438,21.4121 M 63.1387,83.9594 H 154.995 M 63.1387,103.32 H 154.995 M 63.1387,122.682 H 154.995 M 49.6797,49.7199 H 141.536 M 38.8188,34.8441 h 91.8552"
       style="fill:none;stroke:#a8a6a7;stroke-width:0.283;stroke-linecap:butt;stroke-linejoin:miter;stroke-miterlimit:2.613;stroke-dasharray:none;stroke-opacity:1"
       id="path334" /><path
       d="m 109.231,66.227 c 0.776,0 1.407,-0.6321 1.407,-1.4071 0,-0.7738 -0.631,-1.407 -1.407,-1.407 -0.775,0 -1.407,0.6332 -1.407,1.407 0,0.775 0.632,1.4071 1.407,1.4071"
       style="fill:#231f20;fill-opacity:1;fill-rule:evenodd;stroke:none;stroke-width:0.1"
       id="path338" /><path
       d="m 109.231,66.227 c 0.776,0 1.407,-0.6321 1.407,-1.4071 0,-0.7738 -0.631,-1.407 -1.407,-1.407 -0.775,0 -1.407,0.6332 -1.407,1.407 0,0.775 0.632,1.4071 1.407,1.4071 z"
       style="fill:none;stroke:#231f20;stroke-width:0.567;stroke-linecap:butt;stroke-linejoin:miter;stroke-miterlimit:2.613;stroke-dasharray:none;stroke-opacity:1"
       id="path340" /><path
       d="m 191.571,15.8238 c 0.128,-0.1347 0.225,-0.2699 0.289,-0.4039 0.047,-0.0961 0.124,-0.341 0.231,-0.7398 l 0.344,0.516 c 0.09,0.1238 0.201,0.2437 0.332,0.3578 0.129,0.1141 0.244,0.1902 0.342,0.2313 0.064,0.0269 0.133,0.0386 0.208,0.0386 0.112,0 0.2,-0.0277 0.268,-0.0886 0.066,-0.0602 0.099,-0.134 0.099,-0.2192 0,-0.098 -0.019,-0.1672 -0.058,-0.2031 -0.074,-0.0649 -0.157,-0.0981 -0.249,-0.0981 -0.056,0 -0.114,0.0122 -0.177,0.0372 -0.122,0.041 -0.204,0.0609 -0.245,0.0609 -0.064,0 -0.138,-0.0367 -0.224,-0.109 -0.162,-0.1359 -0.352,-0.3969 -0.578,-0.784 l 0.32,-1.3449 c 0.05,-0.2059 0.091,-0.3289 0.126,-0.3691 0.033,-0.0411 0.068,-0.0598 0.101,-0.0598 0.056,0 0.119,0.0289 0.191,0.0891 0.145,0.1199 0.265,0.2757 0.368,0.4687 l 0.136,-0.0707 c -0.164,-0.307 -0.372,-0.5621 -0.626,-0.7652 -0.141,-0.1141 -0.264,-0.1719 -0.362,-0.1719 -0.146,0 -0.262,0.082 -0.348,0.2449 -0.054,0.1031 -0.168,0.5399 -0.34,1.3149 -0.406,-0.7079 -0.731,-1.161 -0.975,-1.3649 -0.159,-0.1301 -0.313,-0.1949 -0.463,-0.1949 -0.104,0 -0.197,0.0367 -0.284,0.1141 -0.062,0.057 -0.094,0.1328 -0.094,0.2296 0,0.0852 0.029,0.1571 0.086,0.2161 0.058,0.0562 0.127,0.0839 0.211,0.0839 0.083,0 0.173,-0.041 0.266,-0.125 0.067,-0.0597 0.121,-0.0898 0.156,-0.0898 0.032,0 0.071,0.0219 0.122,0.0629 0.122,0.0992 0.288,0.3121 0.5,0.6402 0.21,0.3278 0.348,0.566 0.414,0.7117 -0.162,0.6332 -0.25,0.9672 -0.263,1.0043 -0.059,0.1688 -0.138,0.2879 -0.234,0.359 -0.097,0.0699 -0.238,0.1051 -0.426,0.1051 -0.06,0 -0.13,-0.0023 -0.207,-0.0082 v 0.141 l 1.043,0.1828"
       style="fill:#bdbbbc;fill-opacity:1;fill-rule:evenodd;stroke:none;stroke-width:0.1"
       id="path342" /><path
       d="m 183.892,65.2609 c 0.088,-0.1507 0.15,-0.2918 0.184,-0.4218 0.035,-0.1332 0.067,-0.3922 0.102,-0.777 l 0.172,-1.9211 c 0.157,0.186 0.382,0.484 0.68,0.891 0.143,0.1969 0.32,0.466 0.53,0.8078 0.128,0.2082 0.206,0.3543 0.236,0.4372 0.014,0.041 0.023,0.0851 0.023,0.1289 0,0.0281 -0.009,0.0519 -0.028,0.0711 -0.019,0.0171 -0.065,0.0378 -0.143,0.064 -0.077,0.0238 -0.141,0.0711 -0.192,0.136 -0.05,0.066 -0.076,0.1429 -0.076,0.2289 0,0.107 0.032,0.1921 0.095,0.257 0.061,0.066 0.14,0.098 0.233,0.098 0.115,0 0.213,-0.0461 0.295,-0.1429 0.081,-0.095 0.121,-0.225 0.121,-0.3918 0,-0.2051 -0.072,-0.441 -0.212,-0.7051 -0.141,-0.2641 -0.412,-0.6691 -0.813,-1.216 -0.4,-0.5481 -0.886,-1.1442 -1.456,-1.7891 -0.393,-0.4461 -0.685,-0.7269 -0.876,-0.843 C 182.578,60.0578 182.415,60 182.279,60 c -0.08,0 -0.152,0.0301 -0.212,0.0922 -0.062,0.0609 -0.092,0.1316 -0.092,0.2129 0,0.1008 0.041,0.1929 0.127,0.2769 0.084,0.0828 0.176,0.1239 0.274,0.1239 0.052,0 0.096,-0.0098 0.131,-0.034 0.021,-0.0141 0.043,-0.0508 0.067,-0.1117 0.025,-0.0602 0.048,-0.1024 0.069,-0.1231 0.012,-0.0133 0.029,-0.018 0.047,-0.018 0.014,0 0.042,0.011 0.081,0.0379 0.144,0.0891 0.311,0.2289 0.5,0.4219 0.251,0.2551 0.435,0.4633 0.555,0.625 l -0.219,2.475 c -0.036,0.4102 -0.091,0.659 -0.163,0.7473 -0.074,0.0879 -0.196,0.134 -0.368,0.134 -0.054,0 -0.152,-0.009 -0.293,-0.0231 l -0.035,0.143 1.144,0.2808"
       style="fill:#bdbbbc;fill-opacity:1;fill-rule:evenodd;stroke:none;stroke-width:0.1"
       id="path344" /><path
       d="m 107.652,157.857 h 2.48 v -0.096 l -2.703,-2.813 h 1.144 c 0.27,0 0.442,0.009 0.517,0.032 0.072,0.021 0.139,0.065 0.2,0.132 0.061,0.067 0.129,0.19 0.205,0.368 h 0.144 l -0.34,-1.062 h -2.542 v 0.112 l 2.702,2.811 h -1.124 c -0.237,0 -0.381,-0.006 -0.43,-0.018 -0.072,-0.016 -0.146,-0.057 -0.216,-0.123 -0.072,-0.066 -0.146,-0.177 -0.222,-0.33 h -0.147 l 0.332,0.987"
       style="fill:#bdbbbc;fill-opacity:1;fill-rule:evenodd;stroke:none;stroke-width:0.1"
       id="path346" /><path
       d="m 67.4027,17.1449 c 0.127,-0.1347 0.2231,-0.2699 0.2891,-0.4051 0.0461,-0.0949 0.123,-0.3398 0.2309,-0.7378 l 0.3429,0.5152 c 0.091,0.1238 0.2012,0.2437 0.3321,0.3578 0.1289,0.1129 0.2441,0.1898 0.3441,0.2309 0.0621,0.0273 0.1309,0.039 0.207,0.039 0.1117,0 0.2,-0.0289 0.266,-0.089 0.0668,-0.0598 0.1,-0.1329 0.1,-0.218 0,-0.1 -0.0199,-0.1668 -0.0582,-0.2039 -0.0738,-0.0649 -0.1558,-0.0981 -0.25,-0.0981 -0.0539,0 -0.1128,0.0121 -0.1757,0.036 -0.1219,0.041 -0.2051,0.0621 -0.2461,0.0621 -0.0629,0 -0.136,-0.0371 -0.2231,-0.109 -0.1601,-0.1359 -0.3527,-0.3961 -0.5769,-0.7852 l 0.3199,-1.3437 c 0.0488,-0.2063 0.0898,-0.3289 0.125,-0.3691 0.034,-0.0411 0.0672,-0.061 0.1012,-0.061 0.0558,0 0.1199,0.0301 0.191,0.0899 0.1437,0.1203 0.2648,0.2761 0.3687,0.4691 l 0.1352,-0.0711 c -0.1641,-0.3078 -0.3723,-0.5617 -0.6262,-0.7648 -0.1418,-0.1153 -0.2617,-0.1719 -0.3617,-0.1719 -0.1461,0 -0.2613,0.0816 -0.3481,0.2449 -0.055,0.102 -0.1679,0.5399 -0.3402,1.3141 -0.4051,-0.7071 -0.7301,-1.1602 -0.9758,-1.3633 -0.159,-0.1309 -0.3121,-0.1957 -0.4609,-0.1957 -0.1051,0 -0.1992,0.0367 -0.2859,0.1148 -0.0614,0.0559 -0.0922,0.1321 -0.0922,0.2289 0,0.0852 0.0281,0.1571 0.0859,0.2153 0.0563,0.057 0.1262,0.0847 0.2102,0.0847 0.0828,0 0.1718,-0.041 0.266,-0.125 0.0679,-0.0597 0.1199,-0.0898 0.1558,-0.0898 0.0328,0 0.0731,0.0219 0.1211,0.0629 0.1231,0.0988 0.2891,0.3121 0.5,0.6398 0.211,0.3282 0.35,0.566 0.4149,0.7121 -0.1629,0.6321 -0.25,0.9672 -0.2629,1.0032 -0.0602,0.1687 -0.1371,0.289 -0.2352,0.3597 -0.0961,0.0711 -0.2359,0.1051 -0.4238,0.1051 -0.0602,0 -0.1301,-0.0027 -0.207,-0.0078 v 0.1418 l 1.0429,0.182"
       style="fill:#bdbbbc;fill-opacity:1;fill-rule:evenodd;stroke:none;stroke-width:0.1"
       id="path348" /><path
       d="m 135.32,111.8 c 0.775,0 1.406,-0.631 1.406,-1.407 0,-0.775 -0.631,-1.407 -1.406,-1.407 -0.774,0 -1.407,0.632 -1.407,1.407 0,0.776 0.633,1.407 1.407,1.407"
       style="fill:#00adef;fill-opacity:1;fill-rule:evenodd;stroke:none;stroke-width:0.1"
       id="path350" /><path
       d="m 135.32,111.8 c 0.775,0 1.406,-0.631 1.406,-1.407 0,-0.775 -0.631,-1.407 -1.406,-1.407 -0.774,0 -1.407,0.632 -1.407,1.407 0,0.776 0.633,1.407 1.407,1.407 z"
       style="fill:none;stroke:#00adef;stroke-width:0.567;stroke-linecap:butt;stroke-linejoin:miter;stroke-miterlimit:2.613;stroke-dasharray:none;stroke-opacity:1"
       id="path352" /><path
       d="m 64.836552,54.006683 c 0.775,0 1.4071,-0.6309 1.4071,-1.407 0,-0.7739 -0.6321,-1.4059 -1.4071,-1.4059 -0.775,0 -1.407,0.632 -1.407,1.4059 0,0.7761 0.632,1.407 1.407,1.407"
       style="fill:#00adef;fill-opacity:1;fill-rule:evenodd;stroke:none;stroke-width:0.1"
       id="path354" /><path
       d="m 64.836552,54.006683 c 0.775,0 1.4071,-0.6309 1.4071,-1.407 0,-0.7739 -0.6321,-1.4059 -1.4071,-1.4059 -0.775,0 -1.407,0.632 -1.407,1.4059 0,0.7761 0.632,1.407 1.407,1.407 z"
       style="fill:none;stroke:#00adef;stroke-width:0.567;stroke-linecap:butt;stroke-linejoin:miter;stroke-miterlimit:2.613;stroke-dasharray:none;stroke-opacity:1"
       id="path356" /><path
       d="m 54.274452,64.883283 6.22,-7.0676"
       style="fill:none;stroke:#00adef;stroke-width:0.283;stroke-linecap:butt;stroke-linejoin:miter;stroke-miterlimit:2.613;stroke-dasharray:none;stroke-opacity:1"
       id="path376" /><path
       d="m 62.901452,55.079783 -1.7918,3.9152 c -0.232,-0.9883 -0.8543,-1.5352 -1.8641,-1.6383 l 3.6559,-2.2769"
       style="fill:#00adef;fill-opacity:1;fill-rule:evenodd;stroke:none;stroke-width:0.1"
       id="path378" /><path
       d="m 159.102,112.532 -16.586,-1.207"
       style="fill:none;stroke:#ff0000;stroke-width:0.283;stroke-linecap:butt;stroke-linejoin:miter;stroke-miterlimit:2.613;stroke-dasharray:none;stroke-opacity:1"
       id="path380" /><path
       d="m 138.882,111.062 4.203,-0.939 c -0.648,0.782 -0.708,1.607 -0.18,2.475 l -4.023,-1.536"
       style="fill:#ff0000;fill-opacity:1;fill-rule:evenodd;stroke:none;stroke-width:0.1"
       id="path382" /><g
       id="g41"
       transform="matrix(0.1,0,0,0.1,30.8066,5.0609)"
       style="display:inline;opacity:0.5"><g
         id="g43"
         clip-path="url(#clipPath47)"><g
           id="g49"
           clip-path="url(#clipPath53)"><path
             d="m 507,875 v 1 h -22 v 1 h -13 v 1 h -13 v 1 h -13 v 1 h -13 v 1 h -7 v 1 h -8 v 1 h -8 v 1 h -7 v 1 h -8 v 1 h -7 v 1 h -5 v 1 h -6 v 1 h -1 v 2 h 1 v 1 h 1 v 1 h 1 v 1 h 1 v 1 h 1 v 1 h 1 v 1 h 1 v 1 h 1 v 1 h 1 v 1 h 1 v 1 h 1 v 1 h 1 v 1 h 1 v 1 h 1 v 1 h 1 v 1 h 1 v 1 h 1 v 1 h 1 v 1 h 1 v 1 h 1 v 1 h 1 v 1 h 1 v 1 h 1 v 1 h 1 v 1 h 1 v 1 h 1 v 1 h 1 v 1 h 1 v 1 h 1 v 1 h 1 v 1 h 1 v 1 h 1 v 1 h 1 v 1 h 1 v 1 h 1 v 1 h 1 v 1 h 1 v 1 h 1 v 1 h 1 v 1 h 1 v 1 h 1 v 1 h 1 v 1 h 1 v 1 h 1 v 1 h 1 v 1 h 1 v 1 h 1 v 1 h 1 v 1 h 1 v 1 h 1 v 1 h 1 v 1 h 1 v 1 h 1 v 1 h 1 v 1 h 1 v 1 h 1 v 1 h 1 v 1 h 1 v 1 h 1 v 1 h 1 v 1 h 1 v 1 h 1 v 1 h 1 v 1 h 1 v 1 h 1 v 1 h 1 v 1 h 1 v 1 h 1 v 1 h 1 v 1 h 1 v 1 h 1 v 1 h 1 v 1 h 1 v 1 h 1 v 1 h 1 v 1 h 1 v 1 h 1 v 1 h 1 v 1 h 1 v 1 h 1 v 1 h 1 v 1 h 1 v 1 h 1 v 1 h 1 v 1 h 1 v 1 h 1 v 1 h 1 v 1 h 1 v 1 h 1 v 1 h 1 v 1 h 1 v 1 h 1 v 1 h 1 v 1 h 1 v 1 h 1 v 1 h 1 v 1 h 1 v 1 h 1 v 1 h 1 v 1 h 1 v 1 h 1 v 1 h 1 v 1 h 1 v 1 h 1 v 1 h 1 v 1 h 1 v 1 h 1 v 1 h 1 v 1 h 1 v 1 h 1 v 1 h 1 v 1 h 1 v 1 h 1 v 1 h 1 v 1 h 1 v 1 h 1 v 1 h 1 v 1 h 1 v 1 h 1 v 1 h 1 v 1 h 1 v 1 h 1 v 1 h 1 v 1 h 1 v 1 h 1 v 1 h 1 v 1 h 1 v 1 h 1 v 1 h 1 v 1 h 1 v 1 h 1 v 1 h 1 v 1 h 1 v 1 h 1 v 1 h 1 v 1 h 1 v 1 h 1 v 1 h 1 v 1 h 1 v 1 h 1 v 1 h 1 v 1 h 1 v 1 h 1 v 1 h 1 v 1 h 1 v 1 h 1 v 1 h 1 v 1 h 1 v 1 h 1 v 1 h 1 v 1 h 1 v 1 h 1 v 1 h 1 v 1 h 1 v 1 h 1 v 1 h 1 v 1 h 1 v 1 h 1 v 1 h 1 v 1 h 1 v 1 h 1 v 1 h 1 v 1 h 1 v 1 h 1 v 1 h 1 v 1 h 1 v 1 h 1 v 1 h 1 v 1 h 1 v 1 h 1 v 1 h 1 v 1 h 1 v 1 h 1 v 1 h 1 v 1 h 1 v 1 h 1 v 1 h 1 v 1 h 1 v 1 h 1 v 1 h 1 v 1 h 1 v 1 h 1 v 1 h 1 v 1 h 1 v 1 h 1 v 1 h 1 v 1 h 1 v 1 h 1 v 1 h 1 v 1 h 1 v 1 h 1 v 1 h 1 v 1 h 1 v 1 h 1 v 1 h 1 v 1 h 1 v 1 h 1 v 1 h 1 v 1 h 1 v 1 h 1 v 1 h 1 v 1 h 1 v 1 h 1 v 1 h 1 v 1 h 1 v 1 h 1 v 1 h 1 v 1 h 1 v 1 h 1 v 1 h 1 v 1 h 1 v 1 h 1 v 1 h 1 v 1 h 1 v 1 h 1 v 1 h 1 v 1 h 1 v 1 h 1 v 1 h 1 v 1 h 1 v 1 h 1 v 1 h 1 v 1 h 1 v 1 h 1 v 1 h 1 v 1 h 1 v 1 h 1 v 1 h 1 v 1 h 1 v 1 h 1 v 1 h 1 v 1 h 1 v 1 h 1 v 1 h 1 v 1 h 1 v 1 h 1 v 1 h 1 v 1 h 1 v 1 h 1 v 1 h 1 v 1 h 1 v 1 h 1 v 1 h 1 v 1 h 1 v 1 h 1 v 1 h 1 v 1 h 1 v 1 h 1 v 1 h 1 v 1 h 1 v 1 h 1 v 1 h 1 v 1 h 1 v 1 h 1 v 1 h 1 v 1 h 1 v 1 h 1 v 1 h 1 v 1 h 1 v 1 h 1 v 1 h 1 v 1 h 1 v 1 h 1 v 1 h 1 v 1 h 1 v 1 h 1 v 1 h 1 v 1 h 1 v 1 h 1 v 1 h 1 v 1 h 1 v 1 h 1 v 1 h 1 v 1 h 1 v 1 h 1 v 1 h 1 v 1 h 1 v 1 h 1 v 1 h 1 v 1 h 1 v 1 h 1 v 1 h 1 v 1 h 1 v 1 h 1 v 1 h 1 v 1 h 1 v 1 h 1 v 1 h 1 v 1 h 1 v 1 h 1 v 1 h 1 v 1 h 1 v 1 h 1 v 1 h 1 v 1 h 1 v 1 h 1 v 1 h 1 v 1 h 1 v 1 h 1 v 1 h 1 v 1 h 1 v 1 h 1 v 1 h 1 v 1 h 1 v 1 h 1 v 1 h 1 v 1 h 1 v 1 h 1 v 1 h 1 v 1 h 1 v 1 h 1 v 1 h 1 v 1 h 1 v 1 h 1 v 1 h 1 v 1 h 1 v 1 h 1 v 1 h 1 v 1 h 1 v 1 h 1 v 1 h 1 v 1 h 1 v 1 h 1 v 1 h 1 v 1 h 1 v 1 h 1 v 1 h 1 v 1 h 1 v 1 h 1 v 1 h 1 v 1 h 1 v 1 h 1 v 1 h 1 v 1 h 1 v 1 h 1 v 1 h 1 v 1 h 1 v 1 h 1 v 1 h 1 v 1 h 1 v 1 h 1 v 1 h 1 v 1 h 1 v 1 h 1 v 1 h 1 v 1 h 1 v 1 h 1 v 1 h 1 v 1 h 1 v 1 h 1 v 1 h 1 v 1 h 1 v 1 h 1 v 1 h 1 v 1 h 1 v 1 h 1 v 1 h 1 v 1 h 1 v 1 h 1 v 1 h 1 v 1 h 1 v 1 h 1 v 1 h 1 v 1 h 1 v 1 h 1 v 1 h 1 v 1 h 1 v 1 h 1 v 1 h 1 v 1 h 1 v 1 h 1 v 1 h 1 v 1 h 1 v 1 h 1 v 1 h 1 v 1 h 1 v 1 h 1 v 1 h 1 v 1 h 1 v 1 h 1 v 1 h 1 v 1 h 1 v 1 h 1 v 1 h 1 v 1 h 1 v 1 h 1 v 1 h 1 v 1 h 1 v 1 h 1 v 1 h 1 v 1 h 1 v 1 h 1 v 1 h 1 v 1 h 1 v 1 h 1 v 1 h 1 v 1 h 1 v 1 h 1 v 1 h 1 v 1 h 1 v 1 h 1 v 1 h 1 v 1 h 1 v 1 h 1 v 1 h 1 v 1 h 1 v 1 h 1 v 1 h 1 v 1 h 1 v 1 h 1 v 1 h 370 v 1 h 360 v -2 h -1 v -1 h -1 v -2 h -1 v -1 h -1 v -2 h -1 v -1 h -1 v -1 h -1 v -2 h -1 v -1 h -1 v -1 h -1 v -1 h -1 v -2 h -1 v -1 h -1 v -1 h -1 v -2 h -1 v -1 h -1 v -1 h -1 v -2 h -1 v -1 h -1 v -1 h -1 v -1 h -1 v -2 h -1 v -1 h -1 v -1 h -1 v -1 h -1 v -1 h -1 v -2 h -1 v -1 h -1 v -1 h -1 v -1 h -1 v -1 h -1 v -1 h -1 v -2 h -1 v -1 h -1 v -1 h -1 v -1 h -1 v -1 h -1 v -2 h -1 v -1 h -1 v -1 h -1 v -1 h -1 v -1 h -1 v -1 h -1 v -2 h -1 v -1 h -1 v -1 h -1 v -1 h -1 v -1 h -1 v -1 h -1 v -1 h -1 v -1 h -1 v -1 h -1 v -1 h -1 v -1 h -1 v -1 h -1 v -1 h -1 v -1 h -1 v -1 h -1 v -1 h -1 v -2 h -1 v -1 h -1 v -1 h -1 v -1 h -1 v -1 h -1 v -1 h -1 v -1 h -1 v -1 h -1 v -1 h -1 v -1 h -1 v -1 h -1 v -1 h -1 v -1 h -1 v -1 h -1 v -1 h -1 v -1 h -1 v -1 h -1 v -1 h -1 v -1 h -1 v -1 h -1 v -1 h -1 v -1 h -1 v -1 h -1 v -1 h -2 v -1 h -1 v -1 h -1 v -1 h -1 v -1 h -1 v -1 h -1 v -1 h -1 v -1 h -1 v -1 h -1 v -1 h -1 v -1 h -1 v -1 h -1 v -1 h -1 v -1 h -1 v -1 h -1 v -1 h -2 v -1 h -1 v -1 h -1 v -1 h -1 v -1 h -1 v -1 h -1 v -1 h -1 v -1 h -1 v -1 h -2 v -1 h -1 v -1 h -1 v -1 h -1 v -1 h -1 v -1 h -1 v -1 h -2 v -1 h -1 v -1 h -1 v -1 h -1 v -1 h -1 v -1 h -2 v -1 h -1 v -1 h -1 v -1 h -1 v -1 h -1 v -1 h -1 v -1 h -2 v -1 h -1 v -1 h -1 v -1 h -1 v -1 h -1 v -1 h -2 v -1 h -1 v -1 h -1 v -1 h -1 v -1 h -2 v -1 h -1 v -1 h -1 v -1 h -2 v -1 h -1 v -1 h -1 v -1 h -1 v -1 h -2 v -1 h -1 v -1 h -1 v -1 h -2 v -1 h -1 v -1 h -1 v -1 h -2 v -1 h -1 v -1 h -1 v -1 h -1 v -1 h -2 v -1 h -1 v -1 h -1 v -1 h -2 v -1 h -1 v -1 h -1 v -1 h -2 v -1 h -1 v -1 h -1 v -1 h -2 v -1 h -1 v -1 h -2 v -1 h -1 v -1 h -1 v -1 h -2 v -1 h -1 v -1 h -2 v -1 h -1 v -1 h -2 v -1 h -1 v -1 h -1 v -1 h -2 v -1 h -1 v -1 h -2 v -1 h -1 v -1 h -1 v -1 h -2 v -1 h -1 v -1 h -2 v -1 h -1 v -1 h -2 v -1 h -1 v -1 h -2 v -1 h -1 v -1 h -2 v -1 h -1 v -1 h -2 v -1 h -1 v -1 h -2 v -1 h -1 v -1 h -2 v -1 h -1 v -1 h -2 v -1 h -2 v -1 h -1 v -1 h -2 v -1 h -1 v -1 h -2 v -1 h -1 v -1 h -2 v -1 h -1 v -1 h -2 v -1 h -2 v -1 h -1 v -1 h -2 v -1 h -1 v -1 h -2 v -1 h -1 v -1 h -2 v -1 h -2 v -1 h -2 v -1 h -1 v -1 h -2 v -1 h -2 v -1 h -1 v -1 h -2 v -1 h -2 v -1 h -1 v -1 h -2 v -1 h -2 v -1 h -1 v -1 h -2 v -1 h -2 v -1 h -2 v -1 h -1 v -1 h -2 v -1 h -2 v -1 h -1 v -1 h -2 v -1 h -2 v -1 h -1 v -1 h -2 v -1 h -2 v -1 h -2 v -1 h -2 v -1 h -2 v -1 h -2 v -1 h -1 v -1 h -2 v -1 h -2 v -1 h -2 v -1 h -2 v -1 h -2 v -1 h -1 v -1 h -2 v -1 h -2 v -1 h -2 v -1 h -2 v -1 h -2 v -1 h -2 v -1 h -1 v -1 h -2 v -1 h -2 v -1 h -2 v -1 h -2 v -1 h -2 v -1 h -2 v -1 h -2 v -1 h -2 v -1 h -2 v -1 h -2 v -1 h -2 v -1 h -2 v -1 h -2 v -1 h -2 v -1 h -2 v -1 h -2 v -1 h -2 v -1 h -2 v -1 h -2 v -1 h -2 v -1 h -2 v -1 h -3 v -1 h -2 v -1 h -2 v -1 h -2 v -1 h -2 v -1 h -2 v -1 h -2 v -1 h -3 v -1 h -2 v -1 h -2 v -1 h -2 v -1 h -2 v -1 h -3 v -1 h -2 v -1 h -2 v -1 h -2 v -1 h -3 v -1 h -2 v -1 h -2 v -1 h -2 v -1 h -2 v -1 h -3 v -1 h -2 v -1 h -2 v -1 h -3 v -1 h -2 v -1 h -2 v -1 h -3 v -1 h -2 v -1 h -3 v -1 h -2 v -1 h -3 v -1 h -2 v -1 h -3 v -1 h -2 v -1 h -2 v -1 h -3 v -1 h -2 v -1 h -3 v -1 h -2 v -1 h -3 v -1 h -2 v -1 h -3 v -1 h -2 v -1 h -3 v -1 h -3 v -1 h -2 v -1 h -3 v -1 h -3 v -1 h -2 v -1 h -3 v -1 h -3 v -1 h -3 v -1 h -2 v -1 h -3 v -1 h -3 v -1 h -2 v -1 h -3 v -1 h -3 v -1 h -3 v -1 h -2 v -1 h -3 v -1 h -3 v -1 h -3 v -1 h -3 v -1 h -3 v -1 h -3 v -1 h -3 v -1 h -3 v -1 h -3 v -1 h -3 v -1 h -3 v -1 h -3 v -1 h -3 v -1 h -3 v -1 h -3 v -1 h -3 v -1 h -4 v -1 h -3 v -1 h -3 v -1 h -4 v -1 h -3 v -1 h -3 v -1 h -4 v -1 h -3 v -1 h -3 v -1 h -4 v -1 h -3 v -1 h -3 v -1 h -4 v -1 h -4 v -1 h -3 v -1 h -4 v -1 h -3 v -1 h -4 v -1 h -4 v -1 h -3 v -1 h -4 v -1 h -4 v -1 h -4 v -1 h -5 v -1 h -4 v -1 h -4 v -1 h -4 v -1 h -4 v -1 h -4 v -1 h -4 v -1 h -4 v -1 h -5 v -1 h -4 v -1 h -4 v -1 h -5 v -1 h -5 v -1 h -5 v -1 h -5 v -1 h -5 v -1 h -5 v -1 h -5 v -1 h -5 v -1 h -5 v -1 h -5 v -1 h -5 v -1 h -5 v -1 h -5 v -1 h -7 v -1 h -6 v -1 h -7 v -1 h -7 v -1 h -7 v -1 h -6 v -1 h -7 v -1 h -7 v -1 h -7 v -1 h -6 v -1 h -9 v -1 h -10 v -1 h -11 v -1 h -10 v -1 h -10 v -1 h -11 v -1 h -10 v -1 h -23 v -1 h -24 v -1"
             style="fill:url(#radialGradient59);fill-opacity:1;fill-rule:nonzero;stroke:none"
             id="path61" /></g></g></g><g
       id="g6365"
       transform="translate(-1.5,-4.5)"><path
         d="m 73.1601,114.1799 h -0.7019 l 1.082,3.64 c 0.1949,0.652 0.4602,1.141 0.7949,1.469 0.3352,0.328 0.7352,0.492 1.2039,0.492 0.4594,0 0.8242,-0.141 1.1,-0.425 0.2742,-0.284 0.4114,-0.663 0.4114,-1.138 0,-0.302 -0.0622,-0.601 -0.1852,-0.898 -0.1238,-0.296 -0.2969,-0.563 -0.5219,-0.796 -0.198,-0.212 -0.4133,-0.371 -0.65,-0.479 -0.2351,-0.108 -0.482,-0.163 -0.739,-0.163 -0.1981,0 -0.4032,0.026 -0.611,0.076 -0.207,0.051 -0.409,0.126 -0.6051,0.222 z m 1.152,3.953 -0.4598,-1.571 c 0.1738,-0.15 0.3398,-0.26 0.5,-0.328 0.159,-0.068 0.3238,-0.101 0.5,-0.101 0.4188,0 0.775,0.241 1.0668,0.723 0.2922,0.481 0.4371,1.065 0.4371,1.749 0,0.295 -0.0691,0.525 -0.209,0.692 -0.1398,0.167 -0.3281,0.249 -0.5679,0.249 -0.2711,0 -0.5161,-0.121 -0.7332,-0.365 -0.218,-0.243 -0.395,-0.593 -0.534,-1.048"
         style="fill:#231f20;fill-opacity:1;fill-rule:evenodd;stroke:none;stroke-width:0.1"
         id="path63" /><path
         d="m 94.2191,116.1719 c 0.45,0.129 0.8402,0.42 1.1691,0.868 0.3282,0.449 0.4942,0.89 0.4942,1.322 0,0.318 -0.0711,0.568 -0.2141,0.752 -0.1441,0.184 -0.3633,0.304 -0.6562,0.362 z m 0.382,3.3 c -0.2078,-0.022 -0.4,-0.08 -0.5757,-0.176 -0.1762,-0.096 -0.3422,-0.235 -0.502,-0.414 -0.2141,-0.245 -0.3832,-0.524 -0.507,-0.838 -0.125,-0.314 -0.1883,-0.615 -0.1883,-0.904 0,-0.282 0.0652,-0.504 0.1973,-0.668 0.132,-0.164 0.3308,-0.272 0.6,-0.324 z m -0.4461,-3.582 -0.4097,-1.656 h -0.6699 l 0.4878,1.672 c -0.4558,0.075 -0.8121,0.254 -1.0671,0.534 -0.2547,0.28 -0.384,0.633 -0.384,1.06 0,0.588 0.25,1.105 0.7492,1.55 0.4988,0.446 1.107,0.687 1.8301,0.723 l 0.457,1.583 h 0.309 l -0.382,-1.599 c 0.4859,-0.047 0.8687,-0.203 1.1527,-0.467 0.2832,-0.264 0.4242,-0.6 0.4242,-1.005 0,-0.565 -0.241,-1.084 -0.725,-1.555 -0.4832,-0.472 -1.0742,-0.752 -1.7723,-0.84"
         style="fill:#231f20;fill-opacity:1;fill-rule:evenodd;stroke:none;stroke-width:0.1"
         id="path65" /><path
         d="m 82.8523,117.3639 c -0.0961,-0.472 -0.2852,-0.835 -0.566,-1.088 -0.282,-0.255 -0.593,-0.382 -0.934,-0.382 -0.407,0 -0.7621,0.171 -1.0633,0.513 -0.3027,0.341 -0.4527,0.801 -0.4527,1.382 0,0.563 0.168,1.02 0.5027,1.371 0.3344,0.352 0.7364,0.528 1.2043,0.528 0.352,0 0.6406,-0.094 0.868,-0.28 0.2269,-0.186 0.3398,-0.379 0.3398,-0.58 0,-0.099 -0.0328,-0.179 -0.0968,-0.24 -0.0641,-0.062 -0.152,-0.092 -0.2672,-0.092 -0.1539,0 -0.27,0.049 -0.3481,0.148 -0.0437,0.054 -0.0738,0.16 -0.0867,0.313 -0.0152,0.153 -0.0691,0.271 -0.159,0.352 -0.091,0.077 -0.2172,0.116 -0.3781,0.116 -0.2621,0 -0.4711,-0.096 -0.6301,-0.288 -0.2097,-0.256 -0.3168,-0.593 -0.3168,-1.012 0,-0.427 0.1039,-0.804 0.316,-1.131 0.2098,-0.326 0.4918,-0.49 0.8489,-0.49 0.255,0 0.4839,0.086 0.6859,0.261 0.1449,0.12 0.284,0.337 0.4191,0.653 l 0.1141,-0.054"
         style="fill:#231f20;fill-opacity:1;fill-rule:evenodd;stroke:none;stroke-width:0.1"
         id="path67" /><path
         d="m 85.1132,119.6879 c 0.5411,0 0.977,-0.207 1.3059,-0.618 0.2781,-0.352 0.4172,-0.756 0.4172,-1.21 0,-0.322 -0.0781,-0.646 -0.2313,-0.974 -0.1527,-0.328 -0.3648,-0.576 -0.6339,-0.742 -0.2688,-0.167 -0.57,-0.25 -0.9008,-0.25 -0.5403,0 -0.9672,0.215 -1.284,0.644 -0.2692,0.363 -0.4039,0.77 -0.4039,1.219 0,0.329 0.0816,0.655 0.2449,0.979 0.1629,0.324 0.377,0.564 0.6418,0.718 0.266,0.156 0.5473,0.234 0.8441,0.234 z m -0.1211,-0.255 c -0.1371,0 -0.2769,-0.04 -0.416,-0.123 -0.1379,-0.082 -0.2519,-0.225 -0.3379,-0.432 -0.0859,-0.205 -0.1281,-0.469 -0.1281,-0.792 0,-0.521 0.1039,-0.97 0.3102,-1.348 0.207,-0.377 0.4801,-0.566 0.8179,-0.566 0.2532,0 0.461,0.104 0.625,0.312 0.1649,0.209 0.2461,0.566 0.2461,1.074 0,0.636 -0.1359,1.136 -0.4101,1.5 -0.184,0.251 -0.4199,0.375 -0.7071,0.375"
         style="fill:#231f20;fill-opacity:1;fill-rule:evenodd;stroke:none;stroke-width:0.1"
         id="path69" /><path
         d="m 89.6754,119.6879 v -1.219 h -0.1282 c -0.1,0.383 -0.2269,0.643 -0.3801,0.781 -0.1558,0.138 -0.3539,0.207 -0.5917,0.207 -0.1833,0 -0.3301,-0.048 -0.4434,-0.145 -0.1109,-0.096 -0.1668,-0.203 -0.1668,-0.32 0,-0.146 0.0418,-0.271 0.1238,-0.375 0.0821,-0.107 0.2461,-0.22 0.4942,-0.34 l 0.5691,-0.277 c 0.5289,-0.258 0.7918,-0.598 0.7918,-1.02 0,-0.326 -0.1219,-0.587 -0.368,-0.787 -0.2449,-0.199 -0.5211,-0.299 -0.825,-0.299 -0.2211,0 -0.4711,0.039 -0.7507,0.118 -0.0852,0.025 -0.1563,0.038 -0.2114,0.038 -0.0597,0 -0.1058,-0.033 -0.1406,-0.101 h -0.1281 v 1.277 h 0.1281 c 0.0727,-0.364 0.2129,-0.638 0.4187,-0.824 0.2051,-0.185 0.436,-0.277 0.6899,-0.277 0.1801,0 0.3273,0.052 0.4402,0.157 0.1141,0.107 0.1699,0.234 0.1699,0.382 0,0.18 -0.0628,0.33 -0.191,0.453 -0.125,0.123 -0.3757,0.277 -0.755,0.465 -0.377,0.187 -0.6239,0.356 -0.7411,0.507 -0.1168,0.149 -0.1757,0.336 -0.1757,0.563 0,0.294 0.1007,0.541 0.3031,0.738 0.1996,0.198 0.4617,0.298 0.7816,0.298 0.1422,0 0.3121,-0.031 0.5121,-0.091 0.134,-0.039 0.2211,-0.059 0.266,-0.059 0.0422,0 0.0743,0.01 0.0981,0.028 0.0219,0.019 0.0508,0.059 0.082,0.122 h 0.1282"
         style="fill:#231f20;fill-opacity:1;fill-rule:evenodd;stroke:none;stroke-width:0.1"
         id="path71" /></g><path
       d="M 109.1773,65.9839 151.6476,41.764"
       style="fill:none;stroke:#231f20;stroke-width:0.425;stroke-linecap:butt;stroke-linejoin:miter;stroke-miterlimit:2.613;stroke-dasharray:2.126, 1.276;stroke-dashoffset:0;stroke-opacity:1"
       id="path77" /><g
       id="g27"
       clip-path="url(#clipPath31)"
       transform="matrix(0.1,0,0,0.1,30.8066,5.0609)"
       style="display:inline;opacity:0.5"><path
         d="m 488,191 v 1 h -15 v 1 h -15 v 1 h -16 v 1 h -12 v 1 h -8 v 1 h -9 v 1 h -8 v 1 h -8 v 1 h -8 v 1 h -6 v 1 h -6 v 1 h -1 v 687 h 2 v -1 h 6 v -1 h 6 v -1 h 8 v -1 h 8 v -1 h 8 v -1 h 9 v -1 h 8 v -1 h 12 v -1 h 16 v -1 h 15 v -1 h 15 v -1 h 85 v 1 h 21 v 1 h 20 v 1 h 15 v 1 h 10 v 1 h 10 v 1 h 10 v 1 h 9 v 1 h 10 v 1 h 10 v 1 h 8 v 1 h 7 v 1 h 6 v 1 h 7 v 1 h 7 v 1 h 6 v 1 h 7 v 1 h 7 v 1 h 6 v 1 h 7 v 1 h 6 v 1 h 5 v 1 h 5 v 1 h 5 v 1 h 5 v 1 h 5 v 1 h 5 v 1 h 5 v 1 h 5 v 1 h 5 v 1 h 5 v 1 h 5 v 1 h 5 v 1 h 5 v 1 h 5 v 1 h 4 v 1 h 4 v 1 h 4 v 1 h 4 v 1 h 5 v 1 h 4 v 1 h 4 v 1 h 4 v 1 h 4 v 1 h 4 v 1 h 4 v 1 h 4 v 1 h 4 v 1 h 4 v 1 h 4 v 1 h 3 v 1 h 4 v 1 h 3 v 1 h 4 v 1 h 4 v 1 h 3 v 1 h 4 v 1 h 3 v 1 h 3 v 1 h 4 v 1 h 3 v 1 h 3 v 1 h 4 v 1 h 3 v 1 h 3 v 1 h 4 v 1 h 3 v 1 h 3 v 1 h 3 v 1 h 3 v 1 h 3 v 1 h 3 v 1 h 3 v 1 h 3 v 1 h 3 v 1 h 3 v 1 h 3 v 1 h 3 v 1 h 3 v 1 h 3 v 1 h 3 v 1 h 3 v 1 h 3 v 1 h 3 v 1 h 3 v 1 h 2 v 1 h 3 v 1 h 3 v 1 h 2 v 1 h 3 v 1 h 3 v 1 h 2 v 1 h 3 v 1 h 3 v 1 h 3 v 1 h 2 v 1 h 3 v 1 h 3 v 1 h 2 v 1 h 3 v 1 h 3 v 1 h 2 v 1 h 3 v 1 h 2 v 1 h 3 v 1 h 2 v 1 h 2 v 1 h 3 v 1 h 2 v 1 h 3 v 1 h 2 v 1 h 3 v 1 h 2 v 1 h 2 v 1 h 3 v 1 h 2 v 1 h 3 v 1 h 2 v 1 h 3 v 1 h 2 v 1 h 2 v 1 h 3 v 1 h 2 v 1 h 2 v 1 h 2 v 1 h 2 v 1 h 3 v 1 h 2 v 1 h 2 v 1 h 2 v 1 h 3 v 1 h 2 v 1 h 2 v 1 h 2 v 1 h 2 v 1 h 3 v 1 h 2 v 1 h 2 v 1 h 2 v 1 h 3 v 1 h 2 v 1 h 2 v 1 h 2 v 1 h 2 v 1 h 2 v 1 h 2 v 1 h 2 v 1 h 2 v 1 h 2 v 1 h 2 v 1 h 2 v 1 h 2 v 1 h 2 v 1 h 2 v 1 h 2 v 1 h 2 v 1 h 2 v 1 h 2 v 1 h 2 v 1 h 2 v 1 h 2 v 1 h 2 v 1 h 2 v 1 h 2 v 1 h 2 v 1 h 2 v 1 h 2 v 1 h 1 v 1 h 2 v 1 h 2 v 1 h 2 v 1 h 2 v 1 h 2 v 1 h 2 v 1 h 1 v 1 h 2 v 1 h 2 v 1 h 2 v 1 h 2 v 1 h 2 v 1 h 2 v 1 h 1 v 1 h 2 v 1 h 2 v 1 h 2 v 1 h 2 v 1 h 1 v 1 h 2 v 1 h 2 v 1 h 1 v 1 h 2 v 1 h 2 v 1 h 2 v 1 h 1 v 1 h 2 v 1 h 2 v 1 h 1 v 1 h 2 v 1 h 2 v 1 h 2 v 1 h 1 v 1 h 2 v 1 h 2 v 1 h 1 v 1 h 2 v 1 h 2 v 1 h 1 v 1 h 2 v 1 h 2 v 1 h 1 v 1 h 2 v 1 h 2 v 1 h 1 v 1 h 2 v 1 h 1 v 1 h 2 v 1 h 1 v 1 h 2 v 1 h 1 v 1 h 2 v 1 h 2 v 1 h 1 v 1 h 2 v 1 h 1 v 1 h 2 v 1 h 1 v 1 h 2 v 1 h 2 v 1 h 1 v 1 h 2 v 1 h 1 v 1 h 2 v 1 h 1 v 1 h 2 v 1 h 1 v 1 h 2 v 1 h 1 v 1 h 2 v 1 h 1 v 1 h 1 v 1 h 2 v 1 h 1 v 1 h 2 v 1 h 1 v 1 h 2 v 1 h 1 v 1 h 2 v 1 h 1 v 1 h 1 v 1 h 2 v 1 h 1 v 1 h 2 v 1 h 1 v 1 h 2 v 1 h 1 v 1 h 1 v 1 h 2 v 1 h 1 v 1 h 2 v 1 h 1 v 1 h 1 v 1 h 2 v 1 h 1 v 1 h 1 v 1 h 2 v 1 h 1 v 1 h 1 v 1 h 2 v 1 h 1 v 1 h 1 v 1 h 2 v 1 h 1 v 1 h 1 v 1 h 1 v 1 h 2 v 1 h 1 v 1 h 1 v 1 h 2 v 1 h 1 v 1 h 1 v 1 h 2 v 1 h 1 v 1 h 1 v 1 h 2 v 1 h 1 v 1 h 1 v 1 h 1 v 1 h 2 v 1 h 1 v 1 h 1 v 1 h 1 v 1 h 1 v 1 h 2 v 1 h 1 v 1 h 1 v 1 h 1 v 1 h 1 v 1 h 2 v 1 h 1 v 1 h 1 v 1 h 1 v 1 h 1 v 1 h 2 v 1 h 1 v 1 h 1 v 1 h 1 v 1 h 1 v 1 h 2 v 1 h 1 v 1 h 1 v 1 h 1 v 1 h 1 v 1 h 1 v 1 h 2 v 1 h 1 v 1 h 1 v 1 h 1 v 1 h 1 v 1 h 1 v 1 h 1 v 1 h 1 v 1 h 1 v 1 h 1 v 1 h 1 v 1 h 2 v 1 h 1 v 1 h 1 v 1 h 1 v 1 h 1 v 1 h 1 v 1 h 1 v 1 h 1 v 1 h 1 v 1 h 1 v 1 h 2 v 1 h 1 v 1 h 1 v 1 h 1 v 1 h 1 v 1 h 1 v 1 h 1 v 1 h 1 v 1 h 1 v 1 h 1 v 1 h 1 v 1 h 1 v 1 h 1 v 1 h 1 v 1 h 1 v 1 h 1 v 1 h 1 v 1 h 1 v 1 h 1 v 1 h 1 v 1 h 1 v 1 h 1 v 1 h 1 v 1 h 1 v 1 h 1 v 1 h 1 v 1 h 1 v 1 h 1 v 1 h 1 v 1 h 1 v 1 h 1 v 1 h 1 v 2 h 1 v 1 h 1 v 1 h 1 v 1 h 1 v 1 h 1 v 1 h 1 v 1 h 1 v 1 h 1 v 2 h 1 v 1 h 1 v 1 h 1 v 1 h 1 v 1 h 1 v 1 h 1 v 1 h 1 v 2 h 1 v 1 h 1 v 1 h 1 v 1 h 1 v 1 h 1 v 1 h 1 v 1 h 1 v 1 h 1 v 2 h 1 v 1 h 1 v 1 h 1 v 1 h 1 v 1 h 1 v 2 h 1 v 1 h 1 v 1 h 1 v 1 h 1 v 2 h 1 v 1 h 1 v 1 h 1 v 1 h 1 v 2 h 1 v 1 h 1 v 1 h 1 v 1 h 1 v 2 h 1 v 1 h 1 v 1 h 1 v 2 h 1 v 1 h 1 v 1 h 1 v 2 h 1 v 1 h 1 V 820 h 1 V 612 h -1 v -2 h -1 v -1 h -1 v -1 h -1 v -2 h -1 v -1 h -1 v -1 h -1 v -2 h -1 v -1 h -1 v -1 h -1 v -2 h -1 v -1 h -1 v -1 h -1 v -1 h -1 v -2 h -1 v -1 h -1 v -1 h -1 v -1 h -1 v -2 h -1 v -1 h -1 v -1 h -1 v -2 h -1 v -1 h -1 v -1 h -1 v -1 h -1 v -1 h -1 v -1 h -1 v -2 h -1 v -1 h -1 v -1 h -1 v -1 h -1 v -1 h -1 v -1 h -1 v -1 h -1 v -2 h -1 v -1 h -1 v -1 h -1 v -1 h -1 v -1 h -1 v -1 h -1 v -1 h -1 v -2 h -1 v -1 h -1 v -1 h -1 v -1 h -1 v -1 h -1 v -1 h -1 v -1 h -1 v -1 h -1 v -1 h -1 v -1 h -1 v -1 h -1 v -1 h -1 v -1 h -1 v -1 h -1 v -1 h -1 v -1 h -1 v -1 h -1 v -1 h -1 v -1 h -1 v -2 h -1 v -1 h -1 v -1 h -1 v -1 h -1 v -1 h -1 v -1 h -1 v -1 h -1 v -1 h -1 v -1 h -1 v -1 h -1 v -1 h -1 v -1 h -1 v -1 h -1 v -1 h -1 v -1 h -1 v -1 h -1 v -1 h -2 v -1 h -1 v -1 h -1 v -1 h -1 v -1 h -1 v -1 h -1 v -1 h -1 v -1 h -1 v -1 h -1 v -1 h -1 v -1 h -2 v -1 h -1 v -1 h -1 v -1 h -1 v -1 h -1 v -1 h -1 v -1 h -1 v -1 h -1 v -1 h -1 v -1 h -1 v -1 h -1 v -1 h -2 v -1 h -1 v -1 h -1 v -1 h -1 v -1 h -1 v -1 h -1 v -1 h -1 v -1 h -2 v -1 h -1 v -1 h -1 v -1 h -1 v -1 h -2 v -1 h -1 v -1 h -1 v -1 h -1 v -1 h -1 v -1 h -2 v -1 h -1 v -1 h -1 v -1 h -1 v -1 h -1 v -1 h -2 v -1 h -1 v -1 h -1 v -1 h -1 v -1 h -1 v -1 h -2 v -1 h -1 v -1 h -1 v -1 h -1 v -1 h -2 v -1 h -1 v -1 h -1 v -1 h -1 v -1 h -2 v -1 h -1 v -1 h -1 v -1 h -2 v -1 h -1 v -1 h -1 v -1 h -2 v -1 h -1 v -1 h -1 v -1 h -2 v -1 h -1 v -1 h -1 v -1 h -2 v -1 h -1 v -1 h -1 v -1 h -2 v -1 h -1 v -1 h -1 v -1 h -2 v -1 h -1 v -1 h -1 v -1 h -2 v -1 h -1 v -1 h -2 v -1 h -1 v -1 h -1 v -1 h -2 v -1 h -1 v -1 h -2 v -1 h -1 v -1 h -2 v -1 h -1 v -1 h -2 v -1 h -1 v -1 h -1 v -1 h -2 v -1 h -1 v -1 h -2 v -1 h -1 v -1 h -2 v -1 h -1 v -1 h -2 v -1 h -1 v -1 h -2 v -1 h -1 v -1 h -1 v -1 h -2 v -1 h -1 v -1 h -2 v -1 h -1 v -1 h -2 v -1 h -2 v -1 h -1 v -1 h -2 v -1 h -1 v -1 h -2 v -1 h -2 v -1 h -1 v -1 h -2 v -1 h -1 v -1 h -2 v -1 h -1 v -1 h -2 v -1 h -2 v -1 h -1 v -1 h -2 v -1 h -1 v -1 h -2 v -1 h -2 v -1 h -1 v -1 h -2 v -1 h -1 v -1 h -2 v -1 h -2 v -1 h -1 v -1 h -2 v -1 h -2 v -1 h -2 v -1 h -1 v -1 h -2 v -1 h -2 v -1 h -2 v -1 h -1 v -1 h -2 v -1 h -2 v -1 h -1 v -1 h -2 v -1 h -2 v -1 h -2 v -1 h -1 v -1 h -2 v -1 h -2 v -1 h -1 v -1 h -2 v -1 h -2 v -1 h -2 v -1 h -2 v -1 h -1 v -1 h -2 v -1 h -2 v -1 h -2 v -1 h -2 v -1 h -2 v -1 h -2 v -1 h -2 v -1 h -1 v -1 h -2 v -1 h -2 v -1 h -2 v -1 h -2 v -1 h -2 v -1 h -2 v -1 h -2 v -1 h -1 v -1 h -2 v -1 h -2 v -1 h -2 v -1 h -2 v -1 h -2 v -1 h -2 v -1 h -2 v -1 h -2 v -1 h -2 v -1 h -2 v -1 h -2 v -1 h -2 v -1 h -2 v -1 h -2 v -1 h -2 v -1 h -3 v -1 h -2 v -1 h -2 v -1 h -2 v -1 h -2 v -1 h -2 v -1 h -2 v -1 h -2 v -1 h -2 v -1 h -2 v -1 h -2 v -1 h -2 v -1 h -3 v -1 h -2 v -1 h -2 v -1 h -2 v -1 h -3 v -1 h -2 v -1 h -2 v -1 h -2 v -1 h -2 v -1 h -3 v -1 h -2 v -1 h -2 v -1 h -2 v -1 h -3 v -1 h -2 v -1 h -2 v -1 h -2 v -1 h -3 v -1 h -2 v -1 h -2 v -1 h -3 v -1 h -2 v -1 h -3 v -1 h -2 v -1 h -3 v -1 h -2 v -1 h -3 v -1 h -2 v -1 h -3 v -1 h -2 v -1 h -2 v -1 h -3 v -1 h -2 v -1 h -3 v -1 h -2 v -1 h -3 v -1 h -2 v -1 h -3 v -1 h -2 v -1 h -3 v -1 h -3 v -1 h -3 v -1 h -2 v -1 h -3 v -1 h -3 v -1 h -2 v -1 h -3 v -1 h -3 v -1 h -3 v -1 h -2 v -1 h -3 v -1 h -3 v -1 h -2 v -1 h -3 v -1 h -3 v -1 h -3 v -1 h -3 v -1 h -3 v -1 h -3 v -1 h -3 v -1 h -3 v -1 h -3 v -1 h -3 v -1 h -3 v -1 h -3 v -1 h -3 v -1 h -3 v -1 h -3 v -1 h -3 v -1 h -3 v -1 h -3 v -1 h -3 v -1 h -3 v -1 h -4 v -1 h -3 v -1 h -3 v -1 h -4 v -1 h -3 v -1 h -3 v -1 h -4 v -1 h -3 v -1 h -3 v -1 h -4 v -1 h -3 v -1 h -4 v -1 h -4 v -1 h -3 v -1 h -4 v -1 h -3 v -1 h -4 v -1 h -4 v -1 h -4 v -1 h -4 v -1 h -4 v -1 h -4 v -1 h -4 v -1 h -4 v -1 h -4 v -1 h -4 v -1 h -5 v -1 h -4 v -1 h -4 v -1 h -4 v -1 h -4 v -1 h -5 v -1 h -5 v -1 h -5 v -1 h -5 v -1 h -5 v -1 h -5 v -1 h -5 v -1 h -5 v -1 h -5 v -1 h -5 v -1 h -5 v -1 h -5 v -1 h -5 v -1 h -5 v -1 h -6 v -1 h -7 v -1 h -7 v -1 h -6 v -1 h -7 v -1 h -6 v -1 h -7 v -1 h -7 v -1 h -6 v -1 h -7 v -1 h -8 v -1 h -10 v -1 h -10 v -1 h -9 v -1 h -10 v -1 h -10 v -1 h -10 v -1 h -15 v -1 h -21 v -1 h -20 v -1"
         style="fill:url(#linearGradient37);fill-opacity:1;fill-rule:nonzero;stroke:none"
         id="path39" /></g><path
       d="M 109.2793,122.9169 135.394,110.17"
       style="fill:#000080;stroke:#000080;stroke-width:0.75;stroke-linecap:butt;stroke-linejoin:miter;stroke-miterlimit:2.613;stroke-dasharray:none;stroke-opacity:1"
       id="path97" /><g
       id="g7538"><path
         d="m 109.1254,43.8089 c 0.4507,0.1301 0.8398,0.42 1.1699,0.868 0.3289,0.45 0.4937,0.8899 0.4937,1.3231 0,0.3168 -0.0726,0.5668 -0.2136,0.7519 -0.1442,0.184 -0.3633,0.3039 -0.6563,0.361 z m 0.382,3.3 c -0.207,-0.021 -0.3992,-0.0808 -0.575,-0.1761 -0.1762,-0.0957 -0.3434,-0.234 -0.5031,-0.4129 -0.2141,-0.2449 -0.3821,-0.5238 -0.5059,-0.8391 -0.1262,-0.3129 -0.1883,-0.614 -0.1883,-0.9051 0,-0.2796 0.0653,-0.5027 0.1973,-0.6668 0.1316,-0.1652 0.3308,-0.2718 0.6,-0.3242 z m -0.4442,-3.582 -0.4109,-1.6551 h -0.6699 l 0.4859,1.6719 c -0.4551,0.0754 -0.8101,0.2531 -1.0652,0.5332 -0.2547,0.2801 -0.3828,0.634 -0.3828,1.0602 0,0.5879 0.25,1.1058 0.748,1.5508 0.4988,0.4449 1.1078,0.6871 1.8289,0.723 l 0.4578,1.582 h 0.3082 l -0.382,-1.598 c 0.4871,-0.0469 0.8711,-0.2031 1.1531,-0.4668 0.2828,-0.2641 0.425,-0.6 0.425,-1.0051 0,-0.566 -0.2422,-1.084 -0.7242,-1.5551 -0.484,-0.4718 -1.0758,-0.7519 -1.7719,-0.841"
         style="fill:#231f20;fill-opacity:1;fill-rule:evenodd;stroke:none;stroke-width:0.1"
         id="path99" /><path
         d="m 121.9234,54.4589 c -2.8352,-1.7878 -6.316,-3.1339 -9.923,-3.7781 -4.5481,-0.8109 -9.2981,-0.489 -13.1731,0.8281"
         style="fill:none;stroke:#231f20;stroke-width:0.283;stroke-linecap:butt;stroke-linejoin:miter;stroke-miterlimit:2.613;stroke-dasharray:none;stroke-opacity:1"
         id="path101" /><path
         d="M 125.0062,56.4019 122.18,53.1531 c 0.0563,1.0148 -0.3847,1.7137 -1.3238,2.1 l 4.15,1.1488"
         style="fill:#231f20;fill-opacity:1;fill-rule:evenodd;stroke:none;stroke-width:0.1"
         id="path103" /></g><path
       d="M 171.9866,122.9169 H 109.2793 L 84.1824,97.7149"
       style="fill:none;stroke:#231f20;stroke-width:0.85;stroke-linecap:butt;stroke-linejoin:miter;stroke-miterlimit:2.613;stroke-dasharray:none;stroke-opacity:1"
       id="path105" /><path
       d="m 93.020649,110.17 h 42.484791 l 13.11215,12.637"
       style="fill:none;stroke:#231f20;stroke-width:0.236901;stroke-linecap:butt;stroke-linejoin:miter;stroke-miterlimit:2.613;stroke-dasharray:1.18506, 0.71126;stroke-dashoffset:0;stroke-opacity:1"
       id="path107" /><g
       id="g1173"
       transform="translate(16.5,-12)"><path
         d="m 127.8972,137.1089 h -0.7031 l 1.0832,3.64 c 0.1938,0.652 0.459,1.142 0.793,1.47 0.3347,0.327 0.7371,0.491 1.2051,0.491 0.4589,0 0.8262,-0.141 1.1002,-0.425 0.275,-0.284 0.412,-0.663 0.412,-1.137 0,-0.303 -0.061,-0.602 -0.185,-0.899 -0.124,-0.296 -0.297,-0.562 -0.521,-0.796 -0.199,-0.212 -0.4152,-0.37 -0.6516,-0.478 -0.2359,-0.108 -0.4828,-0.163 -0.7398,-0.163 -0.1969,0 -0.4012,0.025 -0.609,0.076 -0.2082,0.051 -0.4109,0.125 -0.6058,0.221 z m 1.1512,3.954 -0.4594,-1.571 c 0.1731,-0.151 0.3403,-0.26 0.5,-0.328 0.1582,-0.068 0.325,-0.102 0.5,-0.102 0.4184,0 0.7731,0.242 1.0653,0.723 0.2933,0.482 0.4393,1.066 0.4393,1.75 0,0.294 -0.07,0.525 -0.211,0.691 -0.1373,0.167 -0.3276,0.25 -0.5674,0.25 -0.2699,0 -0.5148,-0.121 -0.7328,-0.365 -0.2172,-0.243 -0.3942,-0.594 -0.534,-1.048"
         style="fill:#231f20;fill-opacity:1;fill-rule:evenodd;stroke:none;stroke-width:0.1"
         id="path111" /><path
         d="m 147.6276,139.1009 c 0.451,0.13 0.839,0.42 1.169,0.868 0.33,0.45 0.495,0.891 0.495,1.323 0,0.317 -0.073,0.568 -0.215,0.752 -0.145,0.184 -0.362,0.304 -0.655,0.361 z m 0.382,3.3 c -0.208,-0.021 -0.399,-0.08 -0.576,-0.176 -0.176,-0.096 -0.343,-0.234 -0.503,-0.413 -0.212,-0.245 -0.382,-0.524 -0.506,-0.839 -0.126,-0.313 -0.188,-0.615 -0.188,-0.904 0,-0.281 0.065,-0.504 0.197,-0.668 0.133,-0.164 0.331,-0.272 0.601,-0.324 z m -0.444,-3.581 -0.411,-1.656 h -0.671 l 0.487,1.672 c -0.456,0.075 -0.811,0.253 -1.065,0.533 -0.255,0.28 -0.383,0.633 -0.383,1.06 0,0.588 0.248,1.106 0.747,1.551 0.499,0.445 1.109,0.686 1.829,0.722 l 0.458,1.583 h 0.31 l -0.383,-1.598 c 0.486,-0.047 0.87,-0.203 1.153,-0.467 0.283,-0.264 0.423,-0.6 0.423,-1.006 0,-0.565 -0.24,-1.083 -0.723,-1.554 -0.484,-0.472 -1.075,-0.752 -1.771,-0.84"
         style="fill:#231f20;fill-opacity:1;fill-rule:evenodd;stroke:none;stroke-width:0.1"
         id="path113" /><path
         d="m 136.8626,142.6169 v -1.219 h -0.129 c -0.1,0.383 -0.226,0.643 -0.381,0.782 -0.155,0.137 -0.353,0.206 -0.591,0.206 -0.183,0 -0.331,-0.048 -0.442,-0.145 -0.112,-0.096 -0.167,-0.202 -0.167,-0.32 0,-0.145 0.041,-0.271 0.123,-0.375 0.082,-0.106 0.245,-0.22 0.493,-0.339 l 0.57,-0.278 c 0.529,-0.257 0.793,-0.597 0.793,-1.02 0,-0.325 -0.123,-0.587 -0.37,-0.786 -0.245,-0.199 -0.52,-0.299 -0.825,-0.299 -0.22,0 -0.47,0.039 -0.751,0.117 -0.085,0.026 -0.155,0.039 -0.211,0.039 -0.059,0 -0.105,-0.033 -0.14,-0.101 h -0.128 v 1.277 h 0.128 c 0.073,-0.364 0.213,-0.639 0.419,-0.824 0.205,-0.185 0.436,-0.277 0.691,-0.277 0.179,0 0.325,0.051 0.438,0.157 0.115,0.106 0.17,0.233 0.17,0.381 0,0.18 -0.062,0.331 -0.189,0.454 -0.125,0.122 -0.377,0.277 -0.756,0.465 -0.377,0.187 -0.624,0.356 -0.741,0.507 -0.117,0.149 -0.176,0.336 -0.176,0.562 0,0.295 0.102,0.541 0.303,0.739 0.201,0.197 0.462,0.297 0.782,0.297 0.142,0 0.313,-0.031 0.512,-0.091 0.134,-0.038 0.221,-0.058 0.265,-0.058 0.042,0 0.075,0.009 0.099,0.028 0.022,0.018 0.051,0.058 0.082,0.121 h 0.129"
         style="fill:#231f20;fill-opacity:1;fill-rule:evenodd;stroke:none;stroke-width:0.1"
         id="path115" /><path
         d="m 138.5736,144.4879 c 0.108,0 0.202,-0.039 0.279,-0.115 0.076,-0.077 0.114,-0.171 0.114,-0.28 0,-0.109 -0.038,-0.203 -0.114,-0.281 -0.077,-0.078 -0.171,-0.118 -0.279,-0.118 -0.11,0 -0.203,0.04 -0.282,0.118 -0.077,0.078 -0.118,0.172 -0.118,0.281 0,0.109 0.04,0.203 0.117,0.28 0.076,0.076 0.171,0.115 0.283,0.115 z m 0.324,-1.871 v -2.876 c 0,-0.224 0.016,-0.372 0.049,-0.446 0.031,-0.075 0.08,-0.13 0.144,-0.167 0.064,-0.036 0.18,-0.055 0.351,-0.055 v -0.14 h -1.739 v 0.14 c 0.175,0 0.292,0.018 0.35,0.052 0.061,0.034 0.109,0.089 0.143,0.168 0.036,0.078 0.054,0.227 0.054,0.448 v 1.38 c 0,0.388 -0.012,0.639 -0.035,0.753 -0.019,0.085 -0.048,0.142 -0.087,0.174 -0.038,0.033 -0.092,0.049 -0.161,0.049 -0.073,0 -0.161,-0.02 -0.264,-0.058 l -0.055,0.141 1.077,0.437 h 0.173"
         style="fill:#231f20;fill-opacity:1;fill-rule:evenodd;stroke:none;stroke-width:0.1"
         id="path117" /><path
         d="m 140.9286,141.8589 c 0.418,0.505 0.819,0.758 1.199,0.758 0.196,0 0.364,-0.049 0.504,-0.146 0.142,-0.098 0.253,-0.259 0.335,-0.483 0.059,-0.156 0.085,-0.396 0.085,-0.719 v -1.528 c 0,-0.225 0.02,-0.38 0.058,-0.46 0.027,-0.065 0.073,-0.116 0.138,-0.153 0.062,-0.036 0.181,-0.055 0.353,-0.055 v -0.14 h -1.77 v 0.14 h 0.075 c 0.166,0 0.284,0.027 0.349,0.078 0.067,0.05 0.113,0.125 0.138,0.224 0.011,0.038 0.017,0.161 0.017,0.366 v 1.466 c 0,0.325 -0.043,0.561 -0.127,0.709 -0.085,0.147 -0.229,0.22 -0.429,0.22 -0.308,0 -0.618,-0.169 -0.925,-0.508 v -1.887 c 0,-0.241 0.014,-0.391 0.042,-0.448 0.037,-0.076 0.087,-0.132 0.152,-0.166 0.063,-0.035 0.193,-0.054 0.387,-0.054 v -0.14 h -1.768 v 0.14 h 0.078 c 0.182,0 0.306,0.047 0.37,0.139 0.062,0.093 0.094,0.269 0.094,0.529 v 1.329 c 0,0.43 -0.009,0.691 -0.029,0.785 -0.019,0.094 -0.05,0.158 -0.089,0.191 -0.04,0.034 -0.095,0.051 -0.163,0.051 -0.073,0 -0.161,-0.02 -0.261,-0.058 l -0.06,0.141 1.08,0.437 h 0.167 v -0.758"
         style="fill:#231f20;fill-opacity:1;fill-rule:evenodd;stroke:none;stroke-width:0.1"
         id="path119" /></g><path
       d="m 114.6754,112.2499 h -0.7032 l 1.0828,3.64 c 0.1942,0.652 0.4602,1.142 0.7942,1.47 0.3347,0.328 0.7359,0.491 1.2031,0.491 0.4598,0 0.8258,-0.141 1.1008,-0.425 0.2742,-0.284 0.4121,-0.662 0.4121,-1.137 0,-0.303 -0.0609,-0.601 -0.1852,-0.899 -0.1238,-0.296 -0.2968,-0.562 -0.5207,-0.796 -0.1992,-0.212 -0.4152,-0.37 -0.6511,-0.478 -0.236,-0.108 -0.4828,-0.163 -0.7399,-0.163 -0.1972,0 -0.4012,0.025 -0.609,0.076 -0.2089,0.051 -0.4121,0.125 -0.6062,0.221 z m 1.1519,3.954 -0.4602,-1.571 c 0.1731,-0.151 0.3403,-0.26 0.4993,-0.328 0.159,-0.068 0.3257,-0.101 0.5,-0.101 0.4187,0 0.7746,0.241 1.0668,0.722 0.2922,0.482 0.4379,1.066 0.4379,1.75 0,0.294 -0.0707,0.525 -0.2098,0.692 -0.1391,0.166 -0.3281,0.249 -0.568,0.249 -0.2711,0 -0.516,-0.121 -0.7332,-0.365 -0.2168,-0.243 -0.3949,-0.594 -0.5328,-1.048"
       style="fill:#231f20;fill-opacity:1;fill-rule:evenodd;stroke:#0000ff;stroke-width:0.1;stroke-opacity:1"
       id="path121" /><path
       d="m 160.86,115.439 h 2.085 c 0.546,0 0.957,-0.118 1.227,-0.352 0.271,-0.236 0.406,-0.524 0.406,-0.862 0,-0.27 -0.087,-0.529 -0.258,-0.781 -0.173,-0.253 -0.427,-0.459 -0.766,-0.616 -0.338,-0.157 -0.704,-0.236 -1.097,-0.236 -0.245,0 -0.555,0.044 -0.934,0.133 l -0.422,-1.445 c -0.099,-0.344 -0.148,-0.57 -0.148,-0.68 0,-0.084 0.035,-0.152 0.105,-0.207 0.072,-0.055 0.24,-0.091 0.504,-0.106 l -0.039,-0.144 h -2.106 l 0.045,0.144 c 0.275,0 0.467,0.049 0.575,0.142 0.108,0.096 0.224,0.358 0.349,0.788 l 0.875,3.015 c 0.104,0.363 0.156,0.606 0.156,0.728 0,0.09 -0.035,0.165 -0.111,0.225 -0.075,0.06 -0.236,0.095 -0.491,0.111 z m 0.73,-2.469 c 0.293,-0.076 0.531,-0.113 0.711,-0.113 0.282,0 0.541,0.059 0.774,0.175 0.234,0.118 0.416,0.294 0.547,0.528 0.133,0.235 0.198,0.478 0.198,0.729 0,0.265 -0.081,0.473 -0.242,0.627 -0.163,0.153 -0.406,0.23 -0.735,0.23 -0.177,0 -0.392,-0.023 -0.645,-0.066 l -0.608,-2.11"
       style="fill:#000080;fill-opacity:1;fill-rule:evenodd;stroke:none;stroke-width:0.1"
       id="path308" /><path
       d="m 167.619,108.576 v -0.144 c -0.393,0.198 -0.721,0.429 -0.984,0.695 -0.374,0.378 -0.664,0.821 -0.866,1.337 -0.204,0.512 -0.305,1.043 -0.305,1.595 0,0.809 0.199,1.545 0.597,2.21 0.398,0.665 0.918,1.141 1.558,1.427 v -0.164 c -0.32,-0.177 -0.582,-0.418 -0.789,-0.727 -0.205,-0.305 -0.359,-0.695 -0.46,-1.166 -0.101,-0.47 -0.152,-0.966 -0.152,-1.476 0,-0.558 0.043,-1.065 0.128,-1.52 0.068,-0.361 0.151,-0.648 0.247,-0.866 0.096,-0.218 0.226,-0.426 0.388,-0.626 0.162,-0.203 0.376,-0.392 0.638,-0.575"
       style="fill:#000080;fill-opacity:1;fill-rule:evenodd;stroke:none;stroke-width:0.1"
       id="path310" /><path
       d="m 168.737,114.921 1.29,0.627 h 0.128 v -4.472 c 0,-0.296 0.012,-0.481 0.037,-0.556 0.025,-0.072 0.077,-0.127 0.154,-0.168 0.079,-0.038 0.237,-0.059 0.477,-0.065 v -0.144 h -1.993 v 0.144 c 0.251,0.006 0.412,0.026 0.485,0.065 0.072,0.037 0.123,0.087 0.152,0.153 0.028,0.063 0.043,0.254 0.043,0.571 v 2.86 c 0,0.385 -0.013,0.632 -0.039,0.741 -0.018,0.084 -0.052,0.146 -0.1,0.184 -0.048,0.039 -0.105,0.06 -0.173,0.06 -0.096,0 -0.231,-0.041 -0.402,-0.123 l -0.059,0.123"
       style="fill:#000080;fill-opacity:1;fill-rule:evenodd;stroke:none;stroke-width:0.1"
       id="path312" /><path
       d="m 172.229,108.811 v 0.171 c 0.268,0.089 0.476,0.225 0.624,0.413 0.146,0.185 0.22,0.384 0.22,0.592 0,0.049 -0.012,0.09 -0.035,0.125 -0.019,0.023 -0.037,0.034 -0.054,0.034 -0.03,0 -0.093,-0.026 -0.188,-0.078 -0.047,-0.022 -0.097,-0.036 -0.149,-0.036 -0.128,0 -0.229,0.039 -0.305,0.114 -0.075,0.077 -0.113,0.181 -0.113,0.314 0,0.128 0.049,0.236 0.146,0.327 0.097,0.092 0.218,0.136 0.359,0.136 0.17,0 0.324,-0.075 0.458,-0.225 0.134,-0.15 0.201,-0.347 0.201,-0.594 0,-0.267 -0.094,-0.516 -0.279,-0.749 -0.187,-0.23 -0.481,-0.411 -0.885,-0.544"
       style="fill:#000080;fill-opacity:1;fill-rule:evenodd;stroke:none;stroke-width:0.1"
       id="path314" /><path
       d="m 179.467,111.163 -0.37,-1.02 h -3.126 v 0.143 c 0.919,0.839 1.567,1.525 1.942,2.055 0.375,0.532 0.562,1.016 0.562,1.457 0,0.336 -0.101,0.611 -0.308,0.829 -0.205,0.214 -0.451,0.323 -0.738,0.323 -0.262,0 -0.495,-0.077 -0.702,-0.229 -0.206,-0.151 -0.359,-0.375 -0.458,-0.669 h -0.145 c 0.065,0.482 0.231,0.852 0.502,1.109 0.269,0.26 0.605,0.387 1.009,0.387 0.43,0 0.789,-0.139 1.077,-0.414 0.287,-0.275 0.431,-0.602 0.431,-0.977 0,-0.266 -0.062,-0.537 -0.187,-0.805 -0.193,-0.42 -0.506,-0.868 -0.938,-1.339 -0.648,-0.708 -1.052,-1.134 -1.215,-1.281 h 1.383 c 0.281,0 0.479,0.011 0.592,0.032 0.113,0.02 0.217,0.063 0.307,0.127 0.09,0.064 0.171,0.155 0.238,0.272 h 0.144"
       style="fill:#000080;fill-opacity:1;fill-rule:evenodd;stroke:none;stroke-width:0.1"
       id="path316" /><path
       d="m 180.229,108.811 v 0.171 c 0.268,0.089 0.477,0.225 0.624,0.413 0.146,0.185 0.22,0.384 0.22,0.592 0,0.049 -0.012,0.09 -0.035,0.125 -0.019,0.023 -0.037,0.034 -0.055,0.034 -0.029,0 -0.092,-0.026 -0.187,-0.078 -0.047,-0.022 -0.096,-0.036 -0.149,-0.036 -0.128,0 -0.228,0.039 -0.305,0.114 -0.075,0.077 -0.113,0.181 -0.113,0.314 0,0.128 0.049,0.236 0.147,0.327 0.096,0.092 0.217,0.136 0.357,0.136 0.172,0 0.325,-0.075 0.459,-0.225 0.135,-0.15 0.201,-0.347 0.201,-0.594 0,-0.267 -0.094,-0.516 -0.279,-0.749 -0.187,-0.23 -0.481,-0.411 -0.885,-0.544"
       style="fill:#000080;fill-opacity:1;fill-rule:evenodd;stroke:none;stroke-width:0.1"
       id="path318" /><path
       d="m 184.206,114.432 c 0.151,0.356 0.342,0.632 0.572,0.825 0.231,0.195 0.518,0.291 0.861,0.291 0.424,0 0.75,-0.138 0.977,-0.413 0.172,-0.206 0.258,-0.425 0.258,-0.662 0,-0.384 -0.242,-0.784 -0.727,-1.193 0.326,-0.128 0.571,-0.311 0.738,-0.548 0.166,-0.236 0.25,-0.515 0.25,-0.836 0,-0.457 -0.144,-0.855 -0.437,-1.191 -0.379,-0.437 -0.931,-0.657 -1.651,-0.657 -0.358,0 -0.601,0.045 -0.73,0.132 -0.128,0.091 -0.193,0.184 -0.193,0.287 0,0.077 0.031,0.142 0.092,0.201 0.062,0.055 0.134,0.085 0.221,0.085 0.064,0 0.13,-0.012 0.198,-0.032 0.044,-0.014 0.145,-0.061 0.302,-0.142 0.156,-0.083 0.265,-0.131 0.324,-0.147 0.096,-0.029 0.199,-0.043 0.308,-0.043 0.266,0 0.498,0.103 0.693,0.307 0.198,0.207 0.295,0.45 0.295,0.732 0,0.204 -0.046,0.408 -0.135,0.601 -0.069,0.144 -0.144,0.256 -0.224,0.332 -0.111,0.103 -0.265,0.199 -0.461,0.283 -0.195,0.085 -0.395,0.127 -0.598,0.127 h -0.125 v 0.118 c 0.205,0.025 0.412,0.1 0.619,0.223 0.208,0.12 0.358,0.27 0.452,0.441 0.093,0.172 0.14,0.36 0.14,0.565 0,0.27 -0.084,0.486 -0.252,0.651 -0.168,0.166 -0.376,0.248 -0.627,0.248 -0.404,0 -0.74,-0.216 -1.011,-0.648 l -0.129,0.063"
       style="fill:#000080;fill-opacity:1;fill-rule:evenodd;stroke:none;stroke-width:0.1"
       id="path320" /><path
       d="m 187.979,115.532 v 0.164 c 0.397,-0.192 0.727,-0.425 0.988,-0.691 0.373,-0.38 0.661,-0.825 0.864,-1.336 0.203,-0.514 0.304,-1.046 0.304,-1.601 0,-0.807 -0.198,-1.543 -0.595,-2.208 -0.398,-0.665 -0.918,-1.142 -1.561,-1.428 v 0.144 c 0.32,0.181 0.584,0.422 0.791,0.729 0.206,0.306 0.362,0.695 0.461,1.168 0.1,0.472 0.151,0.966 0.151,1.478 0,0.554 -0.043,1.06 -0.128,1.519 -0.067,0.36 -0.148,0.647 -0.246,0.864 -0.097,0.216 -0.226,0.423 -0.388,0.625 -0.162,0.201 -0.375,0.392 -0.641,0.573"
       style="fill:#000080;fill-opacity:1;fill-rule:evenodd;stroke:none;stroke-width:0.1"
       id="path322" /><path
       d="m 177.311,120.1719 c 0.088,-0.1507 0.15,-0.2918 0.184,-0.4218 0.035,-0.1332 0.067,-0.3922 0.102,-0.777 l 0.172,-1.9211 c 0.157,0.186 0.382,0.484 0.68,0.891 0.143,0.1969 0.32,0.466 0.53,0.8078 0.128,0.2082 0.206,0.3543 0.236,0.4372 0.014,0.041 0.023,0.0851 0.023,0.1289 0,0.0281 -0.009,0.0519 -0.028,0.0711 -0.019,0.0171 -0.065,0.0378 -0.143,0.064 -0.077,0.0238 -0.141,0.0711 -0.192,0.136 -0.05,0.066 -0.076,0.1429 -0.076,0.2289 0,0.107 0.032,0.1921 0.095,0.257 0.061,0.066 0.14,0.098 0.233,0.098 0.115,0 0.213,-0.0461 0.295,-0.1429 0.081,-0.095 0.121,-0.225 0.121,-0.3918 0,-0.2051 -0.072,-0.441 -0.212,-0.7051 -0.141,-0.2641 -0.412,-0.6691 -0.813,-1.216 -0.4,-0.5481 -0.886,-1.1442 -1.456,-1.7891 -0.393,-0.4461 -0.685,-0.7269 -0.876,-0.843 -0.189,-0.1152 -0.352,-0.173 -0.488,-0.173 -0.08,0 -0.152,0.0301 -0.212,0.0922 -0.062,0.0609 -0.092,0.1316 -0.092,0.2129 0,0.1008 0.041,0.1929 0.127,0.2769 0.084,0.0828 0.176,0.1239 0.274,0.1239 0.052,0 0.096,-0.01 0.131,-0.034 0.021,-0.0141 0.043,-0.0508 0.067,-0.1117 0.025,-0.0602 0.048,-0.1024 0.069,-0.1231 0.012,-0.0133 0.029,-0.018 0.047,-0.018 0.014,0 0.042,0.011 0.081,0.0379 0.144,0.0891 0.311,0.2289 0.5,0.4219 0.251,0.2551 0.435,0.4633 0.555,0.625 l -0.219,2.475 c -0.036,0.4102 -0.091,0.659 -0.163,0.7473 -0.074,0.0879 -0.196,0.134 -0.368,0.134 -0.054,0 -0.152,-0.009 -0.293,-0.0231 l -0.035,0.143 1.144,0.2808"
       style="display:inline;fill:#000080;fill-opacity:1;fill-rule:evenodd;stroke:none;stroke-width:0.1"
       id="path344-3" /><path
       d="m 184.492,119.573 h 2.48 v -0.096 l -2.703,-2.813 h 1.144 c 0.27,0 0.442,0.009 0.517,0.032 0.072,0.021 0.139,0.065 0.2,0.132 0.061,0.067 0.129,0.19 0.205,0.368 h 0.144 l -0.34,-1.062 h -2.542 v 0.112 l 2.702,2.811 h -1.124 c -0.237,0 -0.381,-0.006 -0.43,-0.018 -0.072,-0.016 -0.146,-0.057 -0.216,-0.123 -0.072,-0.066 -0.146,-0.177 -0.222,-0.33 h -0.147 l 0.332,0.987"
       style="display:inline;fill:#000080;fill-opacity:1;fill-rule:evenodd;stroke:none;stroke-width:0.1"
       id="path346-6" /><path
       d="m 169.8319,119.739 c 0.127,-0.1347 0.2231,-0.2699 0.2891,-0.4051 0.0461,-0.0949 0.123,-0.3398 0.2309,-0.7378 l 0.3429,0.5152 c 0.091,0.1238 0.2012,0.2437 0.3321,0.3578 0.1289,0.1129 0.2441,0.1898 0.3441,0.2309 0.0621,0.0273 0.1309,0.039 0.207,0.039 0.1117,0 0.2,-0.0289 0.266,-0.089 0.0668,-0.0598 0.1,-0.1329 0.1,-0.218 0,-0.1 -0.0199,-0.1668 -0.0582,-0.2039 -0.0738,-0.0649 -0.1558,-0.0981 -0.25,-0.0981 -0.0539,0 -0.1128,0.0121 -0.1757,0.036 -0.1219,0.041 -0.2051,0.0621 -0.2461,0.0621 -0.0629,0 -0.136,-0.0371 -0.2231,-0.109 -0.1601,-0.1359 -0.3527,-0.3961 -0.5769,-0.7852 l 0.3199,-1.3437 c 0.0488,-0.2063 0.0898,-0.3289 0.125,-0.3691 0.034,-0.0411 0.0672,-0.061 0.1012,-0.061 0.0558,0 0.1199,0.0301 0.191,0.0899 0.1437,0.1203 0.2648,0.2761 0.3687,0.4691 l 0.1352,-0.0711 c -0.1641,-0.3078 -0.3723,-0.5617 -0.6262,-0.7648 -0.1418,-0.1153 -0.2617,-0.1719 -0.3617,-0.1719 -0.1461,0 -0.2613,0.0816 -0.3481,0.2449 -0.055,0.102 -0.1679,0.5399 -0.3402,1.3141 -0.4051,-0.7071 -0.7301,-1.1602 -0.9758,-1.3633 -0.159,-0.1309 -0.3121,-0.1957 -0.4609,-0.1957 -0.1051,0 -0.1992,0.0367 -0.2859,0.1148 -0.0614,0.0559 -0.0922,0.1321 -0.0922,0.2289 0,0.0852 0.0281,0.1571 0.0859,0.2153 0.0563,0.057 0.1262,0.0847 0.2102,0.0847 0.0828,0 0.1718,-0.041 0.266,-0.125 0.0679,-0.0597 0.1199,-0.0898 0.1558,-0.0898 0.0328,0 0.0731,0.0219 0.1211,0.0629 0.1231,0.0988 0.2891,0.3121 0.5,0.6398 0.211,0.3282 0.35,0.566 0.4149,0.7121 -0.1629,0.6321 -0.25,0.9672 -0.2629,1.0032 -0.0602,0.1687 -0.1371,0.289 -0.2352,0.3597 -0.0961,0.0711 -0.2359,0.1051 -0.4238,0.1051 -0.0602,0 -0.1301,-0.003 -0.207,-0.008 v 0.1418 l 1.0429,0.182"
       style="display:inline;fill:#000080;fill-opacity:1;fill-rule:evenodd;stroke:none;stroke-width:0.1"
       id="path348-2" /><g
       id="g1885"
       transform="translate(0,-1.5)"
       style="fill:#008000"><path
         d="m 177.1953,97.741542 c 0.4507,0.1301 0.8398,0.42 1.1699,0.868 0.3289,0.45 0.4937,0.8899 0.4937,1.3231 0,0.316798 -0.0726,0.566798 -0.2136,0.751898 -0.1442,0.184 -0.3633,0.3039 -0.6563,0.361 z m 0.382,3.299998 c -0.207,-0.021 -0.3992,-0.0808 -0.575,-0.1761 -0.1762,-0.0957 -0.3434,-0.234 -0.5031,-0.4129 -0.2141,-0.2449 -0.3821,-0.523798 -0.5059,-0.839098 -0.1262,-0.3129 -0.1883,-0.614 -0.1883,-0.9051 0,-0.2796 0.0653,-0.5027 0.1973,-0.6668 0.1316,-0.1652 0.3308,-0.2718 0.6,-0.3242 z m -0.4442,-3.581998 -0.4109,-1.6551 h -0.6699 l 0.4859,1.6719 c -0.4551,0.0754 -0.8101,0.2531 -1.0652,0.5332 -0.2547,0.2801 -0.3828,0.634 -0.3828,1.0602 0,0.5879 0.25,1.105798 0.748,1.550798 0.4988,0.4449 1.1078,0.6871 1.8289,0.723 l 0.4578,1.582 h 0.3082 l -0.382,-1.598 c 0.4871,-0.0469 0.8711,-0.2031 1.1531,-0.4668 0.2828,-0.2641 0.425,-0.6 0.425,-1.005098 0,-0.566 -0.2422,-1.084 -0.7242,-1.5551 -0.484,-0.4718 -1.0758,-0.7519 -1.7719,-0.841"
         style="display:inline;fill:#008000;fill-opacity:1;fill-rule:evenodd;stroke:none;stroke-width:0.1"
         id="path99-0" /><path
         d="m 167.86207,96.386002 h -0.7032 l 1.0828,3.639998 c 0.1942,0.652 0.4602,1.142 0.7942,1.47 0.3347,0.328 0.7359,0.491 1.2031,0.491 0.4598,0 0.8258,-0.141 1.1008,-0.425 0.2742,-0.284 0.4121,-0.662 0.4121,-1.137 0,-0.303 -0.0609,-0.600998 -0.1852,-0.898998 -0.1238,-0.296 -0.2968,-0.562 -0.5207,-0.796 -0.1992,-0.212 -0.4152,-0.37 -0.6511,-0.478 -0.236,-0.108 -0.4828,-0.163 -0.7399,-0.163 -0.1972,0 -0.4012,0.025 -0.609,0.076 -0.2089,0.051 -0.4121,0.125 -0.6062,0.221 z m 1.1519,3.953998 -0.4602,-1.570998 c 0.1731,-0.151 0.3403,-0.26 0.4993,-0.328 0.159,-0.068 0.3257,-0.101 0.5,-0.101 0.4187,0 0.7746,0.241 1.0668,0.722 0.2922,0.482 0.4379,1.065998 0.4379,1.749998 0,0.294 -0.0707,0.525 -0.2098,0.692 -0.1391,0.166 -0.3281,0.249 -0.568,0.249 -0.2711,0 -0.516,-0.121 -0.7332,-0.365 -0.2168,-0.243 -0.3949,-0.594 -0.5328,-1.048"
         style="display:inline;fill:#008000;fill-opacity:1;fill-rule:evenodd;stroke:none;stroke-width:0.1"
         id="path121-3" /><path
         d="m 185.499,107.028 h 2.48 v -0.096 l -2.703,-2.813 h 1.144 c 0.27,0 0.442,0.009 0.517,0.032 0.072,0.021 0.139,0.065 0.2,0.132 0.061,0.067 0.129,0.19 0.205,0.368 h 0.144 l -0.34,-1.062 h -2.542 v 0.112 l 2.702,2.811 h -1.124 c -0.237,0 -0.381,-0.006 -0.43,-0.018 -0.072,-0.016 -0.146,-0.057 -0.216,-0.123 -0.072,-0.066 -0.146,-0.177 -0.222,-0.33 h -0.147 l 0.332,0.987"
         style="display:inline;fill:#008000;fill-opacity:1;fill-rule:evenodd;stroke:none;stroke-width:0.1"
         id="path346-6-7" /><path
         d="m 161.34851,102.38815 h 2.085 c 0.546,0 0.957,-0.118 1.227,-0.352 0.271,-0.236 0.406,-0.524 0.406,-0.862 0,-0.27 -0.087,-0.529 -0.258,-0.781 -0.173,-0.253 -0.427,-0.459 -0.766,-0.616 -0.338,-0.157 -0.704,-0.236 -1.097,-0.236 -0.245,0 -0.555,0.044 -0.934,0.133 l -0.422,-1.445 c -0.099,-0.344 -0.148,-0.57 -0.148,-0.68 0,-0.084 0.035,-0.152 0.105,-0.207 0.072,-0.055 0.24,-0.091 0.504,-0.106 l -0.039,-0.144 h -2.106 l 0.045,0.144 c 0.275,0 0.467,0.049 0.575,0.142 0.108,0.096 0.224,0.358 0.349,0.788 l 0.875,3.015 c 0.104,0.363 0.156,0.606 0.156,0.728 0,0.09 -0.035,0.165 -0.111,0.225 -0.075,0.06 -0.236,0.095 -0.491,0.111 z m 0.73,-2.469 c 0.293,-0.076 0.531,-0.113 0.711,-0.113 0.282,0 0.541,0.059 0.774,0.175 0.234,0.118 0.416,0.294 0.547,0.528 0.133,0.235 0.198,0.478 0.198,0.729 0,0.265 -0.081,0.473 -0.242,0.627 -0.163,0.153 -0.406,0.23 -0.735,0.23 -0.177,0 -0.392,-0.023 -0.645,-0.066 l -0.608,-2.11"
         style="fill:#008000;fill-opacity:1;fill-rule:evenodd;stroke:none;stroke-width:0.1"
         id="path308-0" /><path
         d="m 168.10751,95.52515 v -0.144 c -0.393,0.198 -0.721,0.429 -0.984,0.695 -0.374,0.378 -0.664,0.821 -0.866,1.337 -0.204,0.512 -0.305,1.043 -0.305,1.595 0,0.809 0.199,1.545 0.597,2.21 0.398,0.665 0.918,1.141 1.558,1.427 v -0.164 c -0.32,-0.177 -0.582,-0.418 -0.789,-0.727 -0.205,-0.305 -0.359,-0.695 -0.46,-1.166 -0.101,-0.47 -0.152,-0.966 -0.152,-1.476 0,-0.558 0.043,-1.065 0.128,-1.52 0.068,-0.361 0.151,-0.648 0.247,-0.866 0.096,-0.218 0.226,-0.426 0.388,-0.626 0.162,-0.203 0.376,-0.392 0.638,-0.575"
         style="fill:#008000;fill-opacity:1;fill-rule:evenodd;stroke:none;stroke-width:0.1"
         id="path310-1" /><path
         d="m 172.71751,95.76015 v 0.171 c 0.268,0.089 0.476,0.225 0.624,0.413 0.146,0.185 0.22,0.384 0.22,0.592 0,0.049 -0.012,0.09 -0.035,0.125 -0.019,0.023 -0.037,0.034 -0.054,0.034 -0.03,0 -0.093,-0.026 -0.188,-0.078 -0.047,-0.022 -0.097,-0.036 -0.149,-0.036 -0.128,0 -0.229,0.039 -0.305,0.114 -0.075,0.077 -0.113,0.181 -0.113,0.314 0,0.128 0.049,0.236 0.146,0.327 0.097,0.092 0.218,0.136 0.359,0.136 0.17,0 0.324,-0.075 0.458,-0.225 0.134,-0.15 0.201,-0.347 0.201,-0.594 0,-0.267 -0.094,-0.516 -0.279,-0.749 -0.187,-0.23 -0.481,-0.411 -0.885,-0.544"
         style="fill:#008000;fill-opacity:1;fill-rule:evenodd;stroke:none;stroke-width:0.1"
         id="path314-2" /><path
         d="m 180.71751,95.76015 v 0.171 c 0.268,0.089 0.477,0.225 0.624,0.413 0.146,0.185 0.22,0.384 0.22,0.592 0,0.049 -0.012,0.09 -0.035,0.125 -0.019,0.023 -0.037,0.034 -0.055,0.034 -0.029,0 -0.092,-0.026 -0.187,-0.078 -0.047,-0.022 -0.096,-0.036 -0.149,-0.036 -0.128,0 -0.228,0.039 -0.305,0.114 -0.075,0.077 -0.113,0.181 -0.113,0.314 0,0.128 0.049,0.236 0.147,0.327 0.096,0.092 0.217,0.136 0.357,0.136 0.172,0 0.325,-0.075 0.459,-0.225 0.135,-0.15 0.201,-0.347 0.201,-0.594 0,-0.267 -0.094,-0.516 -0.279,-0.749 -0.187,-0.23 -0.481,-0.411 -0.885,-0.544"
         style="fill:#008000;fill-opacity:1;fill-rule:evenodd;stroke:none;stroke-width:0.1"
         id="path318-1" /><path
         d="m 184.69451,101.38115 c 0.151,0.356 0.342,0.632 0.572,0.825 0.231,0.195 0.518,0.291 0.861,0.291 0.424,0 0.75,-0.138 0.977,-0.413 0.172,-0.206 0.258,-0.425 0.258,-0.662 0,-0.384 -0.242,-0.784 -0.727,-1.193 0.326,-0.128 0.571,-0.311 0.738,-0.548 0.166,-0.236 0.25,-0.515 0.25,-0.836 0,-0.457 -0.144,-0.855 -0.437,-1.191 -0.379,-0.437 -0.931,-0.657 -1.651,-0.657 -0.358,0 -0.601,0.045 -0.73,0.132 -0.128,0.091 -0.193,0.184 -0.193,0.287 0,0.077 0.031,0.142 0.092,0.201 0.062,0.055 0.134,0.085 0.221,0.085 0.064,0 0.13,-0.012 0.198,-0.032 0.044,-0.014 0.145,-0.061 0.302,-0.142 0.156,-0.083 0.265,-0.131 0.324,-0.147 0.096,-0.029 0.199,-0.043 0.308,-0.043 0.266,0 0.498,0.103 0.693,0.307 0.198,0.207 0.295,0.45 0.295,0.732 0,0.204 -0.046,0.408 -0.135,0.601 -0.069,0.144 -0.144,0.256 -0.224,0.332 -0.111,0.103 -0.265,0.199 -0.461,0.283 -0.195,0.085 -0.395,0.127 -0.598,0.127 h -0.125 v 0.118 c 0.205,0.025 0.412,0.1 0.619,0.223 0.208,0.12 0.358,0.27 0.452,0.441 0.093,0.172 0.14,0.36 0.14,0.565 0,0.27 -0.084,0.486 -0.252,0.651 -0.168,0.166 -0.376,0.248 -0.627,0.248 -0.404,0 -0.74,-0.216 -1.011,-0.648 l -0.129,0.063"
         style="fill:#008000;fill-opacity:1;fill-rule:evenodd;stroke:none;stroke-width:0.1"
         id="path320-0" /><path
         d="m 188.46751,102.48115 v 0.164 c 0.397,-0.192 0.727,-0.425 0.988,-0.691 0.373,-0.38 0.661,-0.825 0.864,-1.336 0.203,-0.514 0.304,-1.046 0.304,-1.601 0,-0.807 -0.198,-1.543 -0.595,-2.208 -0.398,-0.665 -0.918,-1.142 -1.561,-1.428 v 0.144 c 0.32,0.181 0.584,0.422 0.791,0.729 0.206,0.306 0.362,0.695 0.461,1.168 0.1,0.472 0.151,0.966 0.151,1.478 0,0.554 -0.043,1.06 -0.128,1.519 -0.067,0.36 -0.148,0.647 -0.246,0.864 -0.097,0.216 -0.226,0.423 -0.388,0.625 -0.162,0.201 -0.375,0.392 -0.641,0.573"
         style="fill:#008000;fill-opacity:1;fill-rule:evenodd;stroke:none;stroke-width:0.1"
         id="path322-1" /></g><path
       d="m 135.82096,111.3381 c 0.3875,0 0.7035,-0.316 0.7035,-0.7035 0,-0.3875 -0.316,-0.7035 -0.7035,-0.7035 -0.387,0 -0.703,0.316 -0.703,0.7035 0,0.3875 0.316,0.7035 0.703,0.7035"
       style="fill:#ff0000;fill-opacity:1;fill-rule:evenodd;stroke:#ff0000;stroke-width:0.05;stroke-opacity:1"
       id="path225-0" /><path
       d="m 135.82096,111.3381 c 0.3875,0 0.7035,-0.316 0.7035,-0.7035 0,-0.3875 -0.316,-0.7035 -0.7035,-0.7035 -0.387,0 -0.703,0.316 -0.703,0.7035 0,0.3875 0.316,0.7035 0.703,0.7035 z"
       style="fill:#ff0000;stroke:#ff0000;stroke-width:0.2835;stroke-linecap:butt;stroke-linejoin:miter;stroke-miterlimit:2.613;stroke-dasharray:none;stroke-opacity:1"
       id="path227-4" /><path
       d="m 136.01996,110.5136 12.417,-7.202"
       style="fill:#ff0000;stroke:#ff0000;stroke-width:0.567;stroke-linecap:butt;stroke-linejoin:miter;stroke-miterlimit:2.613;stroke-dasharray:none;stroke-opacity:1"
       id="path243-8" /><path
       d="m 150.57396,102.0721 -2.2605,2.4125 c 0.073,-0.7765 -0.2465,-1.326 -0.956,-1.6485 l 3.2165,-0.764"
       style="fill:#ff0000;fill-opacity:1;fill-rule:evenodd;stroke:#ff0000;stroke-width:0.05;stroke-opacity:1"
       id="path245-4" /><path
       d="m 135.88696,110.6851 12.4465,7.1535"
       style="fill:#ff0000;stroke:#ff0000;stroke-width:0.567;stroke-linecap:butt;stroke-linejoin:miter;stroke-miterlimit:2.613;stroke-dasharray:none;stroke-opacity:1"
       id="path247-3" /><path
       d="m 150.47146,119.0666 -3.2135,-0.7495 c 0.707,-0.3245 1.0235,-0.8745 0.9475,-1.649 l 2.266,2.3985"
       style="fill:#ff0000;fill-opacity:1;fill-rule:evenodd;stroke:#ff0000;stroke-width:0.05;stroke-opacity:1"
       id="path249-4" /><path
       d="m 135.89996,110.6011 0.0635,15.547"
       style="fill:#ff0000;stroke:#ff0000;stroke-width:0.567;stroke-linecap:butt;stroke-linejoin:miter;stroke-miterlimit:2.613;stroke-dasharray:none;stroke-opacity:1"
       id="path251-7" /><path
       d="m 135.97396,128.6241 -0.9685,-3.169 c 0.6385,0.4505 1.276,0.448 1.9105,-0.008 l -0.942,3.1765"
       style="fill:#ff0000;fill-opacity:1;fill-rule:evenodd;stroke:#ff0000;stroke-width:0.05;stroke-opacity:1"
       id="path253-5" /><g
       id="g8897"
       transform="matrix(1.5,0,0,1.5,-72.52648,-51.419425)"><path
         d="m 147.39546,100.0346 c -0.2225,-0.1965 -0.422,-0.2945 -0.6,-0.2945 -0.104,0 -0.1905,0.034 -0.2585,0.1025 -0.0695,0.068 -0.1035,0.154 -0.1035,0.257 0,0.139 0.0595,0.2645 0.1795,0.3755 0.1195,0.1115 0.3805,0.2595 0.7825,0.444 v 0.184 c 0,0.138 -0.007,0.225 -0.0225,0.261 -0.0145,0.036 -0.043,0.067 -0.084,0.094 -0.0425,0.0265 -0.089,0.04 -0.1415,0.04 -0.0845,0 -0.154,-0.0195 -0.209,-0.057 -0.033,-0.023 -0.0505,-0.0505 -0.0505,-0.082 0,-0.027 0.019,-0.061 0.0545,-0.102 0.0495,-0.0555 0.075,-0.1095 0.075,-0.162 0,-0.064 -0.024,-0.118 -0.072,-0.163 -0.048,-0.045 -0.11,-0.0675 -0.186,-0.0675 -0.082,0 -0.151,0.0255 -0.206,0.0745 -0.056,0.0495 -0.0835,0.1075 -0.0835,0.1735 0,0.094 0.037,0.1835 0.111,0.269 0.075,0.085 0.1785,0.1505 0.311,0.1965 0.1325,0.045 0.271,0.068 0.414,0.068 0.173,0 0.31,-0.037 0.4115,-0.11 0.1,-0.074 0.1655,-0.1535 0.196,-0.2395 0.0185,-0.0545 0.027,-0.1805 0.027,-0.3775 v -0.7085 c 0,-0.0835 0.003,-0.136 0.0105,-0.1575 0.006,-0.021 0.015,-0.037 0.0285,-0.048 0.0135,-0.0095 0.028,-0.015 0.045,-0.015 0.0345,0 0.069,0.024 0.1035,0.072 l 0.0585,-0.0465 c -0.0645,-0.097 -0.132,-0.167 -0.2025,-0.2105 -0.069,-0.043 -0.1485,-0.065 -0.2365,-0.065 -0.1045,0 -0.186,0.0245 -0.2445,0.0735 -0.059,0.0485 -0.0945,0.1225 -0.1075,0.221 z m 0,0.143 v 0.611 c -0.1565,-0.0925 -0.274,-0.1915 -0.351,-0.2965 -0.051,-0.071 -0.0765,-0.1415 -0.0765,-0.2125 0,-0.0605 0.0215,-0.113 0.065,-0.159 0.032,-0.035 0.0775,-0.0525 0.136,-0.0525 0.0655,0 0.141,0.0365 0.2265,0.1095"
         style="fill:#ff0000;fill-opacity:1;fill-rule:evenodd;stroke:#ff0000;stroke-width:0.05;stroke-opacity:1"
         id="path269-1" /><path
         d="m 148.21346,98.0316 h -0.263 l 0.4055,1.365 c 0.0735,0.2445 0.1725,0.428 0.298,0.551 0.126,0.123 0.2765,0.1845 0.4515,0.1845 0.172,0 0.3095,-0.053 0.4125,-0.1595 0.1035,-0.1065 0.1545,-0.2485 0.1545,-0.4265 0,-0.1135 -0.023,-0.2255 -0.0695,-0.337 -0.046,-0.111 -0.111,-0.211 -0.195,-0.2985 -0.075,-0.0795 -0.156,-0.139 -0.244,-0.1795 -0.0885,-0.0405 -0.1815,-0.061 -0.2775,-0.061 -0.0745,0 -0.151,0.0095 -0.2285,0.0285 -0.078,0.019 -0.1545,0.047 -0.227,0.083 z m 0.432,1.4825 -0.172,-0.589 c 0.065,-0.0565 0.1275,-0.0975 0.1875,-0.123 0.0595,-0.0255 0.122,-0.038 0.1875,-0.038 0.1565,0 0.2905,0.0905 0.3995,0.271 0.1095,0.1805 0.1645,0.3995 0.1645,0.656 0,0.1105 -0.026,0.197 -0.079,0.2595 -0.0515,0.0625 -0.123,0.093 -0.2125,0.093 -0.102,0 -0.1935,-0.045 -0.275,-0.1365 -0.0815,-0.091 -0.148,-0.2225 -0.2005,-0.393"
         style="fill:#ff0000;fill-opacity:1;fill-rule:evenodd;stroke:#ff0000;stroke-width:0.05;stroke-opacity:1"
         id="path271-1" /></g><g
       id="g8893"
       transform="matrix(1.5,0,0,1.5,-69.822605,-55.5083)"><path
         d="m 147.86846,114.2021 c -0.2235,-0.1965 -0.4235,-0.2945 -0.6005,-0.2945 -0.104,0 -0.19,0.034 -0.2595,0.1025 -0.069,0.068 -0.103,0.154 -0.103,0.257 0,0.139 0.059,0.2645 0.179,0.3755 0.1205,0.1115 0.3805,0.2595 0.784,0.4445 v 0.1835 c 0,0.1385 -0.008,0.225 -0.023,0.261 -0.015,0.036 -0.043,0.067 -0.0845,0.094 -0.042,0.0265 -0.089,0.04 -0.1405,0.04 -0.085,0 -0.1555,-0.0195 -0.2095,-0.0565 -0.034,-0.0235 -0.051,-0.051 -0.051,-0.0825 0,-0.027 0.0185,-0.061 0.0545,-0.1015 0.0495,-0.056 0.075,-0.11 0.075,-0.162 0,-0.0645 -0.0245,-0.1185 -0.0715,-0.1635 -0.0475,-0.045 -0.1095,-0.0675 -0.187,-0.0675 -0.0815,0 -0.1505,0.0255 -0.2055,0.0745 -0.055,0.0495 -0.0835,0.1075 -0.0835,0.1735 0,0.094 0.037,0.1835 0.1115,0.269 0.0745,0.085 0.1775,0.1505 0.311,0.1965 0.1325,0.045 0.2705,0.068 0.4135,0.068 0.1735,0 0.31,-0.037 0.411,-0.11 0.101,-0.074 0.166,-0.1535 0.1965,-0.2395 0.0185,-0.0545 0.0275,-0.1805 0.0275,-0.377 v -0.709 c 0,-0.083 0.003,-0.136 0.01,-0.157 0.007,-0.0215 0.016,-0.0375 0.03,-0.048 0.012,-0.01 0.0275,-0.0155 0.0445,-0.0155 0.034,0 0.068,0.024 0.104,0.072 l 0.058,-0.0465 c -0.0645,-0.097 -0.1325,-0.167 -0.2025,-0.21 -0.069,-0.0435 -0.148,-0.0655 -0.237,-0.0655 -0.104,0 -0.185,0.0245 -0.244,0.0735 -0.059,0.0485 -0.095,0.1225 -0.107,0.221 z m 0,0.143 v 0.611 c -0.158,-0.0925 -0.275,-0.191 -0.3515,-0.2965 -0.052,-0.071 -0.077,-0.1415 -0.077,-0.2125 0,-0.06 0.021,-0.113 0.0645,-0.159 0.033,-0.035 0.078,-0.0525 0.137,-0.0525 0.065,0 0.141,0.0365 0.227,0.1095"
         style="fill:#ff0000;fill-opacity:1;fill-rule:evenodd;stroke:#ff0000;stroke-width:0.05;stroke-opacity:1"
         id="path273-1" /><path
         d="m 149.47246,112.9461 c 0.169,0.0485 0.315,0.1575 0.4385,0.3255 0.1235,0.1685 0.1855,0.334 0.1855,0.496 0,0.119 -0.0275,0.213 -0.0805,0.282 -0.0545,0.069 -0.1365,0.114 -0.2465,0.1355 z m 0.1435,1.2375 c -0.078,-0.008 -0.1505,-0.03 -0.2165,-0.066 -0.066,-0.036 -0.1285,-0.088 -0.1885,-0.155 -0.08,-0.092 -0.1435,-0.1965 -0.19,-0.3145 -0.0465,-0.1175 -0.07,-0.2305 -0.07,-0.339 0,-0.1055 0.0245,-0.189 0.0735,-0.2505 0.05,-0.0615 0.124,-0.102 0.225,-0.1215 z m -0.167,-1.343 -0.1545,-0.621 h -0.2515 l 0.1835,0.627 c -0.171,0.028 -0.305,0.095 -0.4,0.2 -0.096,0.105 -0.1435,0.2375 -0.1435,0.3975 0,0.2205 0.093,0.4145 0.28,0.5815 0.187,0.167 0.4155,0.2575 0.686,0.271 l 0.1715,0.5935 h 0.116 l -0.1435,-0.5995 c 0.183,-0.0175 0.327,-0.076 0.433,-0.175 0.1055,-0.099 0.159,-0.225 0.159,-0.377 0,-0.212 -0.091,-0.4065 -0.272,-0.583 -0.181,-0.177 -0.403,-0.282 -0.664,-0.315"
         style="fill:#ff0000;fill-opacity:1;fill-rule:evenodd;stroke:#ff0000;stroke-width:0.05;stroke-opacity:1"
         id="path275-6" /></g><g
       id="g8889"
       transform="matrix(1.5,0,0,1.5,-68.47723,-65.084425)"><path
         d="m 136.41596,130.0226 c -0.223,-0.1965 -0.4225,-0.2945 -0.6,-0.2945 -0.104,0 -0.191,0.034 -0.259,0.1025 -0.07,0.068 -0.1035,0.154 -0.1035,0.257 0,0.139 0.0595,0.2645 0.179,0.3755 0.12,0.1115 0.381,0.2595 0.7835,0.444 v 0.184 c 0,0.138 -0.007,0.225 -0.023,0.261 -0.0145,0.036 -0.043,0.067 -0.084,0.094 -0.042,0.0265 -0.089,0.04 -0.1415,0.04 -0.0845,0 -0.154,-0.0195 -0.209,-0.057 -0.033,-0.023 -0.05,-0.0505 -0.05,-0.082 0,-0.027 0.0185,-0.061 0.054,-0.1015 0.05,-0.056 0.075,-0.11 0.075,-0.162 0,-0.0645 -0.024,-0.1185 -0.0715,-0.1635 -0.0485,-0.045 -0.11,-0.0675 -0.187,-0.0675 -0.0815,0 -0.1505,0.0255 -0.2055,0.0745 -0.0555,0.0495 -0.083,0.1075 -0.083,0.1735 0,0.094 0.0365,0.1835 0.111,0.269 0.075,0.085 0.1775,0.1505 0.311,0.1965 0.132,0.045 0.2705,0.068 0.414,0.068 0.1725,0 0.3095,-0.037 0.4105,-0.11 0.101,-0.074 0.166,-0.1535 0.1965,-0.2395 0.019,-0.0545 0.027,-0.1805 0.027,-0.3775 v -0.7085 c 0,-0.0835 0.003,-0.136 0.0105,-0.157 0.006,-0.0215 0.0155,-0.0375 0.0285,-0.0485 0.0135,-0.01 0.0285,-0.015 0.045,-0.015 0.0345,0 0.0685,0.024 0.104,0.072 l 0.058,-0.0465 c -0.0645,-0.097 -0.1315,-0.167 -0.202,-0.2105 -0.0695,-0.043 -0.1485,-0.065 -0.237,-0.065 -0.104,0 -0.186,0.0245 -0.2445,0.0735 -0.0585,0.0485 -0.094,0.1225 -0.107,0.221 z m 0,0.143 v 0.611 c -0.1575,-0.0925 -0.2745,-0.1915 -0.3515,-0.2965 -0.051,-0.071 -0.0765,-0.1415 -0.0765,-0.2125 0,-0.0605 0.0215,-0.113 0.065,-0.159 0.032,-0.035 0.0775,-0.0525 0.136,-0.0525 0.0655,0 0.141,0.0365 0.227,0.1095"
         style="fill:#ff0000;fill-opacity:1;fill-rule:evenodd;stroke:#ff0000;stroke-width:0.05;stroke-opacity:1"
         id="path277-7" /><path
         d="m 137.52496,129.9941 h 0.9305 v -0.0365 l -1.014,-1.055 h 0.4295 c 0.1015,0 0.166,0.004 0.193,0.012 0.0275,0.008 0.053,0.0245 0.076,0.0495 0.023,0.0255 0.048,0.0715 0.0765,0.138 h 0.054 l -0.1275,-0.3985 h -0.9535 v 0.0425 l 1.014,1.0545 h -0.4215 c -0.0895,0 -0.143,-0.002 -0.1615,-0.007 -0.027,-0.006 -0.055,-0.0215 -0.0815,-0.0465 -0.0265,-0.0245 -0.0545,-0.066 -0.083,-0.1235 h -0.0555 l 0.1245,0.3705"
         style="fill:#ff0000;fill-opacity:1;fill-rule:evenodd;stroke:#ff0000;stroke-width:0.05;stroke-opacity:1"
         id="path279-6" /></g><path
       d="m 65.46531,53.247761 c 0.3875,0 0.7035,-0.316 0.7035,-0.7035 0,-0.3875 -0.316,-0.7035 -0.7035,-0.7035 -0.387,0 -0.703,0.316 -0.703,0.7035 0,0.3875 0.316,0.7035 0.703,0.7035"
       style="fill:#ff0000;fill-opacity:1;fill-rule:evenodd;stroke:#ff0000;stroke-width:0.05;stroke-opacity:1"
       id="path225-0-2" /><path
       d="m 65.46531,53.247761 c 0.3875,0 0.7035,-0.316 0.7035,-0.7035 0,-0.3875 -0.316,-0.7035 -0.7035,-0.7035 -0.387,0 -0.703,0.316 -0.703,0.7035 0,0.3875 0.316,0.7035 0.703,0.7035 z"
       style="fill:#ff0000;stroke:#ff0000;stroke-width:0.2835;stroke-linecap:butt;stroke-linejoin:miter;stroke-miterlimit:2.613;stroke-dasharray:none;stroke-opacity:1"
       id="path227-4-4" /><g
       id="g6860"
       transform="matrix(-0.84075545,0,0,0.98887729,120.60272,0.59383038)"><path
         d="m 65.66431,52.423261 12.417,-7.202"
         style="fill:#ff0000;stroke:#ff0000;stroke-width:0.567;stroke-linecap:butt;stroke-linejoin:miter;stroke-miterlimit:2.613;stroke-dasharray:none;stroke-opacity:1"
         id="path243-8-4" /><path
         d="m 80.21831,43.981761 -2.2605,2.4125 c 0.073,-0.7765 -0.2465,-1.326 -0.956,-1.6485 l 3.2165,-0.764"
         style="fill:#ff0000;fill-opacity:1;fill-rule:evenodd;stroke:#ff0000;stroke-width:0.05;stroke-opacity:1"
         id="path245-4-6" /></g><g
       id="g6864"
       transform="matrix(0.61423947,0,0,-1.0816192,25.245739,108.99827)"><path
         d="m 65.53131,52.594761 12.4465,7.1535"
         style="fill:#ff0000;stroke:#ff0000;stroke-width:0.567;stroke-linecap:butt;stroke-linejoin:miter;stroke-miterlimit:2.613;stroke-dasharray:none;stroke-opacity:1"
         id="path247-3-5" /><path
         d="m 80.11581,60.976261 -3.2135,-0.7495 c 0.707,-0.3245 1.0235,-0.8745 0.9475,-1.649 l 2.266,2.3985"
         style="fill:#ff0000;fill-opacity:1;fill-rule:evenodd;stroke:#ff0000;stroke-width:0.05;stroke-opacity:1"
         id="path249-4-4" /></g><path
       d="m 65.54431,52.510761 0.0635,15.547"
       style="fill:#ff0000;stroke:#ff0000;stroke-width:0.567;stroke-linecap:butt;stroke-linejoin:miter;stroke-miterlimit:2.613;stroke-dasharray:none;stroke-opacity:1"
       id="path251-7-3" /><path
       d="m 65.61831,70.533761 -0.9685,-3.169 c 0.6385,0.4505 1.276,0.448 1.9105,-0.0075 l -0.942,3.1765"
       style="fill:#ff0000;fill-opacity:1;fill-rule:evenodd;stroke:#ff0000;stroke-width:0.05;stroke-opacity:1"
       id="path253-5-0" /><g
       id="g6949"
       transform="matrix(1.5,0,0,1.5,27.533416,-3.9940587)"><path
         d="m 14.031049,33.465885 c -0.2225,-0.1965 -0.422,-0.2945 -0.6,-0.2945 -0.104,0 -0.1905,0.034 -0.2585,0.1025 -0.0695,0.068 -0.1035,0.154001 -0.1035,0.257 0,0.139 0.0595,0.2645 0.1795,0.3755 0.1195,0.1115 0.3805,0.259501 0.7825,0.444001 v 0.183999 c 0,0.138 -0.007,0.225 -0.0225,0.261001 -0.0145,0.036 -0.043,0.067 -0.084,0.094 -0.0425,0.0265 -0.089,0.04 -0.1415,0.04 -0.0845,0 -0.154,-0.0195 -0.209,-0.057 -0.033,-0.023 -0.0505,-0.0505 -0.0505,-0.082 0,-0.027 0.019,-0.061 0.0545,-0.101999 0.0495,-0.0555 0.075,-0.1095 0.075,-0.162 0,-0.064 -0.024,-0.118 -0.072,-0.163 -0.048,-0.045 -0.11,-0.0675 -0.186,-0.0675 -0.082,0 -0.151,0.0255 -0.206,0.0745 -0.056,0.0495 -0.0835,0.1075 -0.0835,0.1735 0,0.094 0.037,0.1835 0.111,0.268999 0.075,0.085 0.1785,0.1505 0.311,0.1965 0.1325,0.045 0.271,0.068 0.414,0.068 0.173,0 0.31,-0.037 0.4115,-0.11 0.1,-0.074 0.1655,-0.1535 0.196,-0.2395 0.0185,-0.0545 0.027,-0.1805 0.027,-0.377499 v -0.708501 c 0,-0.0835 0.003,-0.136 0.0105,-0.157499 0.006,-0.021 0.015,-0.037 0.0285,-0.048 0.0135,-0.0095 0.028,-0.015 0.045,-0.015 0.0345,0 0.069,0.024 0.1035,0.072 l 0.0585,-0.0465 c -0.0645,-0.097 -0.132,-0.167 -0.2025,-0.2105 -0.069,-0.043 -0.1485,-0.065 -0.2365,-0.065 -0.1045,0 -0.186,0.0245 -0.2445,0.0735 -0.059,0.0485 -0.0945,0.1225 -0.1075,0.220998 z m 0,0.143 v 0.611 c -0.1565,-0.0925 -0.274,-0.1915 -0.351,-0.2965 -0.051,-0.071 -0.0765,-0.1415 -0.0765,-0.2125 0,-0.0605 0.0215,-0.113 0.065,-0.159 0.032,-0.035 0.0775,-0.0525 0.136,-0.0525 0.0655,0 0.141,0.0365 0.2265,0.1095"
         style="fill:#ff0000;fill-opacity:1;fill-rule:evenodd;stroke:#ff0000;stroke-width:0.05;stroke-opacity:1"
         id="path269-1-5" /><path
         d="m 14.849049,31.462885 h -0.263 l 0.4055,1.365 c 0.0735,0.244501 0.1725,0.428 0.298,0.551001 0.126,0.122999 0.2765,0.1845 0.4515,0.1845 0.172,0 0.3095,-0.053 0.4125,-0.159501 0.1035,-0.106499 0.1545,-0.248499 0.1545,-0.426499 0,-0.1135 -0.023,-0.2255 -0.0695,-0.337001 -0.046,-0.110999 -0.111,-0.210999 -0.195,-0.298499 -0.075,-0.0795 -0.156,-0.139001 -0.244,-0.1795 -0.0885,-0.0405 -0.1815,-0.061 -0.2775,-0.061 -0.0745,0 -0.151,0.0095 -0.2285,0.0285 -0.078,0.019 -0.1545,0.047 -0.227,0.083 z m 0.432,1.4825 -0.172,-0.588999 c 0.065,-0.0565 0.1275,-0.0975 0.1875,-0.123 0.0595,-0.0255 0.122,-0.038 0.1875,-0.038 0.1565,0 0.2905,0.0905 0.3995,0.271 0.1095,0.1805 0.1645,0.3995 0.1645,0.656 0,0.1105 -0.026,0.197 -0.079,0.2595 -0.0515,0.0625 -0.123,0.093 -0.2125,0.093 -0.102,0 -0.1935,-0.045 -0.275,-0.1365 -0.0815,-0.091 -0.148,-0.2225 -0.2005,-0.393"
         style="fill:#ff0000;fill-opacity:1;fill-rule:evenodd;stroke:#ff0000;stroke-width:0.05;stroke-opacity:1"
         id="path271-1-5" /></g><g
       id="g6953"
       transform="matrix(1.5,0,0,1.5,54.743584,-26.000152)"><path
         d="m 14.504049,47.633386 c -0.2235,-0.1965 -0.4235,-0.2945 -0.6005,-0.2945 -0.104,0 -0.19,0.034 -0.2595,0.1025 -0.069,0.068 -0.103,0.154 -0.103,0.256999 0,0.139001 0.059,0.2645 0.179,0.375501 0.1205,0.1115 0.3805,0.2595 0.784,0.444499 v 0.183501 c 0,0.1385 -0.008,0.225 -0.023,0.261 -0.015,0.036 -0.043,0.067 -0.0845,0.094 -0.042,0.0265 -0.089,0.04 -0.1405,0.04 -0.085,0 -0.1555,-0.0195 -0.2095,-0.0565 -0.034,-0.0235 -0.051,-0.051 -0.051,-0.0825 0,-0.027 0.0185,-0.061 0.0545,-0.1015 0.0495,-0.056 0.075,-0.11 0.075,-0.162 0,-0.0645 -0.0245,-0.1185 -0.0715,-0.1635 -0.0475,-0.045 -0.1095,-0.0675 -0.187,-0.0675 -0.0815,0 -0.1505,0.0255 -0.2055,0.0745 -0.055,0.0495 -0.0835,0.1075 -0.0835,0.173499 0,0.094 0.037,0.1835 0.1115,0.269 0.0745,0.085 0.1775,0.1505 0.311,0.1965 0.1325,0.045 0.2705,0.068 0.4135,0.068 0.1735,0 0.31,-0.037 0.411,-0.11 0.101,-0.074 0.166,-0.1535 0.1965,-0.2395 0.0185,-0.0545 0.0275,-0.1805 0.0275,-0.377 v -0.709 c 0,-0.083 0.003,-0.136 0.0095,-0.157 0.007,-0.0215 0.016,-0.0375 0.03,-0.048 0.012,-0.01 0.0275,-0.0155 0.0445,-0.0155 0.034,0 0.068,0.024 0.104,0.072 l 0.058,-0.0465 c -0.0645,-0.097 -0.1325,-0.167 -0.2025,-0.21 -0.069,-0.0435 -0.148,-0.0655 -0.237,-0.0655 -0.104,0 -0.185,0.0245 -0.244,0.0735 -0.059,0.0485 -0.095,0.1225 -0.107,0.221001 z m 0,0.143 v 0.610999 c -0.158,-0.0925 -0.275,-0.191 -0.3515,-0.2965 -0.052,-0.071 -0.077,-0.1415 -0.077,-0.2125 0,-0.06 0.021,-0.113 0.0645,-0.158999 0.033,-0.035 0.078,-0.0525 0.137,-0.0525 0.065,0 0.141,0.0365 0.227,0.1095"
         style="fill:#ff0000;fill-opacity:1;fill-rule:evenodd;stroke:#ff0000;stroke-width:0.05;stroke-opacity:1"
         id="path273-1-0" /><path
         d="m 16.108049,46.377386 c 0.169,0.0485 0.315,0.1575 0.4385,0.325499 0.1235,0.168501 0.1855,0.334001 0.1855,0.496001 0,0.119 -0.0275,0.213 -0.0805,0.281999 -0.0545,0.069 -0.1365,0.114 -0.2465,0.1355 z m 0.1435,1.237499 c -0.078,-0.008 -0.1505,-0.03 -0.2165,-0.066 -0.066,-0.036 -0.1285,-0.088 -0.1885,-0.155 -0.08,-0.092 -0.1435,-0.1965 -0.19,-0.3145 -0.0465,-0.1175 -0.07,-0.2305 -0.07,-0.339 0,-0.1055 0.0245,-0.189 0.0735,-0.2505 0.05,-0.0615 0.124,-0.102 0.225,-0.1215 z m -0.167,-1.343 -0.1545,-0.621 h -0.2515 l 0.1835,0.627 c -0.171,0.028 -0.305,0.095 -0.4,0.2 -0.096,0.105 -0.1435,0.2375 -0.1435,0.3975 0,0.220501 0.093,0.4145 0.28,0.5815 0.187,0.167 0.4155,0.2575 0.686,0.271 l 0.1715,0.5935 h 0.116 l -0.1435,-0.5995 c 0.183,-0.0175 0.327,-0.076 0.433,-0.174999 0.1055,-0.099 0.159,-0.225001 0.159,-0.377001 0,-0.212 -0.091,-0.4065 -0.272,-0.583 -0.181,-0.176999 -0.403,-0.281999 -0.664,-0.314999"
         style="fill:#ff0000;fill-opacity:1;fill-rule:evenodd;stroke:#ff0000;stroke-width:0.05;stroke-opacity:1"
         id="path275-6-2" /></g><g
       id="g8868"
       transform="matrix(1.5,0,0,1.5,-33.299405,-36.039256)"><path
         d="m 66.06031,71.932261 c -0.223,-0.1965 -0.4225,-0.2945 -0.6,-0.2945 -0.104,0 -0.191,0.034 -0.259,0.1025 -0.07,0.068 -0.1035,0.154 -0.1035,0.257 0,0.139 0.0595,0.2645 0.179,0.3755 0.12,0.1115 0.381,0.2595 0.7835,0.444 v 0.184 c 0,0.138 -0.007,0.225 -0.023,0.261 -0.0145,0.036 -0.043,0.067 -0.084,0.094 -0.042,0.0265 -0.089,0.04 -0.1415,0.04 -0.0845,0 -0.154,-0.0195 -0.209,-0.057 -0.033,-0.023 -0.05,-0.0505 -0.05,-0.082 0,-0.027 0.0185,-0.061 0.054,-0.1015 0.05,-0.056 0.075,-0.11 0.075,-0.162 0,-0.0645 -0.024,-0.1185 -0.0715,-0.1635 -0.0485,-0.045 -0.11,-0.0675 -0.187,-0.0675 -0.0815,0 -0.1505,0.0255 -0.2055,0.0745 -0.0555,0.0495 -0.083,0.1075 -0.083,0.1735 0,0.094 0.0365,0.1835 0.111,0.269 0.075,0.085 0.1775,0.1505 0.311,0.1965 0.132,0.045 0.2705,0.068 0.414,0.068 0.1725,0 0.3095,-0.037 0.4105,-0.11 0.101,-0.074 0.166,-0.1535 0.1965,-0.2395 0.019,-0.0545 0.027,-0.1805 0.027,-0.3775 v -0.7085 c 0,-0.0835 0.003,-0.136 0.0105,-0.157 0.006,-0.0215 0.0155,-0.0375 0.0285,-0.0485 0.0135,-0.0095 0.0285,-0.015 0.045,-0.015 0.0345,0 0.0685,0.024 0.104,0.072 l 0.058,-0.0465 c -0.0645,-0.097 -0.1315,-0.167 -0.202,-0.2105 -0.0695,-0.043 -0.1485,-0.065 -0.237,-0.065 -0.104,0 -0.186,0.0245 -0.2445,0.0735 -0.0585,0.0485 -0.094,0.1225 -0.107,0.221 z m 0,0.143 v 0.611 c -0.1575,-0.0925 -0.2745,-0.1915 -0.3515,-0.2965 -0.051,-0.071 -0.0765,-0.1415 -0.0765,-0.2125 0,-0.0605 0.0215,-0.113 0.065,-0.159 0.032,-0.035 0.0775,-0.0525 0.136,-0.0525 0.0655,0 0.141,0.0365 0.227,0.1095"
         style="fill:#ff0000;fill-opacity:1;fill-rule:evenodd;stroke:#ff0000;stroke-width:0.05;stroke-opacity:1"
         id="path277-7-1" /><path
         d="m 67.16931,71.903761 h 0.9305 v -0.0365 l -1.014,-1.055 h 0.4295 c 0.1015,0 0.166,0.004 0.193,0.012 0.0275,0.008 0.053,0.0245 0.076,0.0495 0.023,0.0255 0.048,0.0715 0.0765,0.138 h 0.054 l -0.1275,-0.3985 h -0.9535 v 0.0425 l 1.014,1.0545 h -0.4215 c -0.0895,0 -0.143,-0.0025 -0.1615,-0.007 -0.027,-0.006 -0.055,-0.0215 -0.0815,-0.0465 -0.0265,-0.0245 -0.0545,-0.066 -0.083,-0.1235 h -0.0555 l 0.1245,0.3705"
         style="fill:#ff0000;fill-opacity:1;fill-rule:evenodd;stroke:#ff0000;stroke-width:0.05;stroke-opacity:1"
         id="path279-6-4" /></g><g
       id="g7844"
       transform="translate(48.06193,4.057284)"><path
         d="m -17.956578,61.865899 -1.009,-0.8168 c 0.1582,0.0281 0.3063,0.0429 0.441,0.0429 0.1321,0 0.2512,-0.0082 0.3621,-0.0218 0.1102,-0.0172 0.3469,-0.0672 0.7102,-0.1481 0.3637,-0.082 0.6809,-0.1242 0.9519,-0.1242 0.2879,0 0.5348,0.0512 0.736,0.1512 0.2008,0.1 0.3969,0.2679 0.5879,0.5031 l 0.1289,-0.0633 c -0.2688,-0.3859 -0.5848,-0.6641 -0.9481,-0.8352 -0.366,-0.1699 -0.7519,-0.2558 -1.1617,-0.2558 -0.2262,0 -0.5359,0.0461 -0.9301,0.134 -0.6011,0.1332 -1.0211,0.198 -1.2609,0.198 -0.091,0 -0.1652,-0.0051 -0.223,-0.0168 -0.0571,-0.0152 -0.1422,-0.0461 -0.2571,-0.0961 l -0.091,0.1071 1.602,1.2648 c -0.4942,0.068 -0.8692,0.2852 -1.1239,0.652 -0.2562,0.3671 -0.3832,0.7582 -0.3832,1.1761 0,0.5711 0.1723,1.1598 0.5172,1.7699 0.3438,0.609 0.7879,1.0801 1.3238,1.4161 0.5379,0.3351 1.0661,0.5011 1.584,0.5011 0.386,0 0.7153,-0.0781 0.9871,-0.2343 0.2719,-0.1559 0.4809,-0.3836 0.6309,-0.6809 0.1473,-0.2988 0.223,-0.6039 0.223,-0.9168 0,-0.5992 -0.1699,-1.2062 -0.5128,-1.8203 -0.3411,-0.6149 -0.7653,-1.0797 -1.2719,-1.3957 -0.5063,-0.3172 -1.0442,-0.4801 -1.6133,-0.4902 z m 1.4641,5.289 c -0.261,0 -0.5161,-0.0648 -0.7641,-0.1941 -0.25,-0.1297 -0.4957,-0.3399 -0.7391,-0.6336 -0.2457,-0.2922 -0.466,-0.6762 -0.6617,-1.1492 -0.2351,-0.584 -0.3551,-1.134 -0.3551,-1.6532 0,-0.3687 0.095,-0.6968 0.286,-0.9828 0.189,-0.284 0.4808,-0.4261 0.875,-0.4261 0.234,0 0.466,0.0582 0.6941,0.175 0.2289,0.1171 0.466,0.3171 0.7117,0.598 0.3121,0.359 0.5743,0.816 0.7852,1.3711 0.2109,0.5539 0.316,1.0699 0.316,1.5461 0,0.3519 -0.0949,0.6637 -0.2852,0.9379 -0.191,0.273 -0.4777,0.4109 -0.8628,0.4109"
         style="display:inline;fill:#231f20;fill-opacity:1;fill-rule:evenodd;stroke:none;stroke-width:0.1"
         id="path358-9" /><path
         d="m -11.396378,60.420199 v -0.1442 c -0.393,0.1969 -0.7219,0.4289 -0.984,0.6938 -0.375,0.3781 -0.6641,0.823 -0.866,1.3363 -0.2051,0.5148 -0.3059,1.0461 -0.3059,1.5988 0,0.8059 0.2008,1.5442 0.5976,2.209 0.3981,0.6652 0.918,1.1402 1.5583,1.427 v -0.1641 c -0.32,-0.1777 -0.5821,-0.4188 -0.7891,-0.727 -0.2059,-0.3058 -0.359,-0.6957 -0.459,-1.1679 -0.1019,-0.47 -0.1539,-0.9637 -0.1539,-1.4758 0,-0.557 0.043,-1.0641 0.1289,-1.5192 0.0691,-0.3609 0.1512,-0.6488 0.2461,-0.866 0.0961,-0.2168 0.2258,-0.4257 0.3879,-0.6269 0.1641,-0.2012 0.3762,-0.3918 0.6391,-0.5738"
         style="display:inline;fill:#231f20;fill-opacity:1;fill-rule:evenodd;stroke:none;stroke-width:0.1"
         id="path360-3" /><path
         d="m -7.548378,63.006099 -0.3711,-1.0192 h -3.125 v 0.143 c 0.9191,0.8391 1.568,1.525 1.9422,2.0551 0.375,0.532 0.5629,1.0172 0.5629,1.457 0,0.336 -0.1031,0.6117 -0.3102,0.8278 -0.2058,0.2164 -0.4508,0.3242 -0.7379,0.3242 -0.2609,0 -0.4929,-0.0762 -0.7,-0.2281 -0.2082,-0.152 -0.3609,-0.3758 -0.4589,-0.6688 h -0.145 c 0.0641,0.4809 0.2309,0.85 0.5008,1.109 0.2699,0.2566 0.6063,0.3871 1.0102,0.3871 0.4289,0 0.7879,-0.1395 1.0757,-0.4152 0.2883,-0.2758 0.4333,-0.6012 0.4333,-0.9762 0,-0.268 -0.0629,-0.5367 -0.1879,-0.8039 -0.193,-0.4231 -0.5063,-0.8688 -0.9371,-1.341 -0.6481,-0.7078 -1.0551,-1.1352 -1.2161,-1.2809 h 1.384 c 0.2801,0 0.4781,0.0098 0.5903,0.032 0.1148,0.0188 0.2156,0.0618 0.3066,0.1258 0.091,0.0641 0.1711,0.1551 0.2391,0.2723 h 0.1441"
         style="display:inline;fill:#231f20;fill-opacity:1;fill-rule:evenodd;stroke:none;stroke-width:0.1"
         id="path362-5" /><path
         d="m -6.787478,60.654899 v 0.1711 c 0.2692,0.0879 0.477,0.2262 0.625,0.4129 0.1461,0.1859 0.2192,0.3832 0.2192,0.591 0,0.05 -0.0114,0.091 -0.0332,0.1262 -0.0192,0.0219 -0.0391,0.0348 -0.0559,0.0348 -0.0289,0 -0.091,-0.027 -0.1883,-0.079 -0.0457,-0.023 -0.0957,-0.0351 -0.1476,-0.0351 -0.1274,0 -0.2293,0.0371 -0.3063,0.1141 -0.073,0.075 -0.1129,0.1793 -0.1129,0.3113 0,0.1277 0.05,0.2379 0.1469,0.3277 0.0973,0.0918 0.2172,0.1371 0.357,0.1371 0.1723,0 0.325,-0.073 0.459,-0.225 0.1352,-0.1488 0.202,-0.3468 0.202,-0.5929 0,-0.2704 -0.0938,-0.5192 -0.2797,-0.7493 -0.1863,-0.2308 -0.4813,-0.4129 -0.8852,-0.5449"
         style="display:inline;fill:#231f20;fill-opacity:1;fill-rule:evenodd;stroke:none;stroke-width:0.1"
         id="path364-9" /><path
         d="m -2.923378,63.540099 h 4.13672 v 0.327734 h -4.13672 z"
         style="display:inline;fill:#231f20;fill-opacity:1;fill-rule:nonzero;stroke:none;stroke-width:0.1"
         id="path366-4" /><path
         d="m 6.212522,60.654899 v 0.1711 c 0.2692,0.0879 0.477,0.2262 0.625,0.4129 0.1461,0.1859 0.2192,0.3832 0.2192,0.591 0,0.05 -0.0114,0.091 -0.0332,0.1262 -0.0192,0.0219 -0.0391,0.0348 -0.0559,0.0348 -0.0289,0 -0.091,-0.027 -0.1883,-0.079 -0.0457,-0.023 -0.0957,-0.0351 -0.1476,-0.0351 -0.1274,0 -0.2292999,0.0371 -0.3062999,0.1141 -0.073,0.075 -0.1129,0.1793 -0.1129,0.3113 0,0.1277 0.05,0.2379 0.1469,0.3277 0.0973,0.0918 0.2171999,0.1371 0.3569999,0.1371 0.1723,0 0.3250002,-0.073 0.4590002,-0.225 0.1352,-0.1488 0.202,-0.3468 0.202,-0.5929 0,-0.2704 -0.0938,-0.5192 -0.2789,-0.7493 -0.1871002,-0.2308 -0.4821002,-0.4129 -0.8860001,-0.5449"
         style="display:inline;fill:#231f20;fill-opacity:1;fill-rule:evenodd;stroke:none;stroke-width:0.1"
         id="path370-1" /><path
         d="m 9.720722,66.763099 1.2899,0.6301 h 0.1289 v -4.473 c 0,-0.2973 0.0121,-0.4821 0.0359,-0.5543 0.025,-0.0727 0.0782,-0.1278 0.1551,-0.168 0.0781,-0.0399 0.2371,-0.0621 0.477,-0.068 v -0.143 h -1.9918 v 0.143 c 0.25,0.0059 0.4097,0.0281 0.4839,0.066 0.0719,0.0371 0.1231,0.0879 0.152,0.152 0.0289,0.0633 0.043,0.2543 0.043,0.5723 v 2.8597 c 0,0.3852 -0.0129,0.6313 -0.0391,0.741 -0.0191,0.084 -0.0519,0.145 -0.0988,0.184 -0.0492,0.0391 -0.1051,0.0582 -0.1742,0.0582 -0.0961,0 -0.2309,-0.0402 -0.4032,-0.1211 l -0.0586,0.1211"
         style="display:inline;fill:#231f20;fill-opacity:1;fill-rule:evenodd;stroke:none;stroke-width:0.1"
         id="path372-38" /><path
         d="m 1.888725,66.743341 1.2899,0.6301 h 0.1289 v -4.473 c 0,-0.2973 0.0121,-0.4821 0.0359,-0.5543 0.025,-0.0727 0.0782,-0.1278 0.1551,-0.168 0.0781,-0.0399 0.2371,-0.0621 0.477,-0.068 v -0.143 h -1.9918 v 0.143 c 0.25,0.0059 0.4097,0.0281 0.4839,0.066 0.0719,0.0371 0.1231,0.0879 0.152,0.152 0.0289,0.0633 0.043,0.2543 0.043,0.5723 v 2.8597 c 0,0.3852 -0.0129,0.6313 -0.0391,0.741 -0.0191,0.084 -0.0519,0.145 -0.0988,0.184 -0.0492,0.0391 -0.1051,0.0582 -0.1742,0.0582 -0.0961,0 -0.2309,-0.0402 -0.4032,-0.1211 l -0.0586,0.1211"
         style="display:inline;fill:#231f20;fill-opacity:1;fill-rule:evenodd;stroke:none;stroke-width:0.1"
         id="path372-3-5" /><path
         d="m 12.963322,67.377199 v 0.1637 c 0.3961,-0.195 0.7262,-0.425 0.9883,-0.6918 0.3719,-0.3801 0.6598,-0.825 0.8641,-1.3383 0.2019,-0.5117 0.3039,-1.0449 0.3039,-1.5996 0,-0.8063 -0.1981,-1.5422 -0.595,-2.2071 -0.3972,-0.666 -0.9179,-1.1422 -1.5613,-1.4281 v 0.1442 c 0.3203,0.1796 0.5844,0.4218 0.791,0.7289 0.2071,0.305 0.3614,0.6949 0.4614,1.1679 0.1007,0.4719 0.15,0.966 0.15,1.477 0,0.5551 -0.043,1.0609 -0.1293,1.5199 -0.0649,0.3602 -0.1457,0.6473 -0.2438,0.8641 -0.0992,0.216 -0.2281,0.4242 -0.389,0.6242 -0.161,0.2008 -0.375,0.393 -0.6403,0.575"
         style="display:inline;fill:#231f20;fill-opacity:1;fill-rule:evenodd;stroke:none;stroke-width:0.1"
         id="path374-6" /></g><path
       style="fill:none;stroke:#00ffff;stroke-width:0.75px;stroke-linecap:butt;stroke-linejoin:miter;stroke-opacity:1"
       d="M 109.31707,84.079537 64.836552,52.50668"
       id="path6400" /><g
       id="g8487"
       transform="translate(81)"><path
         d="m -31.787806,79.044809 c 0.088,-0.150705 0.15,-0.291803 0.183998,-0.4218 0.03503,-0.1332 0.06697,-0.392205 0.102,-0.777 l 0.172005,-1.921103 c 0.156997,0.186 0.381997,0.483998 0.679995,0.891 0.143002,0.196898 0.320002,0.465998 0.530002,0.807803 0.128003,0.2082 0.206003,0.3543 0.236003,0.437197 0.01403,0.04102 0.02303,0.0851 0.02303,0.128903 0,0.02813 -0.009,0.0519 -0.02798,0.0711 -0.01897,0.0171 -0.06502,0.0378 -0.143003,0.06397 -0.077,0.02378 -0.141,0.0711 -0.192,0.135997 -0.05002,0.066 -0.076,0.142905 -0.076,0.2289 0,0.107003 0.03202,0.192105 0.09499,0.257003 0.06098,0.066 0.140002,0.098 0.233002,0.098 0.114998,0 0.213,-0.04613 0.294998,-0.142905 0.081,-0.09499 0.121005,-0.225 0.121005,-0.3918 0,-0.205095 -0.072,-0.441 -0.212003,-0.705097 -0.141,-0.264098 -0.411997,-0.669098 -0.813,-1.215998 -0.399997,-0.5481 -0.885997,-1.1442 -1.455997,-1.789102 -0.393,-0.4461 -0.685005,-0.7269 -0.876008,-0.843 -0.189,-0.1152 -0.351997,-0.173003 -0.487995,-0.173003 -0.08,0 -0.152002,0.03008 -0.212002,0.09221 -0.06202,0.0609 -0.092,0.131595 -0.092,0.212895 0,0.1008 0.04102,0.1929 0.127005,0.2769 0.084,0.0828 0.175995,0.1239 0.273998,0.1239 0.05197,0 0.096,-0.01 0.131002,-0.03397 0.021,-0.0141 0.04297,-0.05078 0.06697,-0.111697 0.02497,-0.06023 0.048,-0.102405 0.069,-0.123105 0.012,-0.01327 0.02902,-0.018 0.04702,-0.018 0.01402,0 0.042,0.01102 0.081,0.03787 0.144,0.0891 0.311003,0.2289 0.500003,0.421897 0.250995,0.255098 0.435,0.463298 0.555,0.624998 l -0.219,2.475 c -0.036,0.410205 -0.09101,0.659002 -0.163005,0.7473 -0.07403,0.0879 -0.195998,0.134002 -0.367995,0.134002 -0.054,0 -0.152003,-0.009 -0.293003,-0.0231 l -0.03502,0.143003 1.143998,0.2808"
         style="display:inline;fill:#000080;fill-opacity:1;fill-rule:evenodd;stroke:none;stroke-width:0.0999997"
         id="path344-3-1" /><path
         d="m -24.606803,78.445904 h 2.479995 v -0.096 l -2.703,-2.812995 h 1.144005 c 0.27,0 0.441997,0.009 0.516997,0.03203 0.072,0.021 0.138998,0.06503 0.200003,0.132 0.06098,0.06697 0.129,0.190005 0.204997,0.368002 h 0.144 l -0.339997,-1.062 h -2.542005 v 0.111998 l 2.702002,2.811 h -1.124002 c -0.237,0 -0.381,-0.006 -0.429998,-0.018 -0.072,-0.01597 -0.146002,-0.057 -0.216,-0.123 -0.072,-0.066 -0.146002,-0.177 -0.222,-0.33 h -0.147 l 0.332003,0.987"
         style="display:inline;fill:#000080;fill-opacity:1;fill-rule:evenodd;stroke:none;stroke-width:0.0999997"
         id="path346-6-5" /><path
         d="m -39.266903,78.611909 c 0.126997,-0.1347 0.223095,-0.269903 0.289095,-0.405105 0.04613,-0.0949 0.123,-0.339795 0.230902,-0.737798 l 0.3429,0.515198 c 0.091,0.123802 0.201203,0.243705 0.3321,0.357802 0.128903,0.112898 0.244103,0.189803 0.3441,0.230903 0.0621,0.0273 0.130898,0.039 0.207,0.039 0.111698,0 0.200003,-0.02887 0.266003,-0.089 0.06683,-0.05978 0.1,-0.1329 0.1,-0.218002 0,-0.1 -0.01987,-0.1668 -0.0582,-0.203895 -0.0738,-0.06488 -0.155797,-0.0981 -0.249997,-0.0981 -0.05392,0 -0.1128,0.01207 -0.175703,0.036 -0.121897,0.04102 -0.205102,0.0621 -0.246097,0.0621 -0.06292,0 -0.136005,-0.03713 -0.223103,-0.109005 -0.160102,-0.1359 -0.352702,-0.396098 -0.5769,-0.785198 l 0.319898,-1.3437 c 0.04883,-0.206302 0.0898,-0.328897 0.125002,-0.369097 0.03397,-0.0411 0.0672,-0.06097 0.101198,-0.06097 0.0558,0 0.119902,0.03007 0.191002,0.0899 0.1437,0.1203 0.264803,0.276098 0.3687,0.469103 l 0.135203,-0.0711 c -0.1641,-0.3078 -0.3723,-0.561705 -0.626205,-0.764805 -0.141795,-0.115298 -0.261698,-0.1719 -0.361695,-0.1719 -0.1461,0 -0.2613,0.0816 -0.348105,0.244905 -0.05497,0.102 -0.167895,0.539895 -0.3402,1.314097 -0.405098,-0.7071 -0.730095,-1.160197 -0.975795,-1.363297 -0.159,-0.130905 -0.312105,-0.195705 -0.460906,-0.195705 -0.105097,0 -0.1992,0.03668 -0.2859,0.114802 -0.06142,0.05588 -0.0922,0.132098 -0.0922,0.2289 0,0.0852 0.02813,0.157103 0.0859,0.215303 0.05633,0.057 0.126203,0.0847 0.210203,0.0847 0.0828,0 0.171803,-0.04103 0.266003,-0.125002 0.06788,-0.0597 0.119895,-0.0898 0.155797,-0.0898 0.03278,0 0.07313,0.0219 0.121103,0.06293 0.123097,0.0988 0.289095,0.312098 0.499995,0.639795 0.211005,0.3282 0.350002,0.566003 0.4149,0.712103 -0.1629,0.6321 -0.249998,0.9672 -0.262898,1.0032 -0.06022,0.168697 -0.1371,0.288997 -0.2352,0.3597 -0.0961,0.0711 -0.235897,0.105097 -0.423802,0.105097 -0.06022,0 -0.130095,-0.003 -0.207,-0.008 v 0.141795 l 1.042905,0.182003"
         style="display:inline;fill:#000080;fill-opacity:1;fill-rule:evenodd;stroke:none;stroke-width:0.0999997"
         id="path348-2-6" /></g><path
       d="m 138.09515,89.36837 h 2.48 v -0.0969 l -2.703,-2.812901 h 1.144 c 0.271,0 0.443,0.0105 0.516,0.0316 0.074,0.0211 0.139,0.0653 0.201,0.1321 0.061,0.0679 0.13,0.189 0.206,0.3679 h 0.144 l -0.34,-1.0628 h -2.543 v 0.114 l 2.703,2.811001 h -1.124 c -0.239,0 -0.382,-0.006 -0.431,-0.018 -0.072,-0.016 -0.145,-0.0578 -0.217,-0.1238 -0.071,-0.0672 -0.144,-0.1762 -0.22,-0.3301 h -0.148 l 0.332,0.9879"
       style="fill:#000080;fill-opacity:1;fill-rule:evenodd;stroke:none;stroke-width:0.1"
       id="path123" /></g><g
     inkscape:groupmode="layer"
     id="layer1"
     inkscape:label="ink_ext_XXXXXX 1"
     style="display:inline"
     transform="translate(-12.7308)"><path
       d="m 135.394,50.193 v 59.977 l 12.637,12.637 M 64.916397,34.841363 64.836552,52.506679 90.141469,83.769491"
       style="display:inline;fill:none;stroke:#00adef;stroke-width:0.567;stroke-linecap:butt;stroke-linejoin:miter;stroke-miterlimit:2.613;stroke-dasharray:5.669, 1.701;stroke-dashoffset:0;stroke-opacity:1"
       id="path336"
       sodipodi:nodetypes="cccccc"
       transform="matrix(1.3333333,0,0,-1.3333333,-24.860933,210.47599)" /><path
       style="display:inline;fill:none;stroke:#000080;stroke-width:0.75px;stroke-linecap:butt;stroke-linejoin:miter;stroke-opacity:1"
       d="M 135.394,110.17 V 50.193005"
       id="path9086"
       transform="matrix(1.3333333,0,0,-1.3333333,-24.860932,210.47599)" /></g></svg>
