<?xml version="1.0" encoding="UTF-8" standalone="no"?>
<!-- Created with Inkscape (http://www.inkscape.org/) -->

<svg
   width="59.656837mm"
   height="56.83757mm"
   viewBox="0 0 59.656837 56.83757"
   version="1.1"
   id="svg4277"
   inkscape:version="1.1 (c68e22c387, 2021-05-23)"
   sodipodi:docname="sphere_a.svg"
   xmlns:inkscape="http://www.inkscape.org/namespaces/inkscape"
   xmlns:sodipodi="http://sodipodi.sourceforge.net/DTD/sodipodi-0.dtd"
   xmlns="http://www.w3.org/2000/svg"
   xmlns:svg="http://www.w3.org/2000/svg">
  <sodipodi:namedview
     id="namedview4279"
     pagecolor="#ffffff"
     bordercolor="#666666"
     borderopacity="1.0"
     inkscape:pageshadow="2"
     inkscape:pageopacity="0.0"
     inkscape:pagecheckerboard="0"
     inkscape:document-units="mm"
     showgrid="false"
     fit-margin-top="0"
     fit-margin-left="0"
     fit-margin-right="0"
     fit-margin-bottom="0"
     inkscape:zoom="2.771684"
     inkscape:cx="125.73583"
     inkscape:cy="82.440856"
     inkscape:window-width="1280"
     inkscape:window-height="995"
     inkscape:window-x="1351"
     inkscape:window-y="-9"
     inkscape:window-maximized="1"
     inkscape:current-layer="layer1" />
  <defs
     id="defs4274">
    <clipPath
       clipPathUnits="userSpaceOnUse"
       id="clipPath3833">
      <path
         d="m 2496.75,2107.41 c 182.31,56.28 365.33,157.7 479.6,338.64 -1.18,0 -27.15,662.34 -670.6,688.26 -459.59,-494.93 -381.5,-1050.09 -391.97,-1091.41 11.14,-0.86 66.95,-4.85 148.73,-2.69 l 7.24,98.6 30.52,140.7 35.59,144.08 15.27,50.85 16.94,47.47 c 0,0 0,20.34 23.73,27.12 23.73,6.79 88.15,20.35 108.5,20.35 20.34,0 54.23,-5.09 66.1,-10.18 11.86,-5.09 52.56,-22.04 59.33,-37.29 6.78,-15.25 13.56,-52.53 13.56,-52.53 v -62.73 l -8.48,-89.85 c 0,0 42.39,-47.47 44.08,-64.42 1.69,-16.95 15.25,-81.35 15.25,-81.35 l 3.39,-32.22 3.22,-31.4"
         clip-rule="evenodd"
         id="path3831" />
    </clipPath>
    <clipPath
       clipPathUnits="userSpaceOnUse"
       id="clipPath3843">
      <path
         d="M 0,0 H 3353 V 3363.52 H 0 Z"
         id="path3841" />
    </clipPath>
    <clipPath
       clipPathUnits="userSpaceOnUse"
       id="clipPath3849">
      <path
         d="m 2317.56,2893.47 h 1094.8 c 0,604.32 -490.47,1094.8 -1094.8,1094.8 -604.33,0 -1094.8,-490.48 -1094.8,-1094.8 0,-604.32 490.47,-1094.8 1094.8,-1094.8 604.33,0 1094.8,490.48 1094.8,1094.8"
         clip-rule="evenodd"
         id="path3847" />
    </clipPath>
    <clipPath
       clipPathUnits="userSpaceOnUse"
       id="clipPath3855">
      <path
         d="m 2496.75,2107.41 c 182.31,56.28 365.33,157.7 479.6,338.64 -1.18,0 -27.15,662.34 -670.6,688.26 -459.59,-494.93 -381.5,-1050.09 -391.97,-1091.41 11.14,-0.86 66.95,-4.85 148.73,-2.69 l 7.24,98.6 30.52,140.7 35.59,144.08 15.27,50.85 16.94,47.47 c 0,0 0,20.34 23.73,27.12 23.73,6.79 88.15,20.35 108.5,20.35 20.34,0 54.23,-5.09 66.1,-10.18 11.86,-5.09 52.56,-22.04 59.33,-37.29 6.78,-15.25 13.56,-52.53 13.56,-52.53 v -62.73 l -8.48,-89.85 c 0,0 42.39,-47.47 44.08,-64.42 1.69,-16.95 15.25,-81.35 15.25,-81.35 l 3.39,-32.22 3.22,-31.4"
         clip-rule="evenodd"
         id="path3853" />
    </clipPath>
    <clipPath
       clipPathUnits="userSpaceOnUse"
       id="clipPath3861">
      <path
         d="M 1846.16,2038.05 H 2976.35 V 3134.31 H 1846.16 Z"
         id="path3859" />
    </clipPath>
    <radialGradient
       fx="0"
       fy="0"
       cx="0"
       cy="0"
       r="1"
       gradientUnits="userSpaceOnUse"
       gradientTransform="matrix(1094.8,0,0,-1094.8,2317.56,2893.47)"
       spreadMethod="pad"
       id="radialGradient3867">
      <stop
         style="stop-opacity:1;stop-color:#f2fbfe"
         offset="0"
         id="stop3863" />
      <stop
         style="stop-opacity:1;stop-color:#7fd6f7"
         offset="1"
         id="stop3865" />
    </radialGradient>
  </defs>
  <g
     inkscape:label="Layer 1"
     inkscape:groupmode="layer"
     id="layer1"
     transform="translate(-51.711577,-41.241214)">
    <path
       d="M 76.086757,44.766523 V 72.447936 H 103.60095"
       style="fill:none;stroke:#bdbbbc;stroke-width:0.200025;stroke-linecap:butt;stroke-linejoin:miter;stroke-miterlimit:2.613;stroke-dasharray:none;stroke-opacity:1"
       id="path2167" />
    <path
       d="m 76.086757,43.213242 0.599017,1.990372 c -0.398992,-0.284691 -0.798336,-0.284691 -1.198034,0 l 0.599017,-1.990372"
       style="fill:#bdbbbc;fill-opacity:1;fill-rule:evenodd;stroke:none;stroke-width:0.0352778"
       id="path2169" />
    <path
       d="m 105.15423,72.447936 -1.99037,-0.599017 c 0.28469,0.398992 0.28469,0.798689 0,1.197681 l 1.99037,-0.598664"
       style="fill:#bdbbbc;fill-opacity:1;fill-rule:evenodd;stroke:none;stroke-width:0.0352778"
       id="path2171" />
    <path
       d="m 72.39141,68.634408 4.083755,4.083756 2.743553,-4.211461 c 0,0 -1.659114,-0.702381 -3.573286,-0.510823 -1.914525,0.191206 -3.254022,0.638528 -3.254022,0.638528"
       style="fill:#f0fafe;fill-opacity:1;fill-rule:evenodd;stroke:none;stroke-width:0.0352778"
       id="path2173" />
    <path
       d="m 80.917696,77.043572 -4.630561,-4.692297 2.8575,-4.090811 c 0,0 1.398411,0.697089 1.588558,1.07703 0.189795,0.380295 0.759883,2.027061 0.633236,3.167239 -0.126294,1.140178 -0.253294,3.103739 -0.253294,3.103739 l -0.195439,1.4351"
       style="fill:#80d6f7;fill-opacity:1;fill-rule:evenodd;stroke:none;stroke-width:0.0352778"
       id="path2175" />
    <path
       d="m 57.648827,91.17973 c 0.04516,0.04762 0.07902,0.09525 0.102306,0.142875 0.01623,0.03351 0.04374,0.119944 0.08114,0.260703 l 0.121356,-0.182034 c 0.03246,-0.04374 0.07091,-0.08608 0.117122,-0.126294 0.04586,-0.04022 0.08608,-0.06703 0.121356,-0.08149 0.02152,-0.0099 0.04621,-0.01376 0.07338,-0.01376 0.03916,0 0.0702,0.01023 0.09349,0.0314 0.02399,0.02117 0.03528,0.04657 0.03528,0.07726 0,0.03457 -0.0071,0.05856 -0.02046,0.07126 -0.02611,0.02293 -0.05503,0.03493 -0.08819,0.03493 -0.01905,0 -0.03986,-0.0046 -0.06209,-0.0127 -0.04304,-0.01482 -0.07232,-0.02223 -0.08678,-0.02223 -0.02222,0 -0.04762,0.01341 -0.07832,0.03881 -0.0568,0.04798 -0.124883,0.140053 -0.203906,0.276931 l 0.112889,0.474133 c 0.01764,0.07232 0.0321,0.116064 0.0441,0.129822 0.01164,0.01446 0.02364,0.02117 0.03563,0.02117 0.0194,0 0.04233,-0.0099 0.06738,-0.03105 0.0508,-0.04233 0.09349,-0.09737 0.129822,-0.165452 l 0.04833,0.02505 c -0.05785,0.108303 -0.131233,0.198261 -0.220839,0.269875 -0.05045,0.04022 -0.09313,0.06068 -0.128058,0.06068 -0.05115,0 -0.09172,-0.02893 -0.122767,-0.08678 -0.0194,-0.03563 -0.05927,-0.1905 -0.119944,-0.463197 -0.142522,0.249414 -0.25788,0.409222 -0.344311,0.481189 -0.05609,0.04551 -0.110067,0.06879 -0.162631,0.06879 -0.03669,0 -0.0702,-0.01305 -0.100894,-0.04057 -0.02152,-0.01976 -0.03246,-0.04657 -0.03246,-0.08114 0,-0.02999 0.0099,-0.05503 0.03034,-0.07549 0.01976,-0.02046 0.04445,-0.02999 0.07408,-0.02999 0.02928,0 0.06068,0.01446 0.09384,0.0441 0.02399,0.02117 0.04233,0.0314 0.05503,0.0314 0.01129,0 0.02575,-0.0074 0.04269,-0.02223 0.04339,-0.03457 0.101953,-0.110067 0.176389,-0.225425 0.07444,-0.115711 0.123119,-0.200025 0.146403,-0.25153 -0.0575,-0.222603 -0.08819,-0.340784 -0.09243,-0.353484 -0.02152,-0.05962 -0.04904,-0.102305 -0.08326,-0.127 -0.03351,-0.02469 -0.08361,-0.03704 -0.149577,-0.03704 -0.02152,0 -0.04551,0.0011 -0.07303,0.0025 v -0.04939 l 0.367594,-0.06456"
       style="fill:#ff0000;fill-opacity:1;fill-rule:evenodd;stroke:none;stroke-width:0.0352778"
       id="path3817" />
    <path
       d="m 106.25949,71.93288 c 0.031,0.05327 0.0529,0.103364 0.0649,0.148872 0.012,0.04692 0.0236,0.138289 0.0363,0.273756 l 0.06,0.678039 c 0.0557,-0.06562 0.13511,-0.170392 0.23989,-0.313972 0.0508,-0.06985 0.11288,-0.164748 0.18732,-0.285045 0.0452,-0.07338 0.0727,-0.125589 0.0833,-0.154516 0.005,-0.01446 0.007,-0.03034 0.007,-0.04551 0,-0.0099 -0.003,-0.0187 -0.009,-0.02505 -0.007,-0.006 -0.0229,-0.01341 -0.0504,-0.02222 -0.0272,-0.0088 -0.0494,-0.02575 -0.0677,-0.04798 -0.0176,-0.02364 -0.0265,-0.0508 -0.0265,-0.08114 0,-0.03775 0.0109,-0.06773 0.0332,-0.09066 0.0215,-0.02328 0.0494,-0.03457 0.0822,-0.03457 0.0406,0 0.0751,0.01658 0.10337,0.05045 0.0289,0.03316 0.043,0.07973 0.043,0.138289 0,0.07267 -0.0247,0.155928 -0.0744,0.249061 -0.0497,0.09243 -0.14535,0.236009 -0.28681,0.428978 -0.14111,0.193322 -0.31291,0.403225 -0.51364,0.63112 -0.13865,0.156986 -0.24166,0.256469 -0.30904,0.297391 -0.067,0.04022 -0.12418,0.06103 -0.17215,0.06103 -0.0282,0 -0.0536,-0.01094 -0.0752,-0.03246 -0.0215,-0.02223 -0.0321,-0.04657 -0.0321,-0.07549 0,-0.03563 0.0145,-0.06809 0.0448,-0.09772 0.0293,-0.02928 0.0621,-0.04374 0.0967,-0.04374 0.0187,0 0.0342,0.0039 0.0459,0.01199 0.007,0.0049 0.0159,0.01799 0.0236,0.03986 0.009,0.02117 0.0173,0.03528 0.0247,0.04269 0.004,0.0053 0.01,0.0063 0.0162,0.0063 0.005,0 0.0152,-0.0035 0.0289,-0.01305 0.0508,-0.0314 0.10936,-0.08079 0.17639,-0.148873 0.0882,-0.08996 0.15346,-0.163336 0.19579,-0.220486 l -0.0772,-0.873125 c -0.0127,-0.144286 -0.0321,-0.23248 -0.0579,-0.263525 -0.0261,-0.0314 -0.0688,-0.04692 -0.12947,-0.04692 -0.0191,0 -0.0536,0.0028 -0.10336,0.0081 l -0.0124,-0.05045 0.40358,-0.09948"
       style="fill:#ff0000;fill-opacity:1;fill-rule:evenodd;stroke:none;stroke-width:0.0352778"
       id="path3819" />
    <path
       d="m 75.746679,41.241214 h 0.875242 v 0.03457 l -0.953206,0.992364 h 0.403225 c 0.0956,0 0.156281,-0.0042 0.182034,-0.01164 0.02575,-0.0074 0.04939,-0.02258 0.07091,-0.04621 0.02152,-0.02399 0.04551,-0.06738 0.07232,-0.130175 h 0.05115 l -0.119944,0.375003 h -0.896761 v -0.03986 l 0.952853,-0.992011 h -0.396523 c -0.08325,0 -0.134408,0.0025 -0.151694,0.0067 -0.0254,0.0053 -0.05115,0.01976 -0.0762,0.04375 -0.0254,0.02293 -0.05151,0.06209 -0.07796,0.115711 h -0.05256 l 0.117122,-0.348192"
       style="fill:#ff0000;fill-opacity:1;fill-rule:evenodd;stroke:none;stroke-width:0.0352778"
       id="path3821" />
    <path
       d="M 75.986921,72.547419 59.38273,89.639855"
       style="fill:none;stroke:#bdbbbc;stroke-width:0.200025;stroke-linecap:butt;stroke-linejoin:miter;stroke-miterlimit:2.613;stroke-dasharray:none;stroke-opacity:1"
       id="path3823" />
    <path
       d="m 58.300407,90.753927 1.816453,-1.010355 c -0.484364,-0.07408 -0.771172,-0.352425 -0.859719,-0.83432 l -0.956734,1.844675"
       style="fill:#bdbbbc;fill-opacity:1;fill-rule:evenodd;stroke:none;stroke-width:0.0352778"
       id="path3825" />
    <g
       id="g3827"
       transform="matrix(0.03527778,0,0,-0.03527778,-5.22993,158.75537)">
      <g
         id="g3829"
         clip-path="url(#clipPath3833)">
        <path
           d="m 2496.75,2107.41 c 182.31,56.28 365.33,157.7 479.6,338.64 -1.18,0 -27.15,662.34 -670.6,688.26 -459.59,-494.93 -381.5,-1050.09 -391.97,-1091.41 11.14,-0.86 66.95,-4.85 148.73,-2.69 l 7.24,98.6 30.52,140.7 35.59,144.08 15.27,50.85 16.94,47.47 c 0,0 0,20.34 23.73,27.12 23.73,6.79 88.15,20.35 108.5,20.35 20.34,0 54.23,-5.09 66.1,-10.18 11.86,-5.09 52.56,-22.04 59.33,-37.29 6.78,-15.25 13.56,-52.53 13.56,-52.53 v -62.73 l -8.48,-89.85 c 0,0 42.39,-47.47 44.08,-64.42 1.69,-16.95 15.25,-81.35 15.25,-81.35 l 3.39,-32.22 z m -582.97,-67.83 H 2976.34 V 3134.31 H 1913.78 Z"
           style="fill:#bebdbd;fill-opacity:1;fill-rule:evenodd;stroke:none"
           id="path3835" />
      </g>
    </g>
    <g
       id="g3837"
       transform="matrix(0.03527778,0,0,-0.03527778,-5.22993,158.75537)">
      <g
         id="g3839"
         clip-path="url(#clipPath3843)">
        <g
           id="g3845"
           clip-path="url(#clipPath3849)">
          <g
             id="g3851"
             clip-path="url(#clipPath3855)">
            <g
               id="g3857"
               clip-path="url(#clipPath3861)">
              <path
                 d="m 1977,2039 v 1 h -31 v 1 h -19 v 1 h -14 v 2 h 1 v 124 h 1 v 30 h 1 v 21 h 1 v 16 h 1 v 14 h 1 v 13 h 1 v 12 h 1 v 10 h 1 v 9 h 1 v 10 h 1 v 9 h 1 v 8 h 1 v 8 h 1 v 8 h 1 v 8 h 1 v 6 h 1 v 7 h 1 v 7 h 1 v 6 h 1 v 7 h 1 v 6 h 1 v 6 h 1 v 5 h 1 v 6 h 1 v 6 h 1 v 5 h 1 v 6 h 1 v 5 h 1 v 5 h 1 v 5 h 1 v 5 h 1 v 5 h 1 v 5 h 1 v 5 h 1 v 4 h 1 v 5 h 1 v 4 h 1 v 4 h 1 v 5 h 1 v 4 h 1 v 4 h 1 v 5 h 1 v 4 h 1 v 4 h 1 v 4 h 1 v 4 h 1 v 4 h 1 v 4 h 1 v 3 h 1 v 4 h 1 v 4 h 1 v 4 h 1 v 4 h 1 v 3 h 1 v 4 h 1 v 4 h 1 v 3 h 1 v 3 h 1 v 4 h 1 v 3 h 1 v 4 h 1 v 3 h 1 v 3 h 1 v 4 h 1 v 3 h 1 v 3 h 1 v 4 h 1 v 3 h 1 v 3 h 1 v 3 h 1 v 3 h 1 v 3 h 1 v 3 h 1 v 3 h 1 v 3 h 1 v 3 h 1 v 3 h 1 v 3 h 1 v 3 h 1 v 3 h 1 v 3 h 1 v 3 h 1 v 3 h 1 v 3 h 1 v 3 h 1 v 3 h 1 v 2 h 1 v 3 h 1 v 3 h 1 v 2 h 1 v 3 h 1 v 3 h 1 v 3 h 1 v 2 h 1 v 3 h 1 v 3 h 1 v 2 h 1 v 3 h 1 v 3 h 1 v 2 h 1 v 3 h 1 v 2 h 1 v 3 h 1 v 2 h 1 v 3 h 1 v 2 h 1 v 3 h 1 v 2 h 1 v 3 h 1 v 2 h 1 v 2 h 1 v 3 h 1 v 2 h 1 v 3 h 1 v 2 h 1 v 3 h 1 v 2 h 1 v 3 h 1 v 2 h 1 v 2 h 1 v 2 h 1 v 2 h 1 v 3 h 1 v 2 h 1 v 2 h 1 v 2 h 1 v 3 h 1 v 2 h 1 v 2 h 1 v 2 h 1 v 2 h 1 v 3 h 1 v 2 h 1 v 2 h 1 v 2 h 1 v 3 h 1 v 2 h 1 v 2 h 1 v 2 h 1 v 2 h 1 v 2 h 1 v 2 h 1 v 2 h 1 v 2 h 1 v 2 h 1 v 2 h 1 v 2 h 1 v 2 h 1 v 2 h 1 v 2 h 1 v 3 h 1 v 2 h 1 v 2 h 1 v 2 h 1 v 2 h 1 v 2 h 1 v 2 h 1 v 2 h 1 v 2 h 1 v 2 h 1 v 2 h 1 v 2 h 1 v 2 h 1 v 1 h 1 v 2 h 1 v 2 h 1 v 2 h 1 v 2 h 1 v 2 h 1 v 1 h 1 v 2 h 1 v 2 h 1 v 2 h 1 v 2 h 1 v 2 h 1 v 2 h 1 v 1 h 1 v 2 h 1 v 2 h 1 v 2 h 1 v 2 h 1 v 2 h 1 v 2 h 1 v 1 h 1 v 2 h 1 v 2 h 1 v 2 h 1 v 2 h 1 v 1 h 1 v 2 h 1 v 2 h 1 v 1 h 1 v 2 h 1 v 2 h 1 v 1 h 1 v 2 h 1 v 2 h 1 v 2 h 1 v 1 h 1 v 2 h 1 v 2 h 1 v 1 h 1 v 2 h 1 v 2 h 1 v 1 h 1 v 2 h 1 v 2 h 1 v 2 h 1 v 1 h 1 v 2 h 1 v 2 h 1 v 1 h 1 v 2 h 1 v 2 h 1 v 1 h 1 v 2 h 1 v 1 h 1 v 2 h 1 v 1 h 1 v 2 h 1 v 2 h 1 v 1 h 1 v 2 h 1 v 1 h 1 v 2 h 1 v 1 h 1 v 2 h 1 v 2 h 1 v 1 h 1 v 2 h 1 v 1 h 1 v 2 h 1 v 1 h 1 v 2 h 1 v 1 h 1 v 2 h 1 v 2 h 1 v 1 h 1 v 2 h 1 v 1 h 1 v 2 h 1 v 1 h 1 v 2 h 1 v 1 h 1 v 2 h 1 v 1 h 1 v 2 h 1 v 1 h 1 v 2 h 1 v 1 h 1 v 1 h 1 v 2 h 1 v 1 h 1 v 2 h 1 v 1 h 1 v 2 h 1 v 1 h 1 v 1 h 1 v 2 h 1 v 1 h 1 v 2 h 1 v 1 h 1 v 2 h 1 v 1 h 1 v 2 h 1 v 1 h 1 v 1 h 1 v 2 h 1 v 1 h 1 v 2 h 1 v 1 h 1 v 2 h 1 v 1 h 1 v 1 h 1 v 2 h 1 v 1 h 1 v 2 h 1 v 1 h 1 v 1 h 1 v 2 h 1 v 1 h 1 v 1 h 1 v 2 h 1 v 1 h 1 v 1 h 1 v 1 h 1 v 2 h 1 v 1 h 1 v 1 h 1 v 2 h 1 v 1 h 1 v 1 h 1 v 2 h 1 v 1 h 1 v 1 h 1 v 2 h 1 v 1 h 1 v 1 h 1 v 2 h 1 v 1 h 1 v 1 h 1 v 2 h 1 v 1 h 1 v 1 h 1 v 2 h 1 v 1 h 1 v 1 h 1 v 2 h 1 v 1 h 1 v 1 h 1 v 1 h 1 v 2 h 1 v 1 h 1 v 1 h 1 v 1 h 1 v 2 h 1 v 1 h 1 v 1 h 1 v 1 h 1 v 2 h 1 v 1 h 1 v 1 h 1 v 1 h 1 v 1 h 1 v 2 h 1 v 1 h 1 v 1 h 1 v 1 h 1 v 1 h 1 v 2 h 1 v 1 h 1 v 1 h 1 v 1 h 1 v 2 h 1 v 1 h 1 v 1 h 1 v 1 h 1 v 1 h 1 v 2 h 1 v 1 h 1 v 1 h 1 v 1 h 1 v 1 h 1 v 2 h 1 v 1 h 1 v 1 h 1 v 1 h 1 v 2 h 1 v 1 h 1 v 1 h 1 v 1 h 1 v 1 h 1 v 1 h 1 v 2 h 1 v 1 h 1 v 1 h 1 v 1 h 1 v 1 h 1 v 1 h 1 v 1 h 1 v 1 h 1 v 2 h 1 v 1 h 1 v 1 h 1 v 1 h 1 v 1 h 1 v 1 h 1 v 1 h 1 v 2 h 1 v 1 h 1 v 1 h 1 v 1 h 1 v 1 h 1 v 1 h 1 v 1 h 1 v 2 h 1 v 1 h 1 v 1 h 1 v 1 h 1 v 1 h 1 v 1 h 1 v 1 h 1 v 1 h 1 v 1 h 1 v 2 h 1 v 1 h 1 v 1 h 1 v 1 h 1 v 1 h 1 v 1 h 1 v 1 h 1 v 1 h 9 v -1 h 16 v -1 h 12 v -1 h 11 v -1 h 12 v -1 h 7 v -1 h 7 v -1 h 7 v -1 h 8 v -1 h 7 v -1 h 7 v -1 h 7 v -1 h 6 v -1 h 5 v -1 h 5 v -1 h 4 v -1 h 5 v -1 h 5 v -1 h 4 v -1 h 5 v -1 h 5 v -1 h 5 v -1 h 4 v -1 h 5 v -1 h 3 v -1 h 3 v -1 h 4 v -1 h 3 v -1 h 4 v -1 h 3 v -1 h 4 v -1 h 3 v -1 h 4 v -1 h 3 v -1 h 3 v -1 h 4 v -1 h 3 v -1 h 4 v -1 h 2 v -1 h 3 v -1 h 3 v -1 h 2 v -1 h 3 v -1 h 3 v -1 h 2 v -1 h 3 v -1 h 3 v -1 h 2 v -1 h 3 v -1 h 3 v -1 h 3 v -1 h 2 v -1 h 3 v -1 h 3 v -1 h 2 v -1 h 2 v -1 h 2 v -1 h 3 v -1 h 2 v -1 h 2 v -1 h 2 v -1 h 2 v -1 h 2 v -1 h 3 v -1 h 2 v -1 h 2 v -1 h 2 v -1 h 2 v -1 h 2 v -1 h 3 v -1 h 2 v -1 h 2 v -1 h 2 v -1 h 2 v -1 h 2 v -1 h 2 v -1 h 2 v -1 h 2 v -1 h 1 v -1 h 2 v -1 h 2 v -1 h 2 v -1 h 2 v -1 h 1 v -1 h 2 v -1 h 2 v -1 h 2 v -1 h 2 v -1 h 1 v -1 h 2 v -1 h 2 v -1 h 2 v -1 h 2 v -1 h 1 v -1 h 2 v -1 h 2 v -1 h 1 v -1 h 2 v -1 h 1 v -1 h 2 v -1 h 2 v -1 h 1 v -1 h 2 v -1 h 1 v -1 h 2 v -1 h 1 v -1 h 2 v -1 h 1 v -1 h 2 v -1 h 1 v -1 h 2 v -1 h 1 v -1 h 2 v -1 h 1 v -1 h 2 v -1 h 1 v -1 h 2 v -1 h 2 v -1 h 1 v -1 h 1 v -1 h 2 v -1 h 1 v -1 h 1 v -1 h 2 v -1 h 1 v -1 h 1 v -1 h 2 v -1 h 1 v -1 h 1 v -1 h 2 v -1 h 1 v -1 h 1 v -1 h 1 v -1 h 2 v -1 h 1 v -1 h 1 v -1 h 2 v -1 h 1 v -1 h 1 v -1 h 2 v -1 h 1 v -1 h 1 v -1 h 2 v -1 h 1 v -1 h 1 v -1 h 1 v -1 h 1 v -1 h 2 v -1 h 1 v -1 h 1 v -1 h 1 v -1 h 1 v -1 h 1 v -1 h 1 v -1 h 2 v -1 h 1 v -1 h 1 v -1 h 1 v -1 h 1 v -1 h 1 v -1 h 1 v -1 h 2 v -1 h 1 v -1 h 1 v -1 h 1 v -1 h 1 v -1 h 1 v -1 h 1 v -1 h 1 v -1 h 2 v -1 h 1 v -1 h 1 v -1 h 1 v -1 h 1 v -1 h 1 v -1 h 1 v -1 h 1 v -1 h 1 v -1 h 1 v -1 h 1 v -1 h 1 v -1 h 1 v -1 h 1 v -1 h 1 v -1 h 1 v -1 h 1 v -1 h 1 v -1 h 1 v -1 h 1 v -1 h 1 v -1 h 1 v -1 h 1 v -1 h 1 v -1 h 1 v -1 h 1 v -1 h 1 v -1 h 1 v -1 h 1 v -1 h 1 v -1 h 1 v -1 h 1 v -1 h 1 v -2 h 1 v -1 h 1 v -1 h 1 v -1 h 1 v -1 h 1 v -1 h 1 v -1 h 1 v -2 h 1 v -1 h 1 v -1 h 1 v -1 h 1 v -1 h 1 v -1 h 1 v -1 h 1 v -2 h 1 v -1 h 1 v -1 h 1 v -1 h 1 v -1 h 1 v -1 h 1 v -1 h 1 v -2 h 1 v -1 h 1 v -1 h 1 v -1 h 1 v -1 h 1 v -2 h 1 v -1 h 1 v -1 h 1 v -2 h 1 v -1 h 1 v -1 h 1 v -1 h 1 v -2 h 1 v -1 h 1 v -1 h 1 v -2 h 1 v -1 h 1 v -1 h 1 v -2 h 1 v -1 h 1 v -1 h 1 v -1 h 1 v -2 h 1 v -1 h 1 v -1 h 1 v -2 h 1 v -1 h 1 v -1 h 1 v -2 h 1 v -1 h 1 v -2 h 1 v -1 h 1 v -2 h 1 v -1 h 1 v -1 h 1 v -2 h 1 v -1 h 1 v -2 h 1 v -1 h 1 v -2 h 1 v -1 h 1 v -2 h 1 v -1 h 1 v -2 h 1 v -1 h 1 v -1 h 1 v -2 h 1 v -1 h 1 v -2 h 1 v -2 h 1 v -1 h 1 v -2 h 1 v -2 h 1 v -1 h 1 v -2 h 1 v -1 h 1 v -2 h 1 v -2 h 1 v -1 h 1 v -2 h 1 v -2 h 1 v -1 h 1 v -2 h 1 v -1 h 1 v -2 h 1 v -2 h 1 v -1 h 1 v -2 h 1 v -2 h 1 v -2 h 1 v -2 h 1 v -1 h 1 v -2 h 1 v -2 h 1 v -2 h 1 v -2 h 1 v -2 h 1 v -1 h 1 v -2 h 1 v -2 h 1 v -2 h 1 v -2 h 1 v -2 h 1 v -1 h 1 v -2 h 1 v -2 h 1 v -2 h 1 v -2 h 1 v -2 h 1 v -2 h 1 v -3 h 1 v -2 h 1 v -2 h 1 v -2 h 1 v -2 h 1 v -2 h 1 v -2 h 1 v -2 h 1 v -2 h 1 v -2 h 1 v -2 h 1 v -3 h 1 v -2 h 1 v -2 h 1 v -2 h 1 v -3 h 1 v -2 h 1 v -2 h 1 v -3 h 1 v -2 h 1 v -2 h 1 v -2 h 1 v -3 h 1 v -2 h 1 v -3 h 1 v -2 h 1 v -3 h 1 v -2 h 1 v -3 h 1 v -2 h 1 v -3 h 1 v -3 h 1 v -2 h 1 v -3 h 1 v -2 h 1 v -3 h 1 v -3 h 1 v -3 h 1 v -3 h 1 v -2 h 1 v -3 h 1 v -3 h 1 v -3 h 1 v -3 h 1 v -3 h 1 v -3 h 1 v -3 h 1 v -3 h 1 v -3 h 1 v -3 h 1 v -4 h 1 v -3 h 1 v -3 h 1 v -3 h 1 v -4 h 1 v -3 h 1 v -4 h 1 v -3 h 1 v -4 h 1 v -4 h 1 v -3 h 1 v -4 h 1 v -3 h 1 v -5 h 1 v -4 h 1 v -4 h 1 v -4 h 1 v -4 h 1 v -4 h 1 v -4 h 1 v -5 h 1 v -5 h 1 v -4 h 1 v -5 h 1 v -5 h 1 v -5 h 1 v -5 h 1 v -6 h 1 v -5 h 1 v -6 h 1 v -6 h 1 v -6 h 1 v -7 h 1 v -7 h 1 v -7 h 1 v -8 h 1 v -9 h 1 v -9 h 1 v -12 h 1 v -5 h -1 v -2 h -1 v -1 h -1 v -2 h -1 v -1 h -1 v -2 h -1 v -1 h -1 v -2 h -1 v -1 h -1 v -2 h -1 v -1 h -1 v -2 h -1 v -1 h -1 v -2 h -1 v -1 h -1 v -1 h -1 v -2 h -1 v -1 h -1 v -2 h -1 v -1 h -1 v -2 h -1 v -1 h -1 v -2 h -1 v -1 h -1 v -1 h -1 v -2 h -1 v -1 h -1 v -1 h -1 v -2 h -1 v -1 h -1 v -1 h -1 v -1 h -1 v -2 h -1 v -1 h -1 v -1 h -1 v -2 h -1 v -1 h -1 v -1 h -1 v -2 h -1 v -1 h -1 v -1 h -1 v -2 h -1 v -1 h -1 v -1 h -1 v -2 h -1 v -1 h -1 v -1 h -1 v -1 h -1 v -1 h -1 v -2 h -1 v -1 h -1 v -1 h -1 v -1 h -1 v -1 h -1 v -1 h -1 v -2 h -1 v -1 h -1 v -1 h -1 v -1 h -1 v -1 h -1 v -2 h -1 v -1 h -1 v -1 h -1 v -1 h -1 v -1 h -1 v -1 h -1 v -2 h -1 v -1 h -1 v -1 h -1 v -1 h -1 v -1 h -1 v -1 h -1 v -1 h -1 v -1 h -1 v -2 h -1 v -1 h -1 v -1 h -1 v -1 h -1 v -1 h -1 v -1 h -1 v -1 h -1 v -1 h -1 v -1 h -1 v -1 h -1 v -1 h -1 v -1 h -1 v -1 h -1 v -1 h -1 v -1 h -1 v -1 h -1 v -1 h -1 v -1 h -1 v -1 h -1 v -1 h -1 v -1 h -1 v -2 h -1 v -1 h -1 v -1 h -1 v -1 h -1 v -1 h -2 v -1 h -1 v -1 h -1 v -1 h -1 v -1 h -1 v -1 h -1 v -1 h -1 v -1 h -1 v -1 h -1 v -1 h -1 v -1 h -1 v -1 h -1 v -1 h -1 v -1 h -1 v -1 h -1 v -1 h -1 v -1 h -2 v -1 h -1 v -1 h -1 v -1 h -1 v -1 h -1 v -1 h -1 v -1 h -1 v -1 h -1 v -1 h -1 v -1 h -1 v -1 h -1 v -1 h -2 v -1 h -1 v -1 h -1 v -1 h -1 v -1 h -1 v -1 h -1 v -1 h -2 v -1 h -1 v -1 h -1 v -1 h -1 v -1 h -1 v -1 h -2 v -1 h -1 v -1 h -1 v -1 h -1 v -1 h -1 v -1 h -1 v -1 h -2 v -1 h -1 v -1 h -1 v -1 h -1 v -1 h -1 v -1 h -2 v -1 h -1 v -1 h -1 v -1 h -2 v -1 h -1 v -1 h -1 v -1 h -1 v -1 h -2 v -1 h -1 v -1 h -1 v -1 h -2 v -1 h -1 v -1 h -1 v -1 h -2 v -1 h -1 v -1 h -1 v -1 h -1 v -1 h -2 v -1 h -1 v -1 h -1 v -1 h -2 v -1 h -1 v -1 h -1 v -1 h -2 v -1 h -1 v -1 h -2 v -1 h -1 v -1 h -1 v -1 h -2 v -1 h -1 v -1 h -2 v -1 h -1 v -1 h -2 v -1 h -1 v -1 h -2 v -1 h -1 v -1 h -1 v -1 h -2 v -1 h -1 v -1 h -2 v -1 h -1 v -1 h -2 v -1 h -1 v -1 h -1 v -1 h -2 v -1 h -2 v -1 h -1 v -1 h -2 v -1 h -1 v -1 h -2 v -1 h -1 v -1 h -2 v -1 h -2 v -1 h -1 v -1 h -2 v -1 h -1 v -1 h -2 v -1 h -2 v -1 h -1 v -1 h -2 v -1 h -1 v -1 h -2 v -1 h -1 v -1 h -2 v -1 h -2 v -1 h -1 v -1 h -2 v -1 h -2 v -1 h -2 v -1 h -1 v -1 h -2 v -1 h -2 v -1 h -2 v -1 h -1 v -1 h -2 v -1 h -2 v -1 h -2 v -1 h -1 v -1 h -2 v -1 h -2 v -1 h -2 v -1 h -1 v -1 h -2 v -1 h -2 v -1 h -2 v -1 h -2 v -1 h -2 v -1 h -2 v -1 h -2 v -1 h -2 v -1 h -1 v -1 h -2 v -1 h -2 v -1 h -2 v -1 h -2 v -1 h -2 v -1 h -2 v -1 h -2 v -1 h -2 v -1 h -2 v -1 h -2 v -1 h -2 v -1 h -2 v -1 h -2 v -1 h -2 v -1 h -2 v -1 h -2 v -1 h -2 v -1 h -3 v -1 h -2 v -1 h -2 v -1 h -2 v -1 h -2 v -1 h -2 v -1 h -2 v -1 h -2 v -1 h -3 v -1 h -2 v -1 h -2 v -1 h -3 v -1 h -2 v -1 h -2 v -1 h -3 v -1 h -2 v -1 h -2 v -1 h -2 v -1 h -3 v -1 h -2 v -1 h -2 v -1 h -3 v -1 h -2 v -1 h -3 v -1 h -2 v -1 h -3 v -1 h -2 v -1 h -3 v -1 h -2 v -1 h -3 v -1 h -3 v -1 h -2 v -1 h -3 v -1 h -2 v -1 h -3 v -1 h -2 v -1 h -3 v -1 h -3 v -1 h -3 v -1 h -3 v -1 h -2 v -1 h -3 v -1 h -3 v -1 h -3 v -1 h -3 v -1 h -2 v -1 h -3 v -1 h -3 v -1 h -3 v -1 h -3 v -1 h -3 v -1 h -3 v -1 h -3 v -1 h -3 v -1 h -3 v -1 h -3 v -1 h -4 v -1 h -3 v -1 h -3 v 7 h -1 v 10 h -1 v 10 h -1 v 9 h -1 v 10 h -1 v 9 h -1 v 9 h -1 v 5 h -1 v 5 h -1 v 5 h -1 v 5 h -1 v 5 h -1 v 5 h -1 v 5 h -1 v 5 h -1 v 5 h -1 v 5 h -1 v 6 h -1 v 5 h -1 v 6 h -1 v 6 h -1 v 7 h -1 v 5 h -1 v 2 h -1 v 3 h -1 v 2 h -1 v 1 h -1 v 2 h -1 v 2 h -1 v 2 h -1 v 1 h -1 v 2 h -1 v 1 h -1 v 2 h -1 v 1 h -1 v 2 h -1 v 1 h -1 v 1 h -1 v 2 h -1 v 1 h -1 v 1 h -1 v 2 h -1 v 1 h -1 v 1 h -1 v 2 h -1 v 1 h -1 v 1 h -1 v 2 h -1 v 1 h -1 v 1 h -1 v 1 h -1 v 2 h -1 v 1 h -1 v 1 h -1 v 1 h -1 v 1 h -1 v 2 h -1 v 1 h -1 v 1 h -1 v 1 h -1 v 1 h -1 v 1 h -1 v 2 h -1 v 1 h -1 v 1 h -1 v 1 h -1 v 3 h 1 v 11 h 1 v 10 h 1 v 11 h 1 v 11 h 1 v 10 h 1 v 11 h 1 v 10 h 1 v 11 h 1 v 66 h -1 v 6 h -1 v 4 h -1 v 5 h -1 v 5 h -1 v 4 h -1 v 4 h -1 v 4 h -1 v 4 h -1 v 3 h -1 v 3 h -1 v 3 h -1 v 3 h -1 v 3 h -1 v 2 h -1 v 1 h -1 v 2 h -1 v 1 h -1 v 1 h -1 v 1 h -1 v 1 h -1 v 1 h -2 v 1 h -1 v 1 h -1 v 1 h -1 v 1 h -2 v 1 h -1 v 1 h -2 v 1 h -1 v 1 h -2 v 1 h -2 v 1 h -1 v 1 h -2 v 1 h -2 v 1 h -2 v 1 h -2 v 1 h -2 v 1 h -2 v 1 h -2 v 1 h -2 v 1 h -2 v 1 h -2 v 1 h -2 v 1 h -2 v 1 h -2 v 1 h -3 v 1 h -2 v 1 h -2 v 1 h -3 v 1 h -2 v 1 h -3 v 1 h -4 v 1 h -4 v 1 h -5 v 1 h -5 v 1 h -6 v 1 h -7 v 1 h -8 v 1 h -12 v 1 h -16 v -1 h -9 v -1 h -7 v -1 h -6 v -1 h -7 v -1 h -5 v -1 h -6 v -1 h -5 v -1 h -5 v -1 h -5 v -1 h -5 v -1 h -4 v -1 h -5 v -1 h -4 v -1 h -5 v -1 h -4 v -1 h -4 v -1 h -4 v -1 h -4 v -1 h -4 v -1 h -4 v -1 h -3 v -1 h -2 v -1 h -2 v -1 h -2 v -1 h -1 v -1 h -2 v -1 h -1 v -1 h -1 v -1 h -1 v -1 h -1 v -1 h -1 v -1 h -1 v -1 h -1 v -2 h -1 v -2 h -1 v -2 h -1 v -3 h -1 v -6 h -1 v -3 h -1 v -2 h -1 v -3 h -1 v -3 h -1 v -3 h -1 v -3 h -1 v -2 h -1 v -3 h -1 v -3 h -1 v -3 h -1 v -3 h -1 v -2 h -1 v -3 h -1 v -3 h -1 v -3 h -1 v -3 h -1 v -2 h -1 v -4 h -1 v -3 h -1 v -3 h -1 v -4 h -1 v -3 h -1 v -3 h -1 v -4 h -1 v -3 h -1 v -3 h -1 v -4 h -1 v -3 h -1 v -3 h -1 v -4 h -1 v -3 h -1 v -3 h -1 v -4 h -1 v -4 h -1 v -4 h -1 v -5 h -1 v -4 h -1 v -4 h -1 v -4 h -1 v -4 h -1 v -4 h -1 v -4 h -1 v -4 h -1 v -4 h -1 v -4 h -1 v -4 h -1 v -4 h -1 v -4 h -1 v -4 h -1 v -4 h -1 v -4 h -1 v -4 h -1 v -4 h -1 v -4 h -1 v -4 h -1 v -4 h -1 v -5 h -1 v -4 h -1 v -4 h -1 v -4 h -1 v -4 h -1 v -4 h -1 v -4 h -1 v -4 h -1 v -4 h -1 v -4 h -1 v -4 h -1 v -4 h -1 v -5 h -1 v -4 h -1 v -5 h -1 v -5 h -1 v -4 h -1 v -5 h -1 v -5 h -1 v -4 h -1 v -5 h -1 v -4 h -1 v -5 h -1 v -5 h -1 v -4 h -1 v -5 h -1 v -4 h -1 v -5 h -1 v -5 h -1 v -4 h -1 v -5 h -1 v -4 h -1 v -5 h -1 v -5 h -1 v -4 h -1 v -5 h -1 v -4 h -1 v -5 h -1 v -5 h -1 v -4 h -1 v -5 h -1 v -5 h -1 v -11 h -1 v -14 h -1 v -13 h -1 v -14 h -1 v -13 h -1 v -14 h -1 v -14 h -1 v -6 h -8 v -1"
                 style="fill:url(#radialGradient3867);fill-opacity:1;fill-rule:nonzero;stroke:none"
                 id="path3869" />
            </g>
          </g>
        </g>
      </g>
    </g>
    <path
       d="m 88.955737,85.874305 -2.91853,-2.615494 c 0,0 0.65405,-23.622705 -9.925403,-35.118322 v -3.290711 l 2.319161,2.991556 6.757106,7.53498 c 0,0 2.571397,2.989792 2.990497,4.902905 0.418042,1.914173 0.71755,2.870906 0.837142,10.64507 0.119238,7.774163 0,14.052902 -0.05997,14.950016"
       style="fill:#80d6f7;fill-opacity:1;fill-rule:evenodd;stroke:none;stroke-width:0.0352778"
       id="path3871" />
    <path
       d="m 64.049274,63.269364 1.584325,1.495425 c 0,0 11.182703,0.298803 17.700625,-3.109384 l 0.597958,-2.083152 c -7.364236,4.022372 -19.852216,3.696758 -19.882908,3.697111 z m -0.03034,0.0071 0.06103,-0.0074 -0.06103,0.0074"
       style="fill:#f0fafe;fill-opacity:1;fill-rule:evenodd;stroke:none;stroke-width:0.0352778"
       id="path3873" />
    <path
       d="m 87.87906,59.084008 -0.77717,-1.136297 c 0,0 5.621161,-3.946878 6.697486,-4.903611 l -1.016705,2.391481 c 0,0 -3.588103,2.930525 -4.903611,3.648427"
       style="fill:#f0fafe;fill-opacity:1;fill-rule:evenodd;stroke:none;stroke-width:0.0352778"
       id="path3875" />
    <path
       d="m 83.012137,60.686325 c 0.273403,0 0.496359,0.222603 0.496359,0.496005 0,0.27305 -0.222956,0.496359 -0.496359,0.496359 -0.273049,0 -0.496358,-0.223309 -0.496358,-0.496359 0,-0.273402 0.223309,-0.496005 0.496358,-0.496005"
       style="fill:#231f20;fill-opacity:1;fill-rule:evenodd;stroke:none;stroke-width:0.0352778"
       id="path3877" />
    <path
       d="m 83.012137,60.686325 c 0.273403,0 0.496359,0.222603 0.496359,0.496005 0,0.27305 -0.222956,0.496359 -0.496359,0.496359 -0.273049,0 -0.496358,-0.223309 -0.496358,-0.496359 0,-0.273402 0.223309,-0.496005 0.496358,-0.496005 z"
       style="fill:none;stroke:#231f20;stroke-width:0.200025;stroke-linecap:butt;stroke-linejoin:miter;stroke-miterlimit:2.613;stroke-dasharray:none;stroke-opacity:1"
       id="path3879" />
    <path
       d="m 82.094563,62.598733 h 0.735894 c 0.192617,0 0.336903,0.04163 0.432505,0.124884 0.0956,0.08326 0.143581,0.184855 0.143581,0.303741 0,0.09419 -0.03069,0.186267 -0.09137,0.275167 -0.06068,0.0896 -0.149931,0.162278 -0.269523,0.217311 -0.119944,0.05609 -0.248355,0.08361 -0.387702,0.08361 -0.08643,0 -0.195792,-0.01552 -0.329142,-0.04692 l -0.148872,0.509764 c -0.03493,0.121355 -0.05256,0.201436 -0.05256,0.239889 0,0.02928 0.01235,0.05327 0.03775,0.07232 0.02434,0.02011 0.08396,0.03281 0.1778,0.03775 l -0.01411,0.05151 h -0.74295 l 0.01552,-0.05151 c 0.09737,0 0.165453,-0.01623 0.2032,-0.05045 0.03845,-0.03316 0.07902,-0.125942 0.12312,-0.277283 l 0.30868,-1.063978 c 0.03669,-0.128058 0.05468,-0.213431 0.05468,-0.255764 0,-0.03245 -0.0127,-0.05891 -0.03845,-0.08043 -0.02681,-0.02152 -0.08396,-0.03351 -0.173567,-0.0381 z m 0.257527,0.871009 c 0.103717,0.02681 0.187678,0.03986 0.251178,0.03986 0.09948,0 0.190853,-0.02046 0.27305,-0.06174 0.0829,-0.04127 0.146756,-0.103716 0.192969,-0.186266 0.04657,-0.0822 0.0695,-0.168275 0.0695,-0.257175 0,-0.09384 -0.02822,-0.166864 -0.08502,-0.220839 -0.0575,-0.05433 -0.14358,-0.08149 -0.259291,-0.08149 -0.06244,0 -0.138289,0.0081 -0.227542,0.02364 l -0.214842,0.744009"
       style="fill:#231f20;fill-opacity:1;fill-rule:evenodd;stroke:none;stroke-width:0.0352778"
       id="path3881" />
    <path
       d="m 77.095349,87.916888 c 0,0 1.308452,-2.502958 4.434769,-4.662664"
       style="fill:none;stroke:#ff0000;stroke-width:0.25;stroke-linecap:butt;stroke-linejoin:miter;stroke-miterlimit:2.61299992;stroke-dasharray:none;stroke-opacity:1"
       id="path4071" />
    <path
       d="m 82.587393,82.523974 -1.445683,0.46602 c 0.336903,0.122414 0.503061,0.362655 0.497769,0.721078 l 0.947914,-1.187098"
       style="fill:#ff0000;fill-opacity:1;fill-rule:evenodd;stroke:none;stroke-width:0.0352778"
       id="path4073" />
    <path
       d="m 94.150037,82.459416 c 0,0 -1.251302,0 -3.809294,1.138061"
       style="fill:none;stroke:#ff0000;stroke-width:0.0998361;stroke-linecap:butt;stroke-linejoin:miter;stroke-miterlimit:2.613;stroke-dasharray:none;stroke-opacity:1;fill-opacity:1"
       id="path4075" />
    <path
       d="m 89.166346,84.119588 1.507066,-0.190852 c -0.30868,-0.182739 -0.427214,-0.449087 -0.355952,-0.800453 l -1.151114,0.991305"
       style="fill:#ff0000;fill-opacity:1;fill-rule:evenodd;stroke:#ff0000;stroke-width:0.0352778;stroke-opacity:1"
       id="path4077" />
    <g
       id="g2020"
       transform="matrix(0.35277777,0,0,-0.35277777,40.276257,152.11705)">
      <path
         d="m 117.36086,153.32333 v -0.144 c -0.3937,0.197 -0.7219,0.429 -0.984,0.695 -0.375,0.377 -0.6636,0.822 -0.8668,1.335 -0.2039,0.514 -0.305,1.046 -0.305,1.598 0,0.807 0.2,1.545 0.5968,2.209 0.3993,0.665 0.9192,1.141 1.559,1.428 v -0.164 c -0.3199,-0.177 -0.5828,-0.419 -0.7898,-0.727 -0.2051,-0.305 -0.3578,-0.696 -0.4602,-1.168 -0.1008,-0.469 -0.1519,-0.964 -0.1519,-1.476 0,-0.556 0.0429,-1.064 0.1281,-1.52 0.068,-0.36 0.1512,-0.648 0.2469,-0.865 0.0961,-0.218 0.225,-0.427 0.3882,-0.627 0.1629,-0.201 0.3758,-0.392 0.6387,-0.574"
         style="fill:#231f20;fill-opacity:1;fill-rule:evenodd;stroke:none;stroke-width:0.1"
         id="path4085-5" />
      <path
         d="m 121.72026,160.28033 v 0.164 c 0.3961,-0.194 0.7258,-0.425 0.9879,-0.692 0.373,-0.379 0.6609,-0.825 0.8629,-1.337 0.2039,-0.513 0.3051,-1.046 0.3051,-1.6 0,-0.807 -0.1981,-1.543 -0.5961,-2.208 -0.3969,-0.666 -0.9168,-1.142 -1.5598,-1.428 v 0.144 c 0.3211,0.18 0.584,0.422 0.7906,0.729 0.207,0.305 0.3613,0.696 0.4621,1.168 0.1,0.472 0.15,0.966 0.15,1.477 0,0.555 -0.0437,1.061 -0.1289,1.52 -0.0648,0.36 -0.1469,0.647 -0.2437,0.865 -0.0992,0.215 -0.2282,0.423 -0.3895,0.623 -0.1617,0.202 -0.375,0.392 -0.6406,0.575"
         style="fill:#231f20;fill-opacity:1;fill-rule:evenodd;stroke:none;stroke-width:0.1"
         id="path4087-6" />
      <path
         d="m 121.29406,158.42433 -0.7609,-2.648 -0.086,-0.356 c -0.008,-0.034 -0.0121,-0.061 -0.0121,-0.085 0,-0.042 0.0141,-0.079 0.0391,-0.11 0.0211,-0.024 0.0469,-0.034 0.0789,-0.034 0.0328,0 0.077,0.02 0.1309,0.061 0.1031,0.076 0.2382,0.232 0.407,0.469 l 0.1332,-0.092 c -0.1801,-0.272 -0.3652,-0.478 -0.5539,-0.621 -0.191,-0.141 -0.3672,-0.212 -0.5281,-0.212 -0.1121,0 -0.1961,0.028 -0.252,0.084 -0.0562,0.057 -0.084,0.138 -0.084,0.245 0,0.126 0.0289,0.293 0.086,0.504 l 0.082,0.291 c -0.341,-0.445 -0.6551,-0.755 -0.9422,-0.933 -0.2051,-0.127 -0.407,-0.191 -0.6051,-0.191 -0.191,0 -0.3539,0.08 -0.4918,0.236 -0.1379,0.157 -0.2058,0.375 -0.2058,0.651 0,0.413 0.1238,0.85 0.3719,1.31 0.2488,0.459 0.5648,0.827 0.948,1.103 0.298,0.219 0.5809,0.328 0.8469,0.328 0.159,0 0.291,-0.041 0.3961,-0.124 0.1058,-0.084 0.1859,-0.222 0.241,-0.415 l 0.141,0.445 z m -1.391,-0.203 c -0.166,0 -0.3422,-0.077 -0.5301,-0.234 -0.266,-0.222 -0.5019,-0.549 -0.7097,-0.985 -0.2071,-0.434 -0.3102,-0.828 -0.3102,-1.179 0,-0.177 0.0449,-0.318 0.1328,-0.42 0.0883,-0.103 0.191,-0.153 0.3051,-0.153 0.2832,0 0.5922,0.209 0.925,0.627 0.4461,0.559 0.6691,1.129 0.6691,1.715 0,0.221 -0.0429,0.381 -0.13,0.481 -0.0848,0.099 -0.202,0.148 -0.352,0.148"
         style="fill:#231f20;fill-opacity:1;fill-rule:evenodd;stroke:none;stroke-width:0.1"
         id="path4089-6" />
    </g>
    <path
       d="m 54.303789,54.059494 c 0.02117,-0.09807 0.03669,-0.187325 0.04692,-0.268111 0.0099,-0.08043 0.01517,-0.155222 0.01517,-0.224366 0,-0.115359 -0.01834,-0.202848 -0.05468,-0.26282 -0.03598,-0.05997 -0.08996,-0.08996 -0.160514,-0.08996 -0.09278,0 -0.182739,0.07232 -0.26917,0.218016 -0.08714,0.145345 -0.1651,0.354542 -0.235303,0.627239 z m -0.686153,0.110067 c -0.02963,0.117828 -0.0515,0.224014 -0.06597,0.318558 -0.01411,0.09455 -0.02117,0.178859 -0.02117,0.253648 0,0.105833 0.01799,0.1905 0.05292,0.25153 0.03528,0.06209 0.08361,0.09243 0.144286,0.09243 0.100895,0 0.19932,-0.07937 0.294217,-0.238125 0.0949,-0.159103 0.179211,-0.384881 0.253294,-0.678039 z m -0.318558,0.337256 c 0,-0.138995 0.02152,-0.285398 0.06526,-0.437445 0.04374,-0.151694 0.105481,-0.296333 0.185561,-0.433211 0.09419,-0.161572 0.194028,-0.284339 0.298803,-0.369006 0.105128,-0.08361 0.210961,-0.125941 0.318558,-0.125941 0.13335,0 0.23742,0.05715 0.313267,0.172508 0.07585,0.113947 0.113947,0.272697 0.113947,0.473781 0,0.166864 -0.0254,0.331611 -0.07691,0.496358 -0.0508,0.164394 -0.123119,0.316794 -0.216605,0.4572 -0.09066,0.137583 -0.186972,0.242006 -0.286456,0.313972 -0.100188,0.07197 -0.198613,0.107597 -0.294922,0.107597 -0.128764,0 -0.231069,-0.05856 -0.306564,-0.176388 -0.07585,-0.117475 -0.113947,-0.276931 -0.113947,-0.479425"
       style="fill:#ff0000;fill-opacity:1;fill-rule:evenodd;stroke:none;stroke-width:0.0352778"
       id="path3959" />
    <path
       d="m 55.4101,53.912033 h 1.487731 v 0.112861 H 55.4101 Z m 0,0.448734 h 1.487731 v 0.11286 H 55.4101 Z"
       style="fill:#ff0000;fill-opacity:1;fill-rule:evenodd;stroke:none;stroke-width:0.0352778"
       id="path3961" />
    <path
       d="m 56.826149,58.989817 v 0.05115 c -0.138994,-0.0702 -0.254705,-0.151694 -0.347133,-0.245533 -0.132292,-0.132997 -0.234245,-0.289983 -0.305858,-0.471664 -0.07197,-0.180622 -0.107598,-0.367947 -0.107598,-0.56268 0,-0.285045 0.07056,-0.544689 0.210609,-0.779639 0.140758,-0.234597 0.324202,-0.40252 0.54998,-0.503414 v 0.0575 c -0.112889,0.06279 -0.205669,0.147814 -0.278694,0.256469 -0.07232,0.108303 -0.126295,0.245533 -0.161925,0.411692 -0.03598,0.166511 -0.05398,0.34043 -0.05398,0.521053 0,0.196497 0.01517,0.375355 0.04551,0.536222 0.02399,0.127 0.05292,0.2286 0.08678,0.3048 0.03387,0.07726 0.07973,0.150636 0.136878,0.221191 0.0575,0.07126 0.132645,0.138289 0.225425,0.202848"
       style="fill:#ff0000;fill-opacity:1;fill-rule:evenodd;stroke:none;stroke-width:0.0352778"
       id="path3981" />
    <path
       d="m 58.049935,57.957236 c -0.03351,0.166864 -0.100541,0.294922 -0.200025,0.384175 -0.09878,0.08996 -0.208844,0.134408 -0.329141,0.134408 -0.143228,0 -0.268464,-0.05997 -0.37465,-0.180975 -0.106892,-0.120297 -0.159809,-0.282222 -0.159809,-0.487186 0,-0.198614 0.05927,-0.359833 0.177448,-0.483658 0.117475,-0.124531 0.259291,-0.186267 0.424744,-0.186267 0.123825,0 0.225778,0.03246 0.305858,0.09843 0.07973,0.06562 0.120297,0.134056 0.120297,0.204611 0,0.03528 -0.01164,0.0635 -0.03422,0.08502 -0.02258,0.02152 -0.05398,0.03245 -0.09454,0.03245 -0.05433,0 -0.09525,-0.01729 -0.122414,-0.05221 -0.01588,-0.02011 -0.02646,-0.0568 -0.03104,-0.110419 -0.0053,-0.05433 -0.02399,-0.0956 -0.05574,-0.124178 -0.03245,-0.02787 -0.0769,-0.04127 -0.13335,-0.04127 -0.09278,0 -0.166511,0.03422 -0.222602,0.1016 -0.07408,0.09066 -0.111478,0.20955 -0.111478,0.357011 0,0.149931 0.03669,0.283634 0.111125,0.398992 0.07373,0.115358 0.173567,0.173214 0.299508,0.173214 0.08996,0 0.170745,-0.03069 0.242358,-0.09208 0.05115,-0.04233 0.09984,-0.119239 0.147814,-0.230717 l 0.03986,0.01905"
       style="fill:#ff0000;fill-opacity:1;fill-rule:evenodd;stroke:none;stroke-width:0.0352778"
       id="path3983" />
    <path
       d="m 58.847919,57.137733 c 0.190852,0 0.344311,0.07303 0.460727,0.217311 0.09772,0.124178 0.147109,0.267053 0.147109,0.427567 0,0.113242 -0.02752,0.227542 -0.08185,0.3429 -0.05398,0.116064 -0.128764,0.203553 -0.223661,0.262467 -0.09525,0.05891 -0.201083,0.08784 -0.3175,0.08784 -0.1905,0 -0.341489,-0.07585 -0.453319,-0.227188 -0.0949,-0.127706 -0.14217,-0.271287 -0.14217,-0.429684 0,-0.116769 0.02893,-0.231422 0.08643,-0.345369 0.05715,-0.1143 0.132997,-0.19932 0.22613,-0.253647 0.09384,-0.05503 0.19297,-0.0822 0.298098,-0.0822 z m -0.04304,0.08996 c -0.04833,0 -0.09737,0.01411 -0.146756,0.04304 -0.04904,0.02928 -0.0889,0.07973 -0.118886,0.1524 -0.03069,0.07267 -0.04551,0.165452 -0.04551,0.279047 0,0.184503 0.03704,0.342547 0.109714,0.475544 0.07302,0.13335 0.16898,0.200378 0.288572,0.200378 0.0889,0 0.162278,-0.03669 0.220486,-0.110067 0.05786,-0.07373 0.08643,-0.200025 0.08643,-0.379236 0,-0.224366 -0.04798,-0.400755 -0.144638,-0.529166 -0.06491,-0.08819 -0.148167,-0.131939 -0.249414,-0.131939"
       style="fill:#ff0000;fill-opacity:1;fill-rule:evenodd;stroke:none;stroke-width:0.0352778"
       id="path3985" />
    <path
       d="m 60.009616,57.404786 c 0.147461,-0.1778 0.288572,-0.267053 0.422628,-0.267053 0.06914,0 0.128411,0.01693 0.1778,0.05186 0.05045,0.03422 0.0896,0.09066 0.118533,0.170039 0.02081,0.05503 0.02999,0.1397 0.02999,0.253647 v 0.539044 c 0,0.07902 0.0067,0.133703 0.02046,0.162278 0.0095,0.02258 0.02575,0.04092 0.04833,0.05327 0.02258,0.01341 0.06421,0.02011 0.124883,0.02011 v 0.04939 h -0.624769 v -0.04939 h 0.02646 c 0.05856,0 0.100542,-0.0095 0.123119,-0.02752 0.02364,-0.01764 0.03986,-0.0441 0.04939,-0.07867 0.0035,-0.01376 0.0053,-0.05715 0.0053,-0.12947 v -0.516819 c 0,-0.115006 -0.01517,-0.198614 -0.0448,-0.250472 -0.02999,-0.05151 -0.08043,-0.07761 -0.150636,-0.07761 -0.109361,0 -0.218369,0.05962 -0.326672,0.178506 v 0.666397 c 0,0.08467 0.0049,0.137936 0.01482,0.157692 0.0127,0.02716 0.03069,0.04692 0.05327,0.05891 0.02293,0.01235 0.06844,0.01905 0.136878,0.01905 v 0.04939 h -0.624064 v -0.04939 h 0.02787 c 0.06385,0 0.107597,-0.01693 0.130528,-0.04939 0.02152,-0.03246 0.03281,-0.09454 0.03281,-0.186267 v -0.469194 c 0,-0.151695 -0.0028,-0.243417 -0.01023,-0.276578 -0.0063,-0.03316 -0.01729,-0.05574 -0.0314,-0.06773 -0.01411,-0.01164 -0.03351,-0.01764 -0.0575,-0.01764 -0.0254,0 -0.05645,0.0071 -0.09208,0.02081 l -0.02081,-0.05009 0.380647,-0.154164 h 0.05927 v 0.267053"
       style="fill:#ff0000;fill-opacity:1;fill-rule:evenodd;stroke:none;stroke-width:0.0352778"
       id="path3987" />
    <path
       d="m 61.264799,57.650319 c -7.05e-4,0.187325 0.04445,0.334081 0.136525,0.441325 0.09172,0.106187 0.200378,0.159103 0.323497,0.159103 0.08326,0 0.155223,-0.02258 0.216253,-0.06809 0.06068,-0.0448 0.111478,-0.123472 0.153106,-0.233539 l 0.04269,0.02787 c -0.0194,0.125941 -0.07514,0.240594 -0.16757,0.343605 -0.09349,0.103717 -0.20955,0.155222 -0.348897,0.155222 -0.151694,0 -0.281517,-0.05856 -0.389467,-0.176741 -0.10795,-0.118181 -0.161572,-0.276931 -0.161572,-0.476603 0,-0.2159 0.05468,-0.384175 0.166159,-0.504472 0.110419,-0.121003 0.249413,-0.181681 0.41663,-0.181681 0.141817,0 0.257881,0.04657 0.348192,0.140053 0.09102,0.09243 0.136525,0.218017 0.136525,0.373944 z m 0,-0.07973 h 0.584553 c -0.0049,-0.08149 -0.01411,-0.137936 -0.02893,-0.170745 -0.02328,-0.0515 -0.05715,-0.09172 -0.102658,-0.121355 -0.04621,-0.02928 -0.09349,-0.04445 -0.142875,-0.04445 -0.07585,0 -0.144639,0.02963 -0.204611,0.0889 -0.06032,0.05891 -0.0956,0.142169 -0.105481,0.24765"
       style="fill:#ff0000;fill-opacity:1;fill-rule:evenodd;stroke:none;stroke-width:0.0352778"
       id="path3989" />
    <path
       d="m 62.280446,56.535542 v -0.0575 c 0.1397,0.06809 0.255764,0.14993 0.348898,0.243417 0.13088,0.134408 0.23248,0.291747 0.304094,0.472369 0.07161,0.180622 0.10795,0.368653 0.10795,0.564092 0,0.284691 -0.07056,0.543983 -0.210608,0.778933 -0.140053,0.23495 -0.32385,0.402872 -0.550334,0.504119 v -0.0508 c 0.113242,-0.06385 0.206023,-0.149225 0.278695,-0.257527 0.07303,-0.107598 0.128058,-0.244828 0.162983,-0.412045 0.03528,-0.166864 0.05327,-0.340783 0.05327,-0.521053 0,-0.196144 -0.01588,-0.374297 -0.04586,-0.536222 -0.02293,-0.127 -0.0515,-0.228247 -0.08572,-0.305153 -0.03528,-0.0762 -0.08079,-0.149577 -0.137583,-0.21978 -0.0568,-0.07091 -0.132292,-0.138289 -0.225778,-0.202847"
       style="fill:#ff0000;fill-opacity:1;fill-rule:evenodd;stroke:none;stroke-width:0.0352778"
       id="path3991" />
    <path
       d="m 59.529132,59.264631 c 0,0 1.592792,2.786591 5.343525,4.207227"
       style="fill:none;stroke:#ff0000;stroke-width:0.25;stroke-linecap:butt;stroke-linejoin:miter;stroke-miterlimit:2.61299992;stroke-dasharray:none;stroke-opacity:1"
       id="path4067" />
    <path
       d="m 66.074571,63.926942 -1.205089,-0.924631 c 0.09102,0.346428 -0.01235,0.619478 -0.310091,0.818797 l 1.51518,0.105834"
       style="fill:#ff0000;fill-opacity:1;fill-rule:evenodd;stroke:none;stroke-width:0.0352778"
       id="path4069" />
    <path
       d="m 58.837933,54.156106 c 0.02117,-0.09807 0.03669,-0.187325 0.04692,-0.268111 0.0099,-0.08043 0.01517,-0.155222 0.01517,-0.224366 0,-0.115359 -0.01834,-0.202848 -0.05468,-0.26282 -0.03598,-0.05997 -0.08996,-0.08996 -0.160514,-0.08996 -0.09278,0 -0.182739,0.07232 -0.26917,0.218016 -0.08714,0.145345 -0.1651,0.354542 -0.235303,0.627239 z m -0.686153,0.110067 c -0.02963,0.117828 -0.0515,0.224014 -0.06597,0.318558 -0.01411,0.09455 -0.02117,0.178859 -0.02117,0.253648 0,0.105833 0.01799,0.1905 0.05292,0.25153 0.03528,0.06209 0.08361,0.09243 0.144286,0.09243 0.100895,0 0.19932,-0.07937 0.294217,-0.238125 0.0949,-0.159103 0.179211,-0.384881 0.253294,-0.678039 z m -0.318558,0.337256 c 0,-0.138995 0.02152,-0.285398 0.06526,-0.437445 0.04374,-0.151694 0.105481,-0.296333 0.185561,-0.433211 0.09419,-0.161572 0.194028,-0.284339 0.298803,-0.369006 0.105128,-0.08361 0.210961,-0.125941 0.318558,-0.125941 0.13335,0 0.23742,0.05715 0.313267,0.172508 0.07585,0.113947 0.113947,0.272697 0.113947,0.473781 0,0.166864 -0.0254,0.331611 -0.07691,0.496358 -0.0508,0.164394 -0.123119,0.316794 -0.216605,0.4572 -0.09066,0.137583 -0.186972,0.242006 -0.286456,0.313972 -0.100188,0.07197 -0.198613,0.107597 -0.294922,0.107597 -0.128764,0 -0.231069,-0.05856 -0.306564,-0.176388 -0.07585,-0.117475 -0.113947,-0.276931 -0.113947,-0.479425"
       style="fill:#ff0000;fill-opacity:1;fill-rule:evenodd;stroke:none;stroke-width:0.0352778"
       id="path3959-7" />
    <text
       xml:space="preserve"
       style="font-size:2.82222px;line-height:1.25;font-family:'Times New Roman';-inkscape-font-specification:'Times New Roman, ';fill:#ff0000;stroke-width:0.264583"
       x="58.715424"
       y="56.157719"
       id="text10309"><tspan
         sodipodi:role="line"
         id="tspan10307"
         style="font-size:2.82222px;fill:#ff0000;stroke-width:0.264583"
         x="58.715424"
         y="56.157719">1</tspan></text>
    <g
       id="g13633"
       style="fill:#ff0000">
      <path
         d="m 73.267781,89.810274 0.475897,-0.07726 -0.198614,0.669572 c 0.160867,-0.274814 0.306917,-0.466725 0.43815,-0.575734 0.07444,-0.06279 0.135114,-0.09384 0.182033,-0.09384 0.03034,0 0.05433,0.0092 0.07161,0.02681 0.01729,0.01799 0.02646,0.04374 0.02646,0.07761 0,0.06068 -0.01552,0.118533 -0.04727,0.173214 -0.02187,0.04198 -0.05362,0.06244 -0.0949,0.06244 -0.02117,0 -0.03916,-0.0063 -0.05433,-0.02046 -0.01482,-0.01376 -0.02469,-0.03493 -0.02822,-0.0635 -0.0018,-0.01764 -0.0063,-0.02928 -0.01235,-0.03457 -0.0078,-0.0071 -0.01623,-0.01058 -0.02646,-0.01058 -0.01552,0 -0.02999,0.0035 -0.0441,0.01058 -0.02364,0.01305 -0.06032,0.04868 -0.108655,0.107597 -0.07655,0.08961 -0.159103,0.206375 -0.248003,0.350309 -0.03845,0.06068 -0.07197,0.128411 -0.09913,0.204963 -0.0388,0.104775 -0.06068,0.167923 -0.06597,0.189089 l -0.04445,0.173567 h -0.210961 l 0.255411,-0.855486 c 0.02963,-0.09948 0.0441,-0.170392 0.0441,-0.212725 0,-0.01658 -0.0074,-0.02999 -0.02117,-0.04092 -0.01834,-0.01517 -0.04269,-0.02223 -0.07267,-0.02223 -0.0194,0 -0.05503,0.0042 -0.106539,0.01235 l -0.0099,-0.0508"
         style="fill:#ff0000;fill-opacity:1;fill-rule:evenodd;stroke:none;stroke-width:0.0352778"
         id="path3993" />
      <path
         d="m 74.975225,89.991214 h 1.487593 v 0.112999 h -1.487593 z m 0,0.449087 h 1.487593 v 0.11286 h -1.487593 z"
         style="fill:#ff0000;fill-opacity:1;fill-rule:evenodd;stroke:none;stroke-width:0.0352778"
         id="path3995" />
      <g
         id="g13587"
         transform="translate(0,1.0583333)"
         style="fill:#ff0000">
        <path
           d="m 73.43034,93.895413 v 0.05115 c -0.138641,-0.0695 -0.254352,-0.151342 -0.34678,-0.244828 -0.132292,-0.13335 -0.234597,-0.290689 -0.305858,-0.471311 -0.07197,-0.181328 -0.107598,-0.369006 -0.107598,-0.563739 0,-0.285044 0.07056,-0.544689 0.210609,-0.779286 0.141111,-0.234597 0.32385,-0.402519 0.549627,-0.503767 v 0.0575 c -0.112536,0.06315 -0.205316,0.147814 -0.278341,0.256822 -0.07197,0.10795 -0.126647,0.245534 -0.162278,0.411692 -0.03563,0.166158 -0.05362,0.340431 -0.05362,0.521053 0,0.196497 0.01517,0.375355 0.04516,0.536222 0.02399,0.126647 0.05327,0.2286 0.08714,0.305153 0.03387,0.0769 0.07938,0.150283 0.136878,0.221191 0.05715,0.07056 0.132645,0.138289 0.225072,0.202142"
           style="fill:#ff0000;fill-opacity:1;fill-rule:evenodd;stroke:none;stroke-width:0.0352778"
           id="path4015" />
        <path
           d="m 74.39801,92.04333 v 0.430389 H 74.3525 c -0.03493,-0.135467 -0.07937,-0.226836 -0.134056,-0.276225 -0.05503,-0.04798 -0.124531,-0.07267 -0.208844,-0.07267 -0.06456,0 -0.116417,0.01729 -0.155928,0.05115 -0.03916,0.03422 -0.05891,0.07161 -0.05891,0.113242 0,0.05115 0.01446,0.0956 0.04339,0.132292 0.02893,0.03739 0.08678,0.07726 0.174272,0.119591 l 0.201083,0.09772 c 0.186267,0.09102 0.279753,0.210961 0.279753,0.359833 0,0.115006 -0.04339,0.207081 -0.130528,0.277636 -0.08643,0.0702 -0.183797,0.105128 -0.291042,0.105128 -0.07761,0 -0.165805,-0.01341 -0.264936,-0.04092 -0.02999,-0.0092 -0.05503,-0.01376 -0.07444,-0.01376 -0.02081,0 -0.03739,0.01129 -0.04939,0.03563 h -0.04551 v -0.45085 h 0.04551 c 0.0254,0.128764 0.07514,0.225778 0.147814,0.291042 0.07232,0.06526 0.153459,0.09737 0.243064,0.09737 0.0635,0 0.115358,-0.01764 0.155575,-0.05503 0.03986,-0.03739 0.05962,-0.0822 0.05962,-0.134408 0,-0.0635 -0.02222,-0.11677 -0.06703,-0.160162 -0.0441,-0.04304 -0.132997,-0.09807 -0.2667,-0.164394 -0.132997,-0.06597 -0.220134,-0.125236 -0.261409,-0.178506 -0.04092,-0.05256 -0.06209,-0.118533 -0.06209,-0.198261 0,-0.104069 0.03634,-0.190852 0.106891,-0.260702 0.07091,-0.0695 0.162984,-0.105128 0.275872,-0.105128 0.05045,0 0.11042,0.01129 0.180623,0.03245 0.04763,0.01341 0.07832,0.02046 0.09384,0.02046 0.01482,0 0.02646,-0.0032 0.03457,-0.0099 0.0085,-0.0064 0.01799,-0.02081 0.02893,-0.04304 h 0.04551"
           style="fill:#ff0000;fill-opacity:1;fill-rule:evenodd;stroke:none;stroke-width:0.0352778"
           id="path4017" />
        <path
           d="m 74.589568,92.20596 0.388761,-0.156633 h 0.05221 v 0.294922 c 0.06526,-0.111125 0.130528,-0.189089 0.196498,-0.234244 0.06562,-0.0441 0.134761,-0.06668 0.207433,-0.06668 0.126647,0 0.232481,0.05009 0.316794,0.149578 0.103717,0.121002 0.155575,0.278694 0.155575,0.47378 0,0.217311 -0.06209,0.397581 -0.187677,0.540103 -0.102306,0.116417 -0.232128,0.174625 -0.388056,0.174625 -0.06809,0 -0.127,-0.0088 -0.176389,-0.02928 -0.03704,-0.01305 -0.07832,-0.04022 -0.124178,-0.08184 v 0.384175 c 0,0.08643 0.0056,0.141111 0.01552,0.164747 0.01094,0.02364 0.02928,0.04233 0.05574,0.05609 0.02575,0.01305 0.07338,0.02011 0.142522,0.02011 v 0.05115 h -0.661459 v -0.05115 h 0.03422 c 0.0508,0.0011 0.09419,-0.0085 0.129469,-0.02893 0.01729,-0.0095 0.03104,-0.02611 0.04127,-0.04868 0.0092,-0.02258 0.01411,-0.07937 0.01411,-0.17145 v -1.193447 c 0,-0.08149 -0.0035,-0.133703 -0.01129,-0.155575 -0.0074,-0.02223 -0.0187,-0.03881 -0.03493,-0.04974 -0.01623,-0.01129 -0.03775,-0.01623 -0.06562,-0.01623 -0.02187,0 -0.04939,0.006 -0.08431,0.0187 z m 0.440972,0.219428 v 0.470958 c 0,0.102306 0.0042,0.168981 0.01235,0.201789 0.0127,0.05327 0.0441,0.09948 0.0949,0.140053 0.04939,0.04022 0.112536,0.06103 0.189089,0.06103 0.09207,0 0.166511,-0.03598 0.223308,-0.107598 0.07444,-0.09349 0.111125,-0.225425 0.111125,-0.395463 0,-0.193323 -0.04163,-0.341489 -0.125942,-0.444853 -0.05891,-0.07232 -0.129469,-0.107597 -0.209902,-0.107597 -0.0441,0 -0.08784,0.01129 -0.131234,0.03281 -0.03281,0.01658 -0.08749,0.06632 -0.163689,0.148872"
           style="fill:#ff0000;fill-opacity:1;fill-rule:evenodd;stroke:none;stroke-width:0.0352778"
           id="path4019" />
        <path
           d="m 76.462818,91.383635 v 0.923573 c 0.1016,-0.112184 0.182034,-0.18415 0.241653,-0.2159 0.05997,-0.0321 0.119592,-0.04798 0.179211,-0.04798 0.07161,0 0.13335,0.02011 0.185208,0.05927 0.05115,0.03986 0.08925,0.101953 0.114653,0.18662 0.01693,0.05891 0.0254,0.165453 0.0254,0.322086 v 0.446617 c 0,0.07973 0.0063,0.134761 0.01976,0.164041 0.0088,0.02223 0.02434,0.03951 0.04657,0.05256 0.02222,0.0127 0.06244,0.01905 0.121356,0.01905 v 0.04974 H 76.77679 v -0.04974 h 0.02857 c 0.05891,0 0.09984,-0.0092 0.122767,-0.02716 0.02293,-0.01799 0.03916,-0.0441 0.04833,-0.07902 0.0025,-0.01446 0.0039,-0.0575 0.0039,-0.129469 v -0.446617 c 0,-0.137583 -0.0071,-0.227894 -0.02117,-0.271286 -0.01482,-0.04339 -0.0374,-0.07585 -0.06809,-0.09737 -0.0314,-0.02117 -0.0695,-0.0321 -0.113594,-0.0321 -0.0448,0 -0.09172,0.01164 -0.1397,0.03598 -0.04939,0.02399 -0.107597,0.07197 -0.174978,0.144639 v 0.66675 c 0,0.08643 0.0042,0.1397 0.01411,0.161219 0.0095,0.02117 0.02752,0.03916 0.05362,0.05327 0.02611,0.01376 0.07126,0.02117 0.135819,0.02117 v 0.04974 h -0.625828 v -0.04974 c 0.05574,0 0.100189,-0.0085 0.131939,-0.02611 0.0187,-0.0092 0.03351,-0.02681 0.04445,-0.05221 0.01164,-0.02575 0.01658,-0.07796 0.01658,-0.157339 v -1.142295 c 0,-0.144286 -0.0035,-0.232833 -0.01058,-0.265994 -0.0063,-0.03316 -0.01729,-0.05574 -0.0314,-0.06738 -0.01411,-0.01235 -0.03351,-0.01799 -0.0575,-0.01799 -0.01905,0 -0.05045,0.0071 -0.09349,0.02223 l -0.01905,-0.04833 0.377472,-0.154517 h 0.06385"
           style="fill:#ff0000;fill-opacity:1;fill-rule:evenodd;stroke:none;stroke-width:0.0352778"
           id="path4021" />
        <path
           d="m 77.715179,92.556269 c -0.0011,0.187677 0.0441,0.334433 0.136173,0.441325 0.09172,0.106186 0.200024,0.159455 0.323497,0.159455 0.0829,0 0.155222,-0.02258 0.2159,-0.06879 0.06138,-0.0448 0.112183,-0.122767 0.153458,-0.232834 l 0.04269,0.02681 c -0.01905,0.126648 -0.07514,0.2413 -0.167922,0.344311 -0.09313,0.103012 -0.208845,0.15487 -0.348192,0.15487 -0.152047,0 -0.281869,-0.05856 -0.389466,-0.176742 -0.108303,-0.117828 -0.161573,-0.276578 -0.161573,-0.47625 0,-0.2159 0.05468,-0.384175 0.165453,-0.504825 0.110772,-0.121003 0.249414,-0.181328 0.416983,-0.181328 0.141464,0 0.257528,0.04621 0.348545,0.140053 0.09066,0.09313 0.136172,0.217664 0.136172,0.373945 z m 0,-0.08008 h 0.584553 c -0.0053,-0.08079 -0.01446,-0.137936 -0.02928,-0.170392 -0.02293,-0.05151 -0.0575,-0.09243 -0.102658,-0.121355 -0.04551,-0.02928 -0.09349,-0.0448 -0.142875,-0.0448 -0.0762,0 -0.144286,0.02963 -0.204611,0.08925 -0.06033,0.05927 -0.09525,0.142169 -0.105128,0.247297"
           style="fill:#ff0000;fill-opacity:1;fill-rule:evenodd;stroke:none;stroke-width:0.0352778"
           id="path4023" />
        <path
           d="m 79.124526,92.04333 v 0.284339 c 0.105481,-0.189442 0.214137,-0.284339 0.325262,-0.284339 0.05009,0 0.09208,0.01552 0.125588,0.04657 0.03316,0.03069 0.04939,0.06668 0.04939,0.106539 0,0.03634 -0.01199,0.06632 -0.03598,0.09137 -0.02364,0.02469 -0.05221,0.03704 -0.08502,0.03704 -0.03246,0 -0.06879,-0.01623 -0.108656,-0.04762 -0.03986,-0.0314 -0.0695,-0.04727 -0.0889,-0.04727 -0.01658,0 -0.03422,0.0088 -0.05362,0.02681 -0.04092,0.03775 -0.08431,0.100189 -0.128059,0.18662 v 0.605014 c 0,0.06914 0.0085,0.122766 0.02646,0.158397 0.01164,0.02505 0.03281,0.04551 0.06315,0.06209 0.03034,0.01658 0.07373,0.02469 0.130528,0.02469 v 0.04974 H 78.69838 v -0.04974 c 0.06456,0 0.112536,-0.0099 0.143933,-0.03034 0.02258,-0.01482 0.03881,-0.0381 0.04798,-0.06985 0.0046,-0.01623 0.0067,-0.06033 0.0067,-0.134761 v -0.488597 c 0,-0.146756 -0.0028,-0.234244 -0.0085,-0.262467 -0.006,-0.02822 -0.01693,-0.04833 -0.03351,-0.06103 -0.01587,-0.0127 -0.03598,-0.0194 -0.05997,-0.0194 -0.02822,0 -0.06033,0.0071 -0.09666,0.02046 l -0.01341,-0.05009 0.381706,-0.154164 h 0.05786"
           style="fill:#ff0000;fill-opacity:1;fill-rule:evenodd;stroke:none;stroke-width:0.0352778"
           id="path4025" />
        <path
           d="m 79.90734,92.556269 c -0.0011,0.187677 0.0441,0.334433 0.136525,0.441325 0.09208,0.106186 0.199673,0.159455 0.323498,0.159455 0.0829,0 0.154869,-0.02258 0.2159,-0.06879 0.06103,-0.0448 0.112183,-0.122767 0.153458,-0.232834 l 0.04269,0.02681 c -0.0194,0.126648 -0.07514,0.2413 -0.167922,0.344311 -0.09278,0.103012 -0.208845,0.15487 -0.348545,0.15487 -0.152047,0 -0.281869,-0.05856 -0.389114,-0.176742 -0.108655,-0.117828 -0.161925,-0.276578 -0.161925,-0.47625 0,-0.2159 0.05468,-0.384175 0.165806,-0.504825 0.110772,-0.121003 0.249414,-0.181328 0.416631,-0.181328 0.141816,0 0.25788,0.04621 0.348544,0.140053 0.09102,0.09313 0.136525,0.217664 0.136525,0.373945 z m 0,-0.08008 h 0.5842 c -0.0046,-0.08079 -0.01411,-0.137936 -0.02928,-0.170392 -0.02258,-0.05151 -0.0568,-0.09243 -0.102306,-0.121355 -0.04551,-0.02928 -0.09313,-0.0448 -0.142522,-0.0448 -0.0762,0 -0.144639,0.02963 -0.204611,0.08925 -0.06033,0.05927 -0.09525,0.142169 -0.105481,0.247297"
           style="fill:#ff0000;fill-opacity:1;fill-rule:evenodd;stroke:none;stroke-width:0.0352778"
           id="path4027" />
        <path
           d="m 80.922988,91.441138 v -0.0575 c 0.140052,0.06879 0.256116,0.150284 0.348544,0.244123 0.131233,0.134055 0.233186,0.290688 0.304447,0.472016 0.07161,0.180622 0.107597,0.368653 0.107597,0.564445 0,0.283986 -0.0702,0.543983 -0.209902,0.77858 -0.140759,0.23495 -0.32385,0.402872 -0.550686,0.503767 v -0.05115 c 0.112888,-0.06315 0.206022,-0.148519 0.278694,-0.257175 0.07303,-0.107244 0.127706,-0.244828 0.162983,-0.411692 0.03563,-0.166511 0.05292,-0.34043 0.05292,-0.521405 0,-0.195439 -0.01517,-0.374297 -0.04516,-0.536222 -0.02328,-0.126648 -0.05221,-0.228248 -0.08643,-0.304448 -0.03493,-0.0762 -0.08043,-0.149577 -0.137231,-0.220133 -0.0568,-0.07126 -0.132291,-0.138642 -0.225777,-0.2032"
           style="fill:#ff0000;fill-opacity:1;fill-rule:evenodd;stroke:none;stroke-width:0.0352778"
           id="path4029" />
      </g>
      <g
         id="g13596"
         transform="translate(-12.170835)"
         style="fill:#ff0000">
        <path
           d="m 89.98356,89.657341 0.475897,-0.07726 -0.198614,0.669572 c 0.160867,-0.274814 0.306917,-0.466725 0.43815,-0.575734 0.07444,-0.06279 0.135114,-0.09384 0.182033,-0.09384 0.03034,0 0.05433,0.0092 0.07161,0.02681 0.01729,0.01799 0.02646,0.04374 0.02646,0.07761 0,0.06068 -0.01552,0.118533 -0.04727,0.173214 -0.02187,0.04198 -0.05362,0.06244 -0.0949,0.06244 -0.02117,0 -0.03916,-0.0063 -0.05433,-0.02046 -0.01482,-0.01376 -0.02469,-0.03493 -0.02822,-0.0635 -0.0018,-0.01764 -0.0063,-0.02928 -0.01235,-0.03457 -0.0078,-0.0071 -0.01623,-0.01058 -0.02646,-0.01058 -0.01552,0 -0.02999,0.0035 -0.0441,0.01058 -0.02364,0.01305 -0.06032,0.04868 -0.108655,0.107597 -0.07655,0.08961 -0.159103,0.206375 -0.248003,0.350309 -0.03845,0.06068 -0.07197,0.128411 -0.09913,0.204963 -0.0388,0.104775 -0.06068,0.167923 -0.06597,0.189089 l -0.04445,0.173567 h -0.210961 l 0.255411,-0.855486 c 0.02963,-0.09948 0.0441,-0.170392 0.0441,-0.212725 0,-0.01658 -0.0074,-0.02999 -0.02117,-0.04092 -0.01834,-0.01517 -0.04269,-0.02223 -0.07267,-0.02223 -0.0194,0 -0.05503,0.0042 -0.106539,0.01235 l -0.0099,-0.0508"
           style="fill:#ff0000;fill-opacity:1;fill-rule:evenodd;stroke:none;stroke-width:0.0352778"
           id="path3993-1" />
        <text
           xml:space="preserve"
           style="font-size:2.82222px;line-height:1.25;font-family:'Times New Roman';-inkscape-font-specification:'Times New Roman, ';fill:#ff0000;stroke-width:0.264583"
           x="90.628571"
           y="92.215553"
           id="text10309-1"><tspan
             sodipodi:role="line"
             id="tspan10307-9"
             style="font-size:2.82222px;fill:#ff0000;stroke-width:0.264583"
             x="90.628571"
             y="92.215553">1</tspan></text>
      </g>
    </g>
    <g
       id="g13648"
       style="fill:#ff0000">
      <path
         d="m 95.993654,82.945544 c 0.159103,-0.04516 0.296686,-0.148167 0.41275,-0.305858 0.116064,-0.158398 0.174272,-0.314325 0.174272,-0.466725 0,-0.111831 -0.02505,-0.200378 -0.07549,-0.265289 -0.0508,-0.06526 -0.127706,-0.106892 -0.231423,-0.127353 z m 0.135467,-1.163814 c -0.07338,0.0078 -0.141464,0.02822 -0.203553,0.06174 -0.06174,0.03422 -0.12065,0.08326 -0.177095,0.14605 -0.07514,0.08678 -0.134761,0.184856 -0.178505,0.295981 -0.04445,0.110772 -0.06668,0.216958 -0.06668,0.318911 0,0.09913 0.02328,0.177447 0.0695,0.235655 0.04657,0.05786 0.117122,0.09596 0.211667,0.1143 z m -0.157339,1.263297 -0.144992,0.583847 h -0.236361 l 0.172155,-0.589844 c -0.160866,-0.02575 -0.286455,-0.0889 -0.376413,-0.187678 -0.08996,-0.09878 -0.135114,-0.223308 -0.135114,-0.373944 0,-0.207786 0.08784,-0.38982 0.263877,-0.547159 0.176037,-0.156986 0.390878,-0.242358 0.645584,-0.254705 l 0.161572,-0.558447 h 0.108656 l -0.135114,0.563739 c 0.172155,0.01693 0.307269,0.07161 0.407458,0.164747 0.09913,0.09313 0.148872,0.211666 0.148872,0.354894 0,0.19932 -0.08502,0.382411 -0.255058,0.54857 -0.170745,0.166158 -0.378883,0.264936 -0.625122,0.29598"
         style="fill:#ff0000;fill-opacity:1;fill-rule:evenodd;stroke:none;stroke-width:0.0352778"
         id="path4031" />
      <path
         d="m 100.7094,83.069661 c 0.1591,-0.04516 0.29668,-0.148167 0.41275,-0.305858 0.11606,-0.158398 0.17427,-0.314325 0.17427,-0.466725 0,-0.111831 -0.025,-0.200378 -0.0755,-0.265289 -0.0508,-0.06526 -0.12771,-0.106892 -0.23143,-0.127353 z m 0.13546,-1.163814 c -0.0734,0.0078 -0.14146,0.02822 -0.20355,0.06174 -0.0617,0.03422 -0.12065,0.08326 -0.1771,0.14605 -0.0751,0.08678 -0.13476,0.184856 -0.1785,0.295981 -0.0444,0.110772 -0.0667,0.216958 -0.0667,0.318911 0,0.09913 0.0233,0.177447 0.0695,0.235655 0.0466,0.05786 0.11712,0.09596 0.21166,0.1143 z m -0.15734,1.263297 -0.14499,0.583847 h -0.23636 l 0.17215,-0.589844 c -0.16086,-0.02575 -0.28645,-0.0889 -0.37641,-0.187678 -0.09,-0.09878 -0.135114,-0.223308 -0.135114,-0.373944 0,-0.207786 0.08784,-0.38982 0.263874,-0.547159 0.17604,-0.156986 0.39088,-0.242358 0.64559,-0.254705 l 0.16157,-0.558447 h 0.10866 l -0.13512,0.563739 c 0.17216,0.01693 0.30728,0.07161 0.40746,0.164747 0.0991,0.09313 0.14888,0.211666 0.14888,0.354894 0,0.19932 -0.085,0.382411 -0.25506,0.54857 -0.17075,0.166158 -0.37889,0.264936 -0.62513,0.29598"
         style="fill:#ff0000;fill-opacity:1;fill-rule:evenodd;stroke:none;stroke-width:0.0352778"
         id="path4031-6" />
      <path
         d="m 97.754721,82.041214 h 1.487318 v 0.11286 h -1.487318 z m 0,0.449086 h 1.487318 v 0.112998 h -1.487318 z"
         style="fill:#ff0000;fill-opacity:1;fill-rule:evenodd;stroke:none;stroke-width:0.0352778"
         id="path4033" />
      <g
         id="g13577"
         transform="translate(-4.2333335,0.52916667)"
         style="fill:#ff0000">
        <path
           d="m 100.20864,86.732966 v 0.0508 c -0.13864,-0.06985 -0.254703,-0.151694 -0.346778,-0.245181 -0.132292,-0.132997 -0.234244,-0.290336 -0.305858,-0.471311 -0.07232,-0.180975 -0.10795,-0.368652 -0.10795,-0.563738 0,-0.284692 0.07055,-0.544689 0.210608,-0.779639 0.140758,-0.234598 0.324203,-0.402167 0.549978,-0.503061 v 0.0575 c -0.11253,0.06244 -0.20567,0.147814 -0.278692,0.25647 -0.07232,0.10795 -0.125941,0.245533 -0.162278,0.412044 -0.03528,0.165806 -0.05327,0.340078 -0.05327,0.5207 0,0.196145 0.01517,0.375356 0.04516,0.536222 0.02364,0.127 0.05292,0.2286 0.08714,0.305153 0.03351,0.07655 0.07902,0.150636 0.136525,0.221192 0.05785,0.07091 0.132645,0.138289 0.225425,0.202847"
           style="fill:#ff0000;fill-opacity:1;fill-rule:evenodd;stroke:none;stroke-width:0.0352778"
           id="path4053" />
        <path
           d="m 100.26932,85.043161 0.38876,-0.157339 h 0.0522 v 0.295275 c 0.0653,-0.111478 0.13053,-0.189089 0.1965,-0.233892 0.0656,-0.0441 0.13476,-0.06668 0.20708,-0.06668 0.127,0 0.23283,0.04939 0.31715,0.149225 0.10371,0.121003 0.15557,0.278694 0.15557,0.473781 0,0.217663 -0.0621,0.39758 -0.18768,0.540102 -0.1023,0.11677 -0.23248,0.174978 -0.38805,0.174978 -0.0681,0 -0.127,-0.0095 -0.17639,-0.02893 -0.037,-0.01376 -0.0787,-0.04092 -0.12418,-0.08255 v 0.384528 c 0,0.08643 0.006,0.141111 0.0155,0.164394 0.0109,0.02328 0.0293,0.04233 0.0554,0.05609 0.0261,0.01376 0.0737,0.02081 0.14252,0.02081 v 0.0508 h -0.6611 v -0.0508 h 0.0342 c 0.0508,7.06e-4 0.0938,-0.0095 0.12947,-0.02928 0.0173,-0.01023 0.031,-0.02646 0.0409,-0.04904 0.01,-0.02258 0.0145,-0.07938 0.0145,-0.171097 v -1.194153 c 0,-0.08114 -0.004,-0.133702 -0.0113,-0.155575 -0.007,-0.02223 -0.0187,-0.03845 -0.0349,-0.04904 -0.0162,-0.01129 -0.0378,-0.01658 -0.0656,-0.01658 -0.0219,0 -0.0497,0.006 -0.0843,0.0194 z m 0.44097,0.219427 v 0.471311 c 0,0.101953 0.004,0.168628 0.0123,0.201084 0.0127,0.05292 0.0441,0.09984 0.0949,0.140405 0.0494,0.04022 0.11253,0.06068 0.18909,0.06068 0.0921,0 0.16615,-0.03598 0.2233,-0.107244 0.0744,-0.09384 0.11113,-0.225778 0.11113,-0.395817 0,-0.192617 -0.0416,-0.341489 -0.1263,-0.444853 -0.0586,-0.07197 -0.12911,-0.107597 -0.20955,-0.107597 -0.0441,0 -0.0878,0.01094 -0.13123,0.03246 -0.0328,0.01729 -0.0875,0.06632 -0.16369,0.149577"
           style="fill:#ff0000;fill-opacity:1;fill-rule:evenodd;stroke:none;stroke-width:0.0352778"
           id="path4055" />
        <path
           d="m 102.20501,84.220836 v 1.674283 c 0,0.07867 0.006,0.131233 0.0176,0.156986 0.0113,0.0254 0.0289,0.04516 0.0533,0.05856 0.024,0.01305 0.0681,0.02011 0.13335,0.02011 v 0.04939 h -0.61842 v -0.04939 c 0.0582,0 0.0974,-0.006 0.11818,-0.0187 0.0208,-0.01129 0.0381,-0.03104 0.0497,-0.05891 0.0116,-0.02716 0.0176,-0.08043 0.0176,-0.158044 V 84.74824 c 0,-0.142875 -0.003,-0.230364 -0.009,-0.262466 -0.007,-0.03246 -0.0166,-0.05539 -0.0307,-0.06668 -0.0148,-0.01235 -0.0325,-0.01834 -0.055,-0.01834 -0.024,0 -0.054,0.0071 -0.0907,0.02258 l -0.0236,-0.04833 0.37642,-0.154163 h 0.0614"
           style="fill:#ff0000;fill-opacity:1;fill-rule:evenodd;stroke:none;stroke-width:0.0352778"
           id="path4057" />
        <path
           d="m 103.2704,85.99813 c -0.12876,0.09984 -0.21061,0.158044 -0.24412,0.173214 -0.0494,0.02293 -0.10195,0.03528 -0.15805,0.03528 -0.0875,0 -0.15945,-0.03034 -0.2159,-0.08996 -0.0561,-0.05962 -0.084,-0.138289 -0.084,-0.235655 0,-0.06209 0.0134,-0.114653 0.0413,-0.159809 0.037,-0.06209 0.10266,-0.121002 0.19579,-0.176388 0.0931,-0.05503 0.24871,-0.122414 0.46496,-0.201084 v -0.04974 c 0,-0.125589 -0.0198,-0.21202 -0.0596,-0.259292 -0.0395,-0.04692 -0.0981,-0.06985 -0.17427,-0.06985 -0.0579,0 -0.10407,0.01552 -0.13794,0.04692 -0.0349,0.03104 -0.0519,0.06668 -0.0519,0.107245 l 0.002,0.08008 c 0,0.04233 -0.0109,0.07479 -0.0321,0.09737 -0.0222,0.02293 -0.0504,0.03457 -0.085,0.03457 -0.0342,0 -0.0617,-0.01199 -0.084,-0.03563 -0.0212,-0.02399 -0.0324,-0.0568 -0.0324,-0.09772 0,-0.07902 0.0409,-0.151694 0.12135,-0.218369 0.0815,-0.06526 0.19438,-0.09878 0.34078,-0.09878 0.11183,0 0.20356,0.0187 0.27552,0.05609 0.054,0.02893 0.0942,0.07338 0.11995,0.134408 0.0166,0.03951 0.0243,0.119944 0.0243,0.242358 v 0.428272 c 0,0.12065 0.002,0.194028 0.007,0.221545 0.005,0.02681 0.0123,0.04515 0.0226,0.05397 0.0113,0.0095 0.0236,0.01411 0.0367,0.01411 0.0148,0 0.0279,-0.0032 0.0388,-0.0095 0.019,-0.01235 0.0564,-0.04586 0.11183,-0.100894 v 0.07726 c -0.10266,0.137936 -0.20144,0.20708 -0.29492,0.20708 -0.0448,0 -0.0808,-0.01552 -0.1076,-0.04727 -0.0268,-0.03104 -0.0402,-0.08467 -0.0416,-0.159808 z m 0,-0.08925 v -0.481189 c -0.13864,0.05539 -0.22789,0.09454 -0.26846,0.117123 -0.073,0.04022 -0.12418,0.0822 -0.15523,0.126647 -0.0321,0.0441 -0.0476,0.09243 -0.0476,0.144991 0,0.06597 0.0201,0.121003 0.0593,0.164395 0.0395,0.04339 0.0854,0.06526 0.13687,0.06526 0.0698,0 0.16193,-0.04551 0.27517,-0.137231"
           style="fill:#ff0000;fill-opacity:1;fill-rule:evenodd;stroke:none;stroke-width:0.0352778"
           id="path4059" />
        <path
           d="m 104.17598,85.148288 c 0.14782,-0.178505 0.28928,-0.267758 0.42298,-0.267758 0.0695,0 0.12877,0.01729 0.1778,0.05186 0.0497,0.03387 0.0893,0.09102 0.11818,0.170039 0.0205,0.05468 0.0303,0.1397 0.0303,0.253295 v 0.539397 c 0,0.07938 0.007,0.134055 0.0198,0.162278 0.01,0.02293 0.0261,0.04057 0.0494,0.05398 0.0215,0.0127 0.0635,0.0194 0.12417,0.0194 v 0.04939 h -0.62441 v -0.04939 h 0.0261 c 0.0593,0 0.10019,-0.0099 0.12312,-0.02716 0.0236,-0.01799 0.0406,-0.04445 0.049,-0.07937 0.004,-0.01341 0.006,-0.0568 0.006,-0.129116 v -0.517172 c 0,-0.114653 -0.0152,-0.198261 -0.0448,-0.250473 -0.03,-0.05151 -0.0808,-0.07726 -0.15134,-0.07726 -0.10901,0 -0.21802,0.05997 -0.32632,0.179211 v 0.665692 c 0,0.08467 0.005,0.137583 0.0152,0.158044 0.0127,0.02681 0.0303,0.04657 0.0533,0.05891 0.0222,0.01199 0.0681,0.0187 0.13653,0.0187 v 0.04939 h -0.62372 v -0.04939 h 0.0275 c 0.0639,0 0.1076,-0.01658 0.13018,-0.04904 0.0222,-0.03281 0.0339,-0.0949 0.0339,-0.186619 v -0.468842 c 0,-0.152047 -0.004,-0.243769 -0.0109,-0.27693 -0.006,-0.03316 -0.0169,-0.05574 -0.0311,-0.06738 -0.0145,-0.01235 -0.0339,-0.01799 -0.0578,-0.01799 -0.0254,0 -0.0565,0.0071 -0.0917,0.02081 l -0.0212,-0.05009 0.38064,-0.154164 h 0.0593 v 0.267758"
           style="fill:#ff0000;fill-opacity:1;fill-rule:evenodd;stroke:none;stroke-width:0.0352778"
           id="path4061" />
        <path
           d="m 105.43187,85.392763 c -0.001,0.188031 0.0441,0.334786 0.13617,0.441678 0.0914,0.106186 0.19967,0.159103 0.3235,0.159103 0.0825,0 0.15452,-0.02223 0.2159,-0.06773 0.0614,-0.04515 0.11183,-0.123472 0.15311,-0.233538 l 0.0427,0.02752 c -0.019,0.125942 -0.0748,0.240595 -0.16792,0.343606 -0.0928,0.103716 -0.2092,0.155222 -0.34784,0.155222 -0.1524,0 -0.28187,-0.05856 -0.38982,-0.176742 -0.1083,-0.11818 -0.16192,-0.27693 -0.16192,-0.476602 0,-0.2159 0.055,-0.384175 0.1658,-0.504473 0.11077,-0.121002 0.24942,-0.18168 0.41698,-0.18168 0.14147,0 0.25753,0.04657 0.3489,0.140053 0.0907,0.09313 0.13582,0.218016 0.13582,0.373591 z m 0,-0.07937 h 0.58385 c -0.005,-0.08114 -0.0145,-0.137936 -0.0293,-0.171097 -0.0222,-0.05151 -0.0568,-0.09137 -0.10266,-0.121003 -0.0455,-0.02928 -0.0931,-0.04445 -0.14217,-0.04445 -0.0765,0 -0.14429,0.02963 -0.20461,0.0889 -0.06,0.05927 -0.096,0.14217 -0.10513,0.24765"
           style="fill:#ff0000;fill-opacity:1;fill-rule:evenodd;stroke:none;stroke-width:0.0352778"
           id="path4063" />
        <path
           d="m 106.44716,84.278338 v -0.0575 c 0.13935,0.06844 0.25577,0.149577 0.3482,0.243769 0.13123,0.133703 0.23283,0.291394 0.30444,0.471664 0.072,0.180975 0.1076,0.369005 0.1076,0.564797 0,0.284339 -0.0699,0.543983 -0.21025,0.778933 -0.14006,0.234598 -0.3235,0.40252 -0.54999,0.503767 v -0.0508 c 0.11254,-0.0635 0.20603,-0.149578 0.27905,-0.257528 0.0727,-0.107597 0.127,-0.24518 0.16263,-0.412044 0.0349,-0.166511 0.0529,-0.340784 0.0529,-0.521053 0,-0.195792 -0.0155,-0.374297 -0.0455,-0.536222 -0.0229,-0.127 -0.0515,-0.228247 -0.0864,-0.305153 -0.0346,-0.07585 -0.0801,-0.149225 -0.13723,-0.220133 -0.0568,-0.07056 -0.13194,-0.137936 -0.22543,-0.202495"
           style="fill:#ff0000;fill-opacity:1;fill-rule:evenodd;stroke:none;stroke-width:0.0352778"
           id="path4065" />
      </g>
      <text
         xml:space="preserve"
         style="font-size:2.82222px;line-height:1.25;font-family:'Times New Roman';-inkscape-font-specification:'Times New Roman, ';fill:#ff0000;stroke-width:0.264583"
         x="101.62078"
         y="84.243591"
         id="text10309-1-1"><tspan
           sodipodi:role="line"
           id="tspan10307-9-4"
           style="font-size:2.82222px;fill:#ff0000;stroke-width:0.264583"
           x="101.62078"
           y="84.243591">1</tspan></text>
    </g>
  </g>
</svg>
