<?xml version="1.0" encoding="UTF-8" standalone="no"?>
<!-- Created with Inkscape (http://www.inkscape.org/) -->

<svg
   version="1.1"
   id="svg4024"
   xml:space="preserve"
   width="235.13194"
   height="200.07599"
   viewBox="0 0 235.13194 200.07599"
   sodipodi:docname="unitvector2.svg"
   inkscape:version="1.1 (c68e22c387, 2021-05-23)"
   xmlns:inkscape="http://www.inkscape.org/namespaces/inkscape"
   xmlns:sodipodi="http://sodipodi.sourceforge.net/DTD/sodipodi-0.dtd"
   xmlns="http://www.w3.org/2000/svg"
   xmlns:svg="http://www.w3.org/2000/svg"><defs
     id="defs4028"><linearGradient
       x1="0"
       y1="0"
       x2="1"
       y2="0"
       gradientUnits="userSpaceOnUse"
       gradientTransform="matrix(-30.278,19.198395,46.3479,73.095795,311.83681,524.85069)"
       spreadMethod="pad"
       id="linearGradient4072"><stop
         style="stop-opacity:1;stop-color:#f2fbfe"
         offset="0"
         id="stop4068" /><stop
         style="stop-opacity:1;stop-color:#66cef5"
         offset="1"
         id="stop4070" /></linearGradient><linearGradient
       x1="0"
       y1="0"
       x2="1"
       y2="0"
       gradientUnits="userSpaceOnUse"
       gradientTransform="matrix(0,27.9077,113.9077,0,221.2914,583.47369)"
       spreadMethod="pad"
       id="linearGradient4092"><stop
         style="stop-opacity:1;stop-color:#f2fbfe"
         offset="0"
         id="stop4088" /><stop
         style="stop-opacity:1;stop-color:#d9f3fd"
         offset="1"
         id="stop4090" /></linearGradient><linearGradient
       x1="0"
       y1="0"
       x2="1"
       y2="0"
       gradientUnits="userSpaceOnUse"
       gradientTransform="matrix(0,52.906692,87.149902,0,221.2914,530.8956)"
       spreadMethod="pad"
       id="linearGradient4112"><stop
         style="stop-opacity:1;stop-color:#f2fbfe"
         offset="0"
         id="stop4108" /><stop
         style="stop-opacity:1;stop-color:#99def9"
         offset="1"
         id="stop4110" /></linearGradient></defs><sodipodi:namedview
     id="namedview4026"
     pagecolor="#ffffff"
     bordercolor="#666666"
     borderopacity="1.0"
     inkscape:pageshadow="2"
     inkscape:pageopacity="0.0"
     inkscape:pagecheckerboard="0"
     showgrid="false"
     fit-margin-top="0"
     fit-margin-left="0"
     fit-margin-right="0"
     fit-margin-bottom="0"
     inkscape:zoom="1.4142136"
     inkscape:cx="307.2379"
     inkscape:cy="144.60334"
     inkscape:window-width="1280"
     inkscape:window-height="995"
     inkscape:window-x="1351"
     inkscape:window-y="-9"
     inkscape:window-maximized="1"
     inkscape:current-layer="g4030" /><g
     id="g4030"
     inkscape:groupmode="layer"
     inkscape:label="Pages from EMT"
     transform="matrix(1.3333333,0,0,-1.3333333,-349.88937,643.76266)"><g
       id="g4224"
       transform="translate(296.881,390.75999)"><path
         d="M 0,0 H 128.943"
         style="fill:none;stroke:#b2b2b2;stroke-width:0.567;stroke-linecap:butt;stroke-linejoin:miter;stroke-miterlimit:2.613;stroke-dasharray:none;stroke-opacity:1"
         id="path4226" /></g><g
       id="g4228"
       transform="translate(430.22501,390.75999)"><path
         d="m 0,0 -5.641,1.699 c 0.806,-1.132 0.806,-2.265 0,-3.397 L 0,0"
         style="fill:#b2b2b2;fill-opacity:1;fill-rule:evenodd;stroke:none"
         id="path4230" /></g><g
       id="g4232"
       transform="translate(268.08299,346.341)"><path
         d="m 0,0 38.275,44.419 v 76.098 M 21.487,0 59.763,44.419 v 76.098"
         style="fill:none;stroke:#b2b2b2;stroke-width:0.425;stroke-linecap:butt;stroke-linejoin:miter;stroke-miterlimit:2.613;stroke-dasharray:none;stroke-opacity:1"
         id="path4234" /></g><g
       id="g4236"
       transform="translate(306.489,340.966)"><path
         d="M 0,0 42.844,49.794 V 131.86"
         style="fill:none;stroke:#b2b2b2;stroke-width:0.567;stroke-linecap:butt;stroke-linejoin:miter;stroke-miterlimit:2.613;stroke-dasharray:none;stroke-opacity:1"
         id="path4238" /></g><g
       id="g4240"
       transform="translate(303.618,337.629)"><path
         d="M 0,0 2.392,5.384 C 2.725,4.035 3.583,3.296 4.966,3.168 L 0,0"
         style="fill:#b2b2b2;fill-opacity:1;fill-rule:evenodd;stroke:none"
         id="path4242" /></g><g
       id="g4244"
       transform="translate(349.33299,477.227)"><path
         d="m 0,0 -1.698,-5.641 c 1.132,0.806 2.264,0.806 3.397,0 L 0,0"
         style="fill:#b2b2b2;fill-opacity:1;fill-rule:evenodd;stroke:none"
         id="path4246" /></g><g
       id="g4248"
       transform="translate(332.545,346.341)"><path
         d="m 0,0 38.277,44.419 v 76.098 M 21.489,0 59.763,44.419 v 76.098 M -35.352,66.345 H 70.471 M -35.352,87.361 H 70.471 M -35.352,108.376 H 70.471 M -50.464,27.858 H 55.36 M -59.673,11.565 H 46.15"
         style="fill:none;stroke:#b2b2b2;stroke-width:0.425;stroke-linecap:butt;stroke-linejoin:miter;stroke-miterlimit:2.613;stroke-dasharray:none;stroke-opacity:1"
         id="path4250" /></g><path
       d="m 327.7428,412.54176 -28.305,-32.64138 V 358.07914 M 392.278,454.746 377.887,438.053 v -63.911"
       style="fill:none;stroke:#00adef;stroke-width:0.567;stroke-linecap:butt;stroke-linejoin:miter;stroke-miterlimit:2.613;stroke-dasharray:5.669, 1.701;stroke-dashoffset:0;stroke-opacity:1"
       id="path4254"
       sodipodi:nodetypes="cccccc" /><g
       id="g4256"
       transform="translate(284.123,381.021)"><path
         d="M 15.3148,-1.12062 65.225,9.875 90.712,51.404"
         style="fill:none;stroke:#696969;stroke-width:1.134;stroke-linecap:butt;stroke-linejoin:miter;stroke-miterlimit:2.613;stroke-dasharray:none;stroke-opacity:1"
         id="path4258"
         sodipodi:nodetypes="ccc" /></g><g
       id="g4264"
       transform="translate(377.418,436.63499)"><path
         d="m 0,0 -4.935,-4.398 c 1.556,0.106 2.639,-0.559 3.248,-1.992 L 0,0"
         style="fill:#696969;fill-opacity:1;fill-rule:evenodd;stroke:none"
         id="path4266" /></g><g
       id="g4356"
       transform="translate(435.604,391.709)"><path
         d="m 0,0 c 0.088,-0.151 0.149,-0.292 0.185,-0.422 0.033,-0.133 0.065,-0.392 0.1,-0.777 L 0.457,-3.12 c 0.156,0.186 0.383,0.485 0.681,0.89 0.142,0.198 0.319,0.468 0.53,0.809 0.128,0.208 0.205,0.354 0.234,0.437 0.015,0.041 0.024,0.085 0.024,0.129 0,0.028 -0.009,0.053 -0.028,0.071 -0.018,0.017 -0.065,0.039 -0.142,0.064 -0.077,0.024 -0.142,0.07 -0.192,0.137 -0.05,0.065 -0.076,0.141 -0.076,0.228 0,0.107 0.032,0.192 0.094,0.257 C 1.644,-0.032 1.723,0 1.816,0 1.931,0 2.028,-0.046 2.109,-0.143 2.19,-0.238 2.23,-0.368 2.23,-0.535 2.23,-0.74 2.16,-0.977 2.02,-1.24 1.879,-1.503 1.608,-1.91 1.206,-2.456 0.806,-3.003 0.32,-3.6 -0.249,-4.245 c -0.394,-0.446 -0.686,-0.727 -0.877,-0.842 -0.189,-0.115 -0.352,-0.174 -0.486,-0.174 -0.081,0 -0.154,0.03 -0.215,0.092 -0.061,0.061 -0.091,0.132 -0.091,0.213 0,0.101 0.042,0.194 0.127,0.278 0.084,0.083 0.177,0.123 0.275,0.123 0.052,0 0.096,-0.011 0.129,-0.034 0.023,-0.014 0.044,-0.051 0.069,-0.113 0.025,-0.059 0.047,-0.1 0.069,-0.122 0.012,-0.013 0.028,-0.018 0.046,-0.018 0.015,0 0.043,0.011 0.081,0.039 0.144,0.088 0.311,0.228 0.5,0.421 0.251,0.256 0.435,0.464 0.555,0.625 l -0.218,2.475 c -0.035,0.41 -0.091,0.659 -0.164,0.747 -0.074,0.088 -0.195,0.133 -0.366,0.133 -0.056,0 -0.154,-0.008 -0.293,-0.023 L -1.144,-0.282 0,0"
         style="fill:#b2b2b2;fill-opacity:1;fill-rule:evenodd;stroke:none"
         id="path4358" /></g><g
       id="g4360"
       transform="translate(349.01601,482.82201)"><path
         d="M 0,0 H 2.48 V -0.098 L -0.223,-2.91 h 1.144 c 0.271,0 0.443,0.01 0.516,0.031 0.074,0.021 0.14,0.065 0.202,0.133 0.061,0.067 0.13,0.189 0.205,0.367 h 0.144 l -0.34,-1.063 h -2.543 v 0.114 l 2.704,2.811 H 0.685 C 0.447,-0.517 0.303,-0.523 0.253,-0.534 0.182,-0.551 0.108,-0.593 0.037,-0.658 -0.035,-0.725 -0.107,-0.835 -0.184,-0.988 H -0.332 L 0,0"
         style="fill:#b2b2b2;fill-opacity:1;fill-rule:evenodd;stroke:none"
         id="path4362" /></g><g
       id="g4364"
       transform="translate(299.817,336.39301)"><path
         d="M 0,0 C 0.127,-0.135 0.223,-0.27 0.289,-0.404 0.335,-0.5 0.413,-0.745 0.519,-1.143 l 0.345,0.515 c 0.09,0.124 0.201,0.244 0.331,0.358 0.13,0.113 0.245,0.19 0.343,0.231 C 1.601,-0.011 1.67,0 1.746,0 c 0.112,0 0.2,-0.028 0.267,-0.089 0.067,-0.059 0.1,-0.133 0.1,-0.218 0,-0.1 -0.02,-0.167 -0.059,-0.204 -0.073,-0.065 -0.156,-0.097 -0.249,-0.097 -0.055,0 -0.113,0.011 -0.176,0.035 -0.123,0.041 -0.206,0.062 -0.247,0.062 -0.063,0 -0.136,-0.037 -0.223,-0.109 C 0.998,-0.756 0.806,-1.016 0.582,-1.404 l 0.32,-1.345 c 0.049,-0.206 0.091,-0.33 0.125,-0.37 0.034,-0.04 0.067,-0.06 0.102,-0.06 0.055,0 0.118,0.031 0.19,0.09 0.144,0.12 0.266,0.277 0.369,0.469 L 1.823,-2.69 C 1.659,-2.999 1.451,-3.253 1.198,-3.456 1.055,-3.57 0.934,-3.628 0.835,-3.628 c -0.145,0 -0.261,0.081 -0.348,0.245 -0.054,0.102 -0.167,0.54 -0.339,1.315 -0.406,-0.707 -0.731,-1.16 -0.976,-1.364 -0.159,-0.13 -0.313,-0.196 -0.462,-0.196 -0.104,0 -0.198,0.037 -0.285,0.114 -0.062,0.057 -0.093,0.133 -0.093,0.23 0,0.085 0.029,0.157 0.086,0.216 0.056,0.057 0.127,0.085 0.211,0.085 0.083,0 0.172,-0.041 0.265,-0.125 0.068,-0.061 0.12,-0.091 0.156,-0.091 0.032,0 0.072,0.022 0.122,0.063 0.122,0.099 0.289,0.312 0.5,0.64 0.21,0.328 0.349,0.565 0.414,0.712 -0.162,0.633 -0.249,0.968 -0.262,1.003 -0.061,0.17 -0.138,0.289 -0.235,0.36 -0.096,0.071 -0.237,0.106 -0.425,0.106 -0.06,0 -0.13,-0.003 -0.207,-0.009 v 0.142 L 0,0"
         style="fill:#b2b2b2;fill-opacity:1;fill-rule:evenodd;stroke:none"
         id="path4366" /></g><g
       id="g4368"
       transform="translate(377.34801,437.101)"><path
         d="M 0,0 -77.91021,-57.20062"
         style="fill:none;stroke:#000000;stroke-width:1.134;stroke-linecap:butt;stroke-linejoin:miter;stroke-miterlimit:2.613;stroke-dasharray:none;stroke-opacity:1"
         id="path4370"
         sodipodi:nodetypes="cc" /></g><g
       id="g5904"
       transform="translate(20.8048,-0.54162)"><g
         id="g4260"
         transform="translate(279.229,380.28101)"><path
           d="M 0,0 5.985,2.837 C 5.28,1.442 5.47,0.184 6.557,-0.939 L 0,0"
           style="fill:#696969;fill-opacity:1;fill-rule:evenodd;stroke:none"
           id="path4262" /></g><g
         id="g4372"
         transform="translate(278.633,380.442)"><path
           d="M 0,0 6.446,1.501 C 5.028,2.153 4.395,3.257 4.547,4.811 L 0,0"
           style="fill:#000000;fill-opacity:1;fill-rule:evenodd;stroke:none"
           id="path4374" /></g><g
         id="g4376"
         transform="translate(278.04201,381.41901)"><path
           d="m 0,0 c 0.775,0 1.407,-0.632 1.407,-1.408 0,-0.775 -0.632,-1.407 -1.407,-1.407 -0.775,0 -1.407,0.632 -1.407,1.407 C -1.407,-0.632 -0.775,0 0,0 Z"
           style="fill:#00adef;fill-opacity:1;fill-rule:evenodd;stroke:#00adef;stroke-width:0.567;stroke-linecap:butt;stroke-linejoin:miter;stroke-miterlimit:2.613;stroke-dasharray:none;stroke-opacity:1"
           id="path4378" /></g></g><g
       id="g4380"
       transform="translate(378.12,439.371)"><path
         d="m 0,0 c 0.774,0 1.406,-0.632 1.406,-1.407 0,-0.776 -0.632,-1.408 -1.406,-1.408 -0.776,0 -1.408,0.632 -1.408,1.408 C -1.408,-0.632 -0.776,0 0,0 Z"
         style="fill:#00adef;fill-opacity:1;fill-rule:evenodd;stroke:#00adef;stroke-width:0.567;stroke-linecap:butt;stroke-linejoin:miter;stroke-miterlimit:2.613;stroke-dasharray:none;stroke-opacity:1"
         id="path4382" /></g><g
       id="g7174"
       transform="translate(26.160047,5.1904855)"><g
         id="g4384"
         transform="translate(238.21899,377.114)"><path
           d="m 0,0 -1.008,-0.817 c 0.158,0.029 0.306,0.043 0.441,0.043 0.131,0 0.251,-0.007 0.362,-0.023 0.11,-0.016 0.347,-0.065 0.71,-0.146 0.364,-0.082 0.681,-0.124 0.952,-0.124 0.288,0 0.535,0.05 0.736,0.151 0.201,0.099 0.397,0.267 0.588,0.503 L 2.91,-0.477 C 2.641,-0.862 2.325,-1.141 1.961,-1.312 1.596,-1.482 1.209,-1.568 0.8,-1.568 c -0.226,0 -0.536,0.046 -0.93,0.134 -0.601,0.133 -1.021,0.198 -1.261,0.198 -0.091,0 -0.165,-0.004 -0.223,-0.018 -0.057,-0.014 -0.142,-0.045 -0.257,-0.095 l -0.091,0.108 1.602,1.264 c -0.495,0.069 -0.87,0.285 -1.124,0.653 -0.256,0.366 -0.383,0.757 -0.383,1.175 0,0.572 0.172,1.161 0.517,1.769 0.344,0.61 0.787,1.081 1.325,1.416 0.537,0.335 1.065,0.501 1.583,0.501 0.386,0 0.714,-0.076 0.987,-0.232 C 2.817,5.148 3.026,4.921 3.176,4.622 3.324,4.324 3.398,4.019 3.398,3.705 3.398,3.107 3.228,2.501 2.886,1.887 2.545,1.271 2.121,0.807 1.614,0.49 1.108,0.174 0.57,0.011 0,0 Z M 1.465,5.288 C 1.204,5.288 0.949,5.225 0.701,5.096 0.452,4.966 0.205,4.756 -0.039,4.462 -0.284,4.17 -0.504,3.785 -0.7,3.312 -0.936,2.728 -1.055,2.179 -1.055,1.659 -1.055,1.289 -0.96,0.963 -0.77,0.677 -0.58,0.393 -0.288,0.25 0.105,0.25 0.34,0.25 0.572,0.308 0.8,0.426 1.029,0.542 1.266,0.742 1.512,1.023 1.824,1.383 2.085,1.84 2.297,2.394 2.508,2.948 2.613,3.465 2.613,3.94 2.613,4.293 2.518,4.604 2.328,4.879 2.137,5.151 1.85,5.288 1.465,5.288"
           style="fill:#000000;fill-opacity:1;fill-rule:evenodd;stroke:none"
           id="path4386" /></g><g
         id="g4388"
         transform="translate(245.10001,375.66901)"><path
           d="m 0,0 v -0.145 c -0.393,0.197 -0.721,0.43 -0.984,0.694 -0.375,0.378 -0.664,0.824 -0.867,1.336 -0.204,0.514 -0.305,1.046 -0.305,1.598 0,0.808 0.2,1.545 0.597,2.209 C -1.16,6.357 -0.64,6.834 0,7.121 V 6.957 C -0.32,6.779 -0.583,6.538 -0.789,6.229 -0.995,5.923 -1.148,5.534 -1.249,5.061 -1.351,4.591 -1.401,4.097 -1.401,3.585 c 0,-0.556 0.042,-1.064 0.128,-1.52 0.068,-0.359 0.15,-0.648 0.246,-0.864 C -0.931,0.982 -0.801,0.773 -0.639,0.574 -0.476,0.373 -0.263,0.181 0,0"
           style="fill:#000000;fill-opacity:1;fill-rule:evenodd;stroke:none"
           id="path4390" /></g><g
         id="g4392"
         transform="translate(248.948,378.254)"><path
           d="m 0,0 -0.371,-1.02 h -3.125 v 0.144 c 0.919,0.839 1.567,1.524 1.941,2.055 0.375,0.532 0.563,1.018 0.563,1.457 0,0.336 -0.103,0.613 -0.309,0.828 C -1.507,3.68 -1.752,3.789 -2.039,3.789 -2.3,3.789 -2.533,3.712 -2.74,3.56 -2.947,3.409 -3.1,3.184 -3.199,2.891 h -0.145 c 0.065,0.482 0.232,0.851 0.503,1.109 0.269,0.257 0.605,0.387 1.009,0.387 0.429,0 0.788,-0.138 1.076,-0.415 0.288,-0.275 0.432,-0.6 0.432,-0.975 0,-0.269 -0.063,-0.537 -0.188,-0.806 -0.192,-0.422 -0.505,-0.867 -0.937,-1.34 -0.648,-0.708 -1.054,-1.135 -1.215,-1.28 h 1.383 c 0.281,0 0.478,0.01 0.592,0.031 0.113,0.02 0.216,0.063 0.306,0.126 0.091,0.065 0.171,0.155 0.239,0.272 L 0,0"
           style="fill:#000000;fill-opacity:1;fill-rule:evenodd;stroke:none"
           id="path4394" /></g><g
         id="g4396"
         transform="translate(249.709,375.90199)"><path
           d="m 0,0 v 0.173 c 0.268,0.088 0.476,0.225 0.624,0.411 0.147,0.187 0.22,0.385 0.22,0.593 0,0.049 -0.012,0.09 -0.034,0.126 C 0.791,1.324 0.772,1.337 0.755,1.337 0.725,1.337 0.663,1.31 0.567,1.259 0.52,1.235 0.471,1.224 0.419,1.224 0.291,1.224 0.19,1.261 0.113,1.337 0.039,1.412 0,1.517 0,1.648 0,1.776 0.05,1.887 0.147,1.976 0.244,2.068 0.364,2.113 0.504,2.113 0.676,2.113 0.829,2.039 0.963,1.889 1.098,1.739 1.164,1.54 1.164,1.295 1.164,1.026 1.071,0.776 0.886,0.547 0.699,0.315 0.404,0.134 0,0"
           style="fill:#000000;fill-opacity:1;fill-rule:evenodd;stroke:none"
           id="path4398" /></g><path
         d="m 252.734,379.195 h 4.137 v -0.327 h -4.137 z"
         style="fill:#000000;fill-opacity:1;fill-rule:nonzero;stroke:none"
         id="path4400" /><g
         id="g4406"
         transform="translate(261.709,375.90199)"><path
           d="m 0,0 v 0.173 c 0.268,0.088 0.476,0.225 0.624,0.411 0.147,0.187 0.22,0.385 0.22,0.593 0,0.049 -0.012,0.09 -0.034,0.126 C 0.791,1.324 0.772,1.337 0.755,1.337 0.726,1.337 0.663,1.31 0.567,1.259 0.52,1.235 0.471,1.224 0.419,1.224 0.291,1.224 0.19,1.261 0.114,1.337 0.039,1.412 0,1.517 0,1.648 0,1.776 0.05,1.887 0.147,1.976 0.244,2.068 0.364,2.113 0.504,2.113 0.676,2.113 0.83,2.039 0.963,1.889 1.098,1.739 1.164,1.54 1.164,1.295 1.164,1.026 1.071,0.776 0.886,0.547 0.699,0.315 0.404,0.134 0,0"
           style="fill:#000000;fill-opacity:1;fill-rule:evenodd;stroke:none"
           id="path4408" /></g><g
         id="g4410"
         transform="translate(266.218,382.011)"><path
           d="m 0,0 1.289,0.63 h 0.129 v -4.472 c 0,-0.297 0.012,-0.483 0.036,-0.555 0.026,-0.072 0.077,-0.129 0.155,-0.169 0.079,-0.038 0.237,-0.061 0.477,-0.067 V -4.777 H 0.093 v 0.144 c 0.25,0.006 0.412,0.028 0.485,0.065 0.072,0.038 0.123,0.09 0.152,0.153 0.028,0.064 0.043,0.254 0.043,0.573 v 2.858 c 0,0.387 -0.013,0.633 -0.039,0.742 -0.018,0.084 -0.052,0.146 -0.1,0.185 C 0.586,-0.018 0.529,0 0.461,0 0.365,0 0.23,-0.04 0.058,-0.121 L 0,0"
           style="fill:#000000;fill-opacity:1;fill-rule:evenodd;stroke:none"
           id="path4412" /></g><g
         id="g4410-6"
         transform="translate(258.05821,382.11098)"><path
           d="m 0,0 1.289,0.63 h 0.129 v -4.472 c 0,-0.297 0.012,-0.483 0.036,-0.555 0.026,-0.072 0.077,-0.129 0.155,-0.169 0.079,-0.038 0.237,-0.061 0.477,-0.067 V -4.777 H 0.093 v 0.144 c 0.25,0.006 0.412,0.028 0.485,0.065 0.072,0.038 0.123,0.09 0.152,0.153 0.028,0.064 0.043,0.254 0.043,0.573 v 2.858 c 0,0.387 -0.013,0.633 -0.039,0.742 -0.018,0.084 -0.052,0.146 -0.1,0.185 C 0.586,-0.018 0.529,0 0.461,0 0.365,0 0.23,-0.04 0.058,-0.121 L 0,0"
           style="fill:#000000;fill-opacity:1;fill-rule:evenodd;stroke:none"
           id="path4412-7" /></g><g
         id="g4414"
         transform="translate(269.46001,382.62601)"><path
           d="M 0,0 V 0.164 C 0.396,-0.032 0.725,-0.262 0.988,-0.529 1.36,-0.909 1.648,-1.354 1.851,-1.867 2.055,-2.378 2.156,-2.911 2.156,-3.466 2.156,-4.273 1.957,-5.008 1.56,-5.673 1.163,-6.339 0.643,-6.816 0,-7.102 v 0.145 c 0.32,0.179 0.584,0.421 0.791,0.728 0.206,0.306 0.361,0.695 0.461,1.168 0.1,0.473 0.151,0.966 0.151,1.478 0,0.554 -0.044,1.06 -0.13,1.519 C 1.208,-1.704 1.127,-1.416 1.029,-1.2 0.931,-0.984 0.801,-0.776 0.64,-0.576 0.479,-0.374 0.265,-0.184 0,0"
           style="fill:#000000;fill-opacity:1;fill-rule:evenodd;stroke:none"
           id="path4416" /></g></g><g
       id="g4418"
       transform="translate(409.17,445.582)"><path
         d="m 0,0 h 2.085 c 0.546,0 0.956,-0.12 1.227,-0.354 0.27,-0.235 0.406,-0.523 0.406,-0.86 0,-0.271 -0.086,-0.531 -0.259,-0.782 C 3.287,-2.249 3.033,-2.455 2.695,-2.613 2.355,-2.77 1.99,-2.849 1.597,-2.849 c -0.245,0 -0.556,0.044 -0.934,0.134 L 0.241,-4.16 C 0.142,-4.504 0.093,-4.732 0.093,-4.84 c 0,-0.084 0.035,-0.153 0.106,-0.207 0.07,-0.056 0.238,-0.091 0.503,-0.107 L 0.663,-5.297 h -2.106 l 0.044,0.143 c 0.276,0 0.469,0.048 0.576,0.142 0.109,0.098 0.225,0.358 0.35,0.788 l 0.875,3.016 c 0.103,0.362 0.155,0.604 0.155,0.726 0,0.092 -0.036,0.166 -0.11,0.227 -0.076,0.059 -0.238,0.095 -0.491,0.109 z m 0.729,-2.47 c 0.294,-0.075 0.532,-0.112 0.712,-0.112 0.283,0 0.541,0.057 0.775,0.175 0.234,0.118 0.415,0.293 0.546,0.527 0.132,0.234 0.197,0.478 0.197,0.73 0,0.265 -0.079,0.472 -0.241,0.625 -0.162,0.154 -0.407,0.232 -0.733,0.232 -0.179,0 -0.394,-0.024 -0.647,-0.068 L 0.729,-2.47"
         style="fill:#000000;fill-opacity:1;fill-rule:evenodd;stroke:none"
         id="path4420" /></g><g
       id="g4422"
       transform="translate(416.25,438.717)"><path
         d="m 0,0 v -0.143 c -0.394,0.196 -0.722,0.429 -0.984,0.694 -0.375,0.377 -0.664,0.823 -0.867,1.336 -0.204,0.514 -0.305,1.045 -0.305,1.598 0,0.807 0.2,1.544 0.597,2.209 C -1.16,6.36 -0.64,6.835 0,7.122 V 6.957 C -0.32,6.781 -0.583,6.54 -0.79,6.232 -0.995,5.924 -1.148,5.536 -1.25,5.064 -1.351,4.592 -1.402,4.099 -1.402,3.587 -1.402,3.03 -1.359,2.524 -1.274,2.068 -1.206,1.707 -1.123,1.419 -1.027,1.202 -0.931,0.985 -0.801,0.776 -0.639,0.576 -0.476,0.373 -0.263,0.183 0,0"
         style="fill:#000000;fill-opacity:1;fill-rule:evenodd;stroke:none"
         id="path4424" /></g><g
       id="g4426"
       transform="translate(417.368,445.061)"><path
         d="m 0,0 1.289,0.629 h 0.128 v -4.473 c 0,-0.295 0.013,-0.481 0.037,-0.553 0.025,-0.073 0.077,-0.129 0.154,-0.169 0.079,-0.038 0.237,-0.062 0.477,-0.067 V -4.776 H 0.092 v 0.143 c 0.251,0.005 0.412,0.027 0.485,0.066 0.072,0.037 0.123,0.088 0.152,0.151 0.028,0.065 0.043,0.255 0.043,0.572 v 2.861 c 0,0.384 -0.013,0.632 -0.039,0.74 C 0.715,-0.158 0.682,-0.097 0.634,-0.058 0.585,-0.019 0.528,0 0.46,0 0.364,0 0.229,-0.04 0.058,-0.121 L 0,0"
         style="fill:#000000;fill-opacity:1;fill-rule:evenodd;stroke:none"
         id="path4428" /></g><g
       id="g4430"
       transform="translate(420.85899,438.953)"><path
         d="M 0,0 V 0.172 C 0.268,0.259 0.476,0.396 0.624,0.584 0.77,0.77 0.844,0.968 0.844,1.175 0.844,1.224 0.832,1.266 0.809,1.3 0.79,1.323 0.772,1.336 0.755,1.336 0.725,1.336 0.662,1.308 0.567,1.257 0.52,1.234 0.47,1.221 0.419,1.221 0.29,1.221 0.189,1.259 0.113,1.336 0.038,1.412 0,1.515 0,1.647 0,1.775 0.05,1.884 0.146,1.975 0.244,2.067 0.364,2.112 0.505,2.112 0.677,2.112 0.829,2.039 0.964,1.887 1.097,1.738 1.164,1.54 1.164,1.293 1.164,1.024 1.071,0.775 0.886,0.545 0.698,0.314 0.404,0.133 0,0"
         style="fill:#000000;fill-opacity:1;fill-rule:evenodd;stroke:none"
         id="path4432" /></g><g
       id="g4434"
       transform="translate(428.09801,441.304)"><path
         d="m 0,0 -0.371,-1.019 h -3.125 v 0.143 c 0.918,0.839 1.566,1.525 1.941,2.054 0.375,0.532 0.563,1.019 0.563,1.458 0,0.336 -0.103,0.612 -0.31,0.828 C -1.507,3.68 -1.752,3.788 -2.039,3.788 -2.3,3.788 -2.534,3.712 -2.74,3.561 -2.947,3.408 -3.1,3.185 -3.199,2.89 h -0.145 c 0.065,0.482 0.232,0.852 0.502,1.11 0.269,0.257 0.606,0.386 1.01,0.386 0.429,0 0.788,-0.138 1.076,-0.414 0.288,-0.275 0.432,-0.602 0.432,-0.976 0,-0.267 -0.063,-0.538 -0.188,-0.805 C -0.705,1.77 -1.017,1.323 -1.45,0.85 -2.098,0.144 -2.503,-0.284 -2.664,-0.43 h 1.382 c 0.282,0 0.479,0.01 0.593,0.032 0.113,0.019 0.215,0.062 0.306,0.127 0.091,0.063 0.171,0.153 0.239,0.271 H 0"
         style="fill:#000000;fill-opacity:1;fill-rule:evenodd;stroke:none"
         id="path4436" /></g><g
       id="g4438"
       transform="translate(428.85899,438.953)"><path
         d="M 0,0 V 0.172 C 0.268,0.259 0.476,0.396 0.624,0.584 0.77,0.77 0.844,0.968 0.844,1.175 0.844,1.224 0.832,1.266 0.809,1.3 0.791,1.323 0.772,1.336 0.756,1.336 0.725,1.336 0.662,1.308 0.567,1.257 0.52,1.234 0.472,1.221 0.419,1.221 0.291,1.221 0.189,1.259 0.113,1.336 0.039,1.412 0,1.515 0,1.647 0,1.775 0.05,1.884 0.147,1.975 0.244,2.067 0.364,2.112 0.505,2.112 0.676,2.112 0.829,2.039 0.964,1.887 1.097,1.738 1.164,1.54 1.164,1.293 1.164,1.024 1.071,0.775 0.886,0.545 0.698,0.314 0.404,0.133 0,0"
         style="fill:#000000;fill-opacity:1;fill-rule:evenodd;stroke:none"
         id="path4440" /></g><g
       id="g4442"
       transform="translate(432.836,444.57401)"><path
         d="M 0,0 C 0.151,0.355 0.342,0.632 0.573,0.824 0.803,1.019 1.09,1.116 1.434,1.116 1.858,1.116 2.183,0.978 2.41,0.702 2.582,0.496 2.668,0.276 2.668,0.043 2.668,-0.344 2.426,-0.741 1.942,-1.152 2.267,-1.28 2.512,-1.463 2.679,-1.7 2.846,-1.937 2.93,-2.216 2.93,-2.536 2.93,-2.993 2.785,-3.392 2.492,-3.727 2.113,-4.164 1.562,-4.383 0.84,-4.383 c -0.357,0 -0.599,0.044 -0.728,0.132 -0.129,0.09 -0.194,0.184 -0.194,0.285 0,0.076 0.031,0.143 0.092,0.2 0.062,0.058 0.135,0.085 0.221,0.085 0.064,0 0.132,-0.01 0.199,-0.031 0.044,-0.013 0.144,-0.061 0.301,-0.142 0.156,-0.083 0.264,-0.131 0.324,-0.146 0.096,-0.03 0.199,-0.043 0.309,-0.043 0.264,0 0.497,0.102 0.692,0.308 0.198,0.205 0.295,0.45 0.295,0.73 0,0.206 -0.045,0.407 -0.136,0.603 C 2.147,-2.258 2.073,-2.147 1.992,-2.071 1.88,-1.967 1.727,-1.872 1.532,-1.788 1.336,-1.703 1.136,-1.66 0.934,-1.66 H 0.808 v 0.118 c 0.206,0.024 0.412,0.098 0.619,0.221 0.208,0.122 0.359,0.269 0.452,0.441 0.093,0.173 0.14,0.36 0.14,0.566 0,0.269 -0.084,0.486 -0.252,0.651 C 1.599,0.503 1.391,0.586 1.14,0.586 0.737,0.586 0.4,0.369 0.128,-0.063 L 0,0"
         style="fill:#000000;fill-opacity:1;fill-rule:evenodd;stroke:none"
         id="path4444" /></g><g
       id="g4446"
       transform="translate(436.61,445.674)"><path
         d="M 0,0 V 0.165 C 0.396,-0.03 0.725,-0.26 0.987,-0.528 1.36,-0.908 1.648,-1.352 1.85,-1.865 2.054,-2.377 2.156,-2.91 2.156,-3.464 2.156,-4.272 1.957,-5.006 1.56,-5.672 1.162,-6.338 0.642,-6.814 0,-7.1 v 0.143 c 0.32,0.18 0.584,0.423 0.79,0.73 0.207,0.306 0.362,0.694 0.462,1.169 0.1,0.471 0.15,0.965 0.15,1.476 0,0.554 -0.044,1.061 -0.129,1.52 -0.065,0.36 -0.147,0.647 -0.244,0.864 C 0.93,-0.982 0.801,-0.774 0.64,-0.574 0.478,-0.373 0.265,-0.181 0,0"
         style="fill:#000000;fill-opacity:1;fill-rule:evenodd;stroke:none"
         id="path4448" /></g><g
       id="g4450"
       transform="translate(404.63499,442.94501)"><path
         d="M 0,0 C 0,0 -11.332,0.291 -20.629,-3.195"
         style="fill:none;stroke:#000000;stroke-width:0.283;stroke-linecap:butt;stroke-linejoin:miter;stroke-miterlimit:2.613;stroke-dasharray:none;stroke-opacity:1"
         id="path4452" /></g><g
       id="g4454"
       transform="translate(380.595,438.47)"><path
         d="M 0,0 4.296,0.287 C 3.454,0.854 3.164,1.628 3.424,2.611 L 0,0"
         style="fill:#000000;fill-opacity:1;fill-rule:evenodd;stroke:none"
         id="path4456" /></g><g
       id="g4458"
       transform="translate(326.19501,385.043)"><path
         d="m 0,0 v -0.828 c 0.243,0.376 0.455,0.627 0.637,0.751 0.182,0.124 0.358,0.185 0.528,0.185 0.145,0 0.262,-0.044 0.349,-0.135 0.088,-0.089 0.131,-0.216 0.131,-0.38 0,-0.174 -0.042,-0.309 -0.127,-0.406 -0.084,-0.096 -0.187,-0.145 -0.307,-0.145 -0.137,0 -0.257,0.045 -0.358,0.133 -0.103,0.089 -0.163,0.138 -0.18,0.149 -0.027,0.015 -0.057,0.023 -0.091,0.023 -0.075,0 -0.147,-0.028 -0.215,-0.086 C 0.26,-0.828 0.18,-0.954 0.126,-1.119 0.042,-1.371 0,-1.649 0,-1.954 v -0.838 l 0.004,-0.22 c 0,-0.149 0.01,-0.243 0.027,-0.284 0.032,-0.072 0.077,-0.123 0.139,-0.156 0.061,-0.033 0.165,-0.052 0.311,-0.06 v -0.141 h -1.972 v 0.141 c 0.158,0.013 0.265,0.056 0.321,0.132 0.056,0.072 0.084,0.268 0.084,0.588 v 2.017 c 0,0.208 -0.009,0.342 -0.031,0.4 -0.027,0.073 -0.064,0.126 -0.113,0.16 -0.049,0.034 -0.138,0.056 -0.261,0.07 V 0 H 0"
         style="fill:#000000;fill-opacity:1;fill-rule:evenodd;stroke:none"
         id="path4460" /></g><g
       id="g4462"
       transform="translate(329.716,379.2)"><path
         d="m 0,0 -0.756,-0.613 c 0.119,0.021 0.23,0.033 0.331,0.033 0.098,0 0.188,-0.006 0.271,-0.018 0.083,-0.012 0.261,-0.049 0.533,-0.109 0.273,-0.063 0.511,-0.094 0.714,-0.094 0.216,0 0.401,0.038 0.552,0.113 0.151,0.075 0.298,0.202 0.441,0.377 L 2.183,-0.358 C 1.981,-0.647 1.744,-0.856 1.471,-0.984 1.197,-1.111 0.907,-1.176 0.6,-1.176 c -0.169,0 -0.402,0.034 -0.697,0.101 -0.451,0.099 -0.766,0.148 -0.946,0.148 -0.068,0 -0.124,-0.004 -0.167,-0.014 -0.043,-0.009 -0.107,-0.033 -0.193,-0.071 l -0.068,0.08 1.201,0.949 C -0.641,0.068 -0.922,0.231 -1.113,0.507 -1.305,0.781 -1.4,1.075 -1.4,1.389 c 0,0.427 0.129,0.87 0.388,1.327 0.258,0.457 0.59,0.81 0.993,1.061 0.403,0.251 0.799,0.376 1.188,0.376 0.289,0 0.535,-0.057 0.74,-0.175 C 2.113,3.861 2.27,3.69 2.382,3.467 2.493,3.243 2.549,3.015 2.549,2.779 2.549,2.331 2.421,1.876 2.165,1.415 1.909,0.953 1.591,0.604 1.211,0.367 0.831,0.131 0.428,0.008 0,0 Z M 1.099,3.967 C 0.903,3.967 0.712,3.919 0.526,3.821 0.339,3.724 0.154,3.566 -0.029,3.347 -0.213,3.128 -0.378,2.84 -0.525,2.484 -0.702,2.047 -0.791,1.634 -0.791,1.244 c 0,-0.276 0.071,-0.522 0.214,-0.736 0.142,-0.213 0.361,-0.321 0.656,-0.321 0.176,0 0.35,0.044 0.521,0.132 C 0.772,0.406 0.95,0.557 1.134,0.767 1.368,1.036 1.564,1.38 1.723,1.796 1.881,2.212 1.96,2.598 1.96,2.956 1.96,3.219 1.889,3.453 1.746,3.658 1.603,3.863 1.388,3.967 1.099,3.967"
         style="fill:#000000;fill-opacity:1;fill-rule:evenodd;stroke:none"
         id="path4464" /></g><g
       id="g4466"
       transform="translate(362.80499,406.834)"><path
         d="m 0,0 v -0.829 c 0.243,0.378 0.455,0.628 0.636,0.752 0.183,0.125 0.359,0.185 0.528,0.185 0.146,0 0.263,-0.044 0.349,-0.134 0.089,-0.09 0.132,-0.216 0.132,-0.38 0,-0.175 -0.041,-0.31 -0.127,-0.407 -0.084,-0.096 -0.188,-0.144 -0.307,-0.144 -0.138,0 -0.258,0.045 -0.358,0.132 -0.104,0.09 -0.163,0.139 -0.181,0.149 -0.026,0.015 -0.056,0.023 -0.091,0.023 -0.074,0 -0.145,-0.028 -0.214,-0.085 C 0.26,-0.827 0.18,-0.954 0.125,-1.118 0.041,-1.37 0,-1.649 0,-1.954 v -0.838 l 0.004,-0.22 c 0,-0.149 0.009,-0.242 0.027,-0.284 0.033,-0.071 0.078,-0.123 0.138,-0.156 0.062,-0.033 0.166,-0.052 0.311,-0.06 v -0.141 h -1.972 v 0.141 c 0.159,0.014 0.265,0.056 0.321,0.132 0.056,0.072 0.084,0.269 0.084,0.588 v 2.018 c 0,0.208 -0.009,0.341 -0.03,0.4 -0.027,0.073 -0.064,0.126 -0.113,0.159 -0.05,0.034 -0.138,0.057 -0.262,0.07 V 0 H 0"
         style="fill:#000000;fill-opacity:1;fill-rule:evenodd;stroke:none"
         id="path4468" /></g><g
       id="g4470"
       transform="translate(365.508,405.054)"><path
         d="m 0,0 h 1.565 c 0.409,0 0.716,-0.089 0.92,-0.264 0.202,-0.178 0.304,-0.394 0.304,-0.647 0,-0.202 -0.065,-0.396 -0.194,-0.586 C 2.466,-1.686 2.276,-1.84 2.022,-1.959 1.767,-2.077 1.493,-2.135 1.198,-2.135 c -0.184,0 -0.417,0.033 -0.7,0.099 L 0.181,-3.12 C 0.108,-3.378 0.07,-3.547 0.07,-3.63 c 0,-0.063 0.026,-0.114 0.08,-0.155 0.052,-0.042 0.178,-0.067 0.377,-0.08 L 0.498,-3.972 h -1.58 l 0.033,0.107 c 0.207,0 0.351,0.036 0.432,0.107 0.081,0.073 0.168,0.268 0.262,0.591 l 0.656,2.261 c 0.078,0.273 0.117,0.454 0.117,0.545 0,0.069 -0.027,0.125 -0.083,0.171 -0.055,0.045 -0.178,0.071 -0.368,0.081 z m 0.547,-1.851 c 0.221,-0.058 0.399,-0.085 0.534,-0.085 0.212,0 0.407,0.044 0.581,0.132 0.175,0.087 0.312,0.219 0.411,0.394 0.098,0.176 0.147,0.359 0.147,0.548 0,0.198 -0.06,0.355 -0.181,0.47 -0.122,0.114 -0.304,0.173 -0.551,0.173 -0.132,0 -0.293,-0.018 -0.484,-0.05 L 0.547,-1.851"
         style="fill:#000000;fill-opacity:1;fill-rule:evenodd;stroke:none"
         id="path4472" /></g><g
       id="g4474"
       transform="translate(330.936,423.61)"><path
         d="M 0,0 V -1.484 C 0,-1.771 0.018,-1.951 0.052,-2.024 0.088,-2.1 0.15,-2.159 0.238,-2.203 0.327,-2.248 0.492,-2.27 0.735,-2.27 v -0.145 h -2.712 v 0.145 c 0.245,0 0.411,0.022 0.499,0.07 0.086,0.045 0.148,0.103 0.184,0.176 0.034,0.074 0.052,0.253 0.052,0.54 v 3.436 c 0,0.287 -0.018,0.467 -0.052,0.541 -0.036,0.075 -0.098,0.134 -0.187,0.179 -0.088,0.045 -0.253,0.065 -0.496,0.065 v 0.147 h 2.461 c 0.642,0 1.11,-0.046 1.407,-0.135 C 2.187,2.661 2.43,2.497 2.618,2.259 2.804,2.022 2.899,1.741 2.899,1.422 2.899,1.031 2.758,0.708 2.476,0.452 2.296,0.291 2.046,0.169 1.723,0.09 L 2.996,-1.703 C 3.163,-1.936 3.281,-2.079 3.351,-2.137 3.459,-2.219 3.582,-2.263 3.723,-2.27 V -2.415 H 2.055 L 0.348,0 Z M 0,2.598 V 0.277 h 0.223 c 0.361,0 0.632,0.032 0.812,0.099 0.18,0.067 0.321,0.187 0.424,0.36 0.103,0.173 0.155,0.4 0.155,0.677 0,0.404 -0.095,0.701 -0.284,0.896 C 1.142,2.501 0.838,2.598 0.418,2.598 H 0"
         style="fill:#000000;fill-opacity:1;fill-rule:evenodd;stroke:none"
         id="path4476" /></g><g
       id="g4478"
       transform="translate(335.526,423.06799)"><path
         d="m 0,0 h 1.564 c 0.41,0 0.717,-0.089 0.92,-0.265 0.203,-0.175 0.305,-0.391 0.305,-0.645 0,-0.201 -0.065,-0.397 -0.194,-0.586 -0.129,-0.19 -0.32,-0.345 -0.574,-0.463 -0.254,-0.116 -0.528,-0.176 -0.823,-0.176 -0.184,0 -0.417,0.032 -0.7,0.1 L 0.181,-3.119 C 0.107,-3.378 0.07,-3.548 0.07,-3.63 c 0,-0.061 0.026,-0.112 0.079,-0.154 0.053,-0.042 0.179,-0.069 0.378,-0.08 L 0.498,-3.973 h -1.58 l 0.033,0.109 c 0.207,0 0.351,0.036 0.432,0.106 0.081,0.072 0.168,0.269 0.262,0.591 l 0.656,2.263 c 0.078,0.27 0.117,0.454 0.117,0.545 0,0.067 -0.027,0.125 -0.083,0.169 -0.056,0.044 -0.178,0.072 -0.368,0.083 z m 0.547,-1.851 c 0.221,-0.057 0.399,-0.085 0.534,-0.085 0.212,0 0.406,0.044 0.581,0.131 0.175,0.089 0.312,0.22 0.41,0.397 0.099,0.176 0.148,0.357 0.148,0.547 0,0.199 -0.06,0.353 -0.181,0.469 -0.122,0.115 -0.305,0.172 -0.551,0.172 -0.133,0 -0.294,-0.016 -0.484,-0.049 L 0.547,-1.851"
         style="fill:#000000;fill-opacity:1;fill-rule:evenodd;stroke:none"
         id="path4480" /></g><g
       id="g4482"
       transform="translate(340.008,419.004)"><path
         d="m 0,0 -0.756,-0.612 c 0.119,0.022 0.23,0.033 0.331,0.033 0.098,0 0.188,-0.006 0.271,-0.016 0.083,-0.013 0.261,-0.051 0.533,-0.111 0.273,-0.063 0.511,-0.092 0.714,-0.092 0.216,0 0.401,0.038 0.552,0.111 0.151,0.075 0.298,0.201 0.441,0.377 L 2.183,-0.356 C 1.981,-0.646 1.744,-0.854 1.471,-0.983 1.197,-1.11 0.907,-1.173 0.6,-1.173 c -0.169,0 -0.402,0.034 -0.697,0.099 -0.451,0.099 -0.766,0.149 -0.946,0.149 -0.068,0 -0.124,-0.004 -0.167,-0.014 -0.043,-0.01 -0.107,-0.033 -0.193,-0.071 l -0.068,0.081 1.201,0.947 C -0.641,0.07 -0.922,0.232 -1.113,0.508 -1.305,0.784 -1.4,1.077 -1.4,1.389 c 0,0.429 0.129,0.87 0.388,1.328 0.258,0.457 0.59,0.812 0.993,1.062 0.403,0.252 0.799,0.377 1.188,0.377 0.289,0 0.535,-0.06 0.74,-0.177 C 2.113,3.863 2.27,3.691 2.382,3.467 2.493,3.245 2.549,3.015 2.549,2.781 2.549,2.332 2.421,1.876 2.165,1.417 1.909,0.956 1.591,0.605 1.211,0.369 0.831,0.131 0.428,0.008 0,0 Z M 1.099,3.968 C 0.903,3.968 0.712,3.92 0.526,3.823 0.339,3.725 0.154,3.569 -0.029,3.348 -0.213,3.128 -0.378,2.84 -0.525,2.487 -0.702,2.047 -0.791,1.634 -0.791,1.246 c 0,-0.277 0.071,-0.524 0.214,-0.738 0.142,-0.212 0.361,-0.32 0.656,-0.32 0.176,0 0.35,0.044 0.521,0.134 0.172,0.087 0.35,0.235 0.534,0.446 0.234,0.27 0.43,0.612 0.589,1.028 C 1.881,2.213 1.96,2.6 1.96,2.957 1.96,3.221 1.889,3.455 1.746,3.66 1.603,3.866 1.388,3.968 1.099,3.968"
         style="fill:#000000;fill-opacity:1;fill-rule:evenodd;stroke:none"
         id="path4484" /></g><g
       id="g3767"
       transform="matrix(0.66,0,0,0.66,14.844843,11.139853)"><path
         d="m 431.536,588.198 -0.223,-30.341 h 29.626"
         style="fill:none;stroke:#ff0000;stroke-width:1.134;stroke-linecap:butt;stroke-linejoin:miter;stroke-miterlimit:2.613;stroke-dasharray:none;stroke-opacity:1"
         id="path2237" /><path
         d="m 431.573,593.13 1.855,-6.333 c -1.261,0.912 -2.53,0.921 -3.804,0.027 l 1.949,6.306"
         style="fill:#ff0000;fill-opacity:1;fill-rule:evenodd;stroke:none"
         id="path2241" /><path
         d="m 465.89101,557.85699 -6.346,1.91 c 0.907,-1.273 0.907,-2.547 0,-3.82 l 6.346,1.91"
         style="fill:#ff0000;fill-opacity:1;fill-rule:evenodd;stroke:none"
         id="path2245" /><path
         d="M 431.549,557.621 420.737,546.385"
         style="fill:none;stroke:#ff0000;stroke-width:1.134;stroke-linecap:butt;stroke-linejoin:miter;stroke-miterlimit:2.613;stroke-dasharray:none;stroke-opacity:1"
         id="path2249" /><path
         d="m 417.312,542.826 5.763,3.239 c -1.542,0.231 -2.458,1.11 -2.747,2.644 l -3.016,-5.883"
         style="fill:#ff0000;fill-opacity:1;fill-rule:evenodd;stroke:none"
         id="path2253" /><path
         d="m 436.746,589.44299 c -0.446,-0.394 -0.846,-0.59 -1.2,-0.59 -0.208,0 -0.382,0.069 -0.519,0.206 -0.139,0.136 -0.207,0.308 -0.207,0.513 0,0.279 0.119,0.529 0.359,0.752 0.24,0.223 0.761,0.519 1.567,0.889 v 0.367 c 0,0.277 -0.015,0.449 -0.045,0.521 -0.03,0.072 -0.087,0.135 -0.169,0.189 -0.084,0.053 -0.179,0.079 -0.283,0.079 -0.168,0 -0.309,-0.039 -0.418,-0.113 -0.067,-0.046 -0.101,-0.101 -0.101,-0.164 0,-0.055 0.037,-0.123 0.109,-0.204 0.099,-0.112 0.15,-0.219 0.15,-0.323 0,-0.129 -0.049,-0.237 -0.144,-0.328 -0.096,-0.089 -0.219,-0.134 -0.373,-0.134 -0.164,0 -0.301,0.05 -0.412,0.15 -0.11,0.098 -0.166,0.214 -0.166,0.346 0,0.188 0.074,0.366 0.223,0.537 0.149,0.171 0.355,0.302 0.622,0.393 0.264,0.091 0.541,0.137 0.826,0.137 0.348,0 0.62,-0.074 0.823,-0.221 0.202,-0.148 0.332,-0.306 0.393,-0.478 0.037,-0.11 0.054,-0.361 0.054,-0.754 v -1.418 c 0,-0.167 0.006,-0.272 0.02,-0.314 0.014,-0.043 0.032,-0.076 0.059,-0.097 0.025,-0.02 0.055,-0.031 0.089,-0.031 0.069,0 0.137,0.048 0.208,0.145 l 0.117,-0.094 c -0.13,-0.193 -0.265,-0.333 -0.405,-0.42 -0.138,-0.086 -0.297,-0.131 -0.474,-0.131 -0.208,0 -0.371,0.05 -0.489,0.148 -0.117,0.096 -0.189,0.244 -0.214,0.442 z m 0,0.285 v 1.223 c -0.315,-0.186 -0.549,-0.383 -0.703,-0.594 -0.103,-0.141 -0.154,-0.282 -0.154,-0.425 0,-0.119 0.043,-0.224 0.13,-0.317 0.065,-0.071 0.156,-0.106 0.273,-0.106 0.131,0 0.282,0.075 0.454,0.219"
         style="fill:#000000;fill-opacity:1;fill-rule:evenodd;stroke:none"
         id="path2389" /><path
         d="m 438.964,589.38499 h 1.861 v -0.072 l -2.028,-2.111 h 0.859 c 0.202,0 0.331,0.009 0.386,0.024 0.055,0.016 0.105,0.05 0.151,0.099 0.047,0.052 0.097,0.143 0.154,0.276 h 0.109 l -0.255,-0.797 h -1.908 v 0.085 l 2.027,2.11 h -0.843 c -0.178,0 -0.286,-0.006 -0.322,-0.015 -0.055,-0.012 -0.11,-0.042 -0.162,-0.093 -0.055,-0.049 -0.11,-0.132 -0.166,-0.247 h -0.112 l 0.249,0.741"
         style="fill:#000000;fill-opacity:1;fill-rule:evenodd;stroke:none"
         id="path2393" /><path
         d="m 461.511,551.61 c -0.445,-0.393 -0.845,-0.588 -1.2,-0.588 -0.208,0 -0.381,0.067 -0.518,0.204 -0.138,0.136 -0.207,0.308 -0.207,0.514 0,0.278 0.12,0.529 0.36,0.752 0.239,0.222 0.76,0.518 1.565,0.888 v 0.369 c 0,0.276 -0.014,0.448 -0.045,0.52 -0.029,0.072 -0.087,0.134 -0.169,0.189 -0.085,0.052 -0.177,0.079 -0.282,0.079 -0.169,0 -0.309,-0.038 -0.418,-0.113 -0.066,-0.046 -0.101,-0.102 -0.101,-0.165 0,-0.054 0.038,-0.122 0.109,-0.203 0.099,-0.112 0.149,-0.22 0.149,-0.324 0,-0.127 -0.048,-0.236 -0.143,-0.327 -0.096,-0.088 -0.22,-0.134 -0.372,-0.134 -0.164,0 -0.302,0.05 -0.412,0.15 -0.112,0.097 -0.167,0.213 -0.167,0.345 0,0.188 0.074,0.367 0.222,0.538 0.15,0.17 0.357,0.302 0.621,0.393 0.266,0.091 0.542,0.137 0.828,0.137 0.347,0 0.621,-0.074 0.824,-0.221 0.2,-0.148 0.331,-0.307 0.391,-0.479 0.037,-0.108 0.055,-0.361 0.055,-0.754 v -1.418 c 0,-0.165 0.006,-0.272 0.021,-0.314 0.012,-0.042 0.03,-0.075 0.057,-0.096 0.027,-0.02 0.056,-0.03 0.09,-0.03 0.068,0 0.138,0.047 0.207,0.144 l 0.117,-0.094 c -0.13,-0.194 -0.265,-0.334 -0.405,-0.42 -0.138,-0.087 -0.297,-0.13 -0.474,-0.13 -0.208,0 -0.371,0.048 -0.488,0.147 -0.118,0.096 -0.19,0.244 -0.215,0.441 z m 0,0.287 v 1.221 c -0.313,-0.185 -0.549,-0.382 -0.702,-0.592 -0.103,-0.142 -0.153,-0.284 -0.153,-0.426 0,-0.119 0.043,-0.225 0.13,-0.318 0.064,-0.069 0.155,-0.105 0.272,-0.105 0.131,0 0.281,0.074 0.453,0.22"
         style="fill:#000000;fill-opacity:1;fill-rule:evenodd;stroke:none"
         id="path2397" /><path
         d="m 464.18401,551.62399 c 0.066,-0.114 0.112,-0.22 0.139,-0.318 0.024,-0.098 0.049,-0.293 0.075,-0.582 l 0.129,-1.441 c 0.117,0.14 0.287,0.364 0.51,0.668 0.107,0.148 0.24,0.35 0.398,0.606 0.097,0.157 0.154,0.266 0.176,0.328 0.011,0.032 0.017,0.064 0.017,0.097 0,0.021 -0.006,0.04 -0.02,0.053 -0.014,0.013 -0.049,0.03 -0.107,0.049 -0.058,0.017 -0.106,0.052 -0.144,0.101 -0.038,0.05 -0.057,0.108 -0.057,0.172 0,0.081 0.025,0.145 0.072,0.193 0.045,0.049 0.104,0.074 0.174,0.074 0.086,0 0.16,-0.035 0.22,-0.108 0.062,-0.071 0.091,-0.169 0.091,-0.294 0,-0.154 -0.053,-0.331 -0.157,-0.529 -0.107,-0.198 -0.31,-0.502 -0.611,-0.912 -0.3,-0.411 -0.665,-0.858 -1.092,-1.341 -0.294,-0.334 -0.514,-0.546 -0.657,-0.633 -0.141,-0.086 -0.263,-0.13 -0.366,-0.13 -0.06,0 -0.114,0.023 -0.16,0.069 -0.046,0.047 -0.067,0.099 -0.067,0.16 0,0.076 0.03,0.145 0.094,0.208 0.064,0.062 0.132,0.094 0.206,0.094 0.039,0 0.073,-0.009 0.097,-0.027 0.017,-0.009 0.033,-0.038 0.052,-0.084 0.018,-0.045 0.035,-0.075 0.051,-0.092 0.009,-0.01 0.021,-0.014 0.036,-0.014 0.01,0 0.031,0.01 0.06,0.03 0.109,0.065 0.234,0.172 0.375,0.315 0.189,0.192 0.326,0.348 0.416,0.469 l -0.164,1.857 c -0.027,0.307 -0.068,0.494 -0.123,0.56 -0.055,0.066 -0.145,0.1 -0.274,0.1 -0.041,0 -0.116,-0.006 -0.221,-0.018 l -0.025,0.108 0.857,0.212"
         style="fill:#000000;fill-opacity:1;fill-rule:evenodd;stroke:none"
         id="path2401" /><path
         d="m 426.56599,542.95 c -0.445,-0.393 -0.846,-0.589 -1.199,-0.589 -0.208,0 -0.382,0.068 -0.52,0.205 -0.138,0.136 -0.207,0.309 -0.207,0.513 0,0.28 0.119,0.53 0.359,0.753 0.241,0.222 0.761,0.518 1.567,0.887 v 0.368 c 0,0.276 -0.015,0.449 -0.046,0.522 -0.028,0.071 -0.086,0.134 -0.169,0.188 -0.084,0.053 -0.177,0.081 -0.281,0.081 -0.17,0 -0.31,-0.039 -0.419,-0.115 -0.067,-0.047 -0.101,-0.101 -0.101,-0.164 0,-0.053 0.037,-0.122 0.11,-0.203 0.098,-0.113 0.148,-0.221 0.148,-0.325 0,-0.128 -0.048,-0.235 -0.142,-0.327 -0.096,-0.089 -0.219,-0.134 -0.374,-0.134 -0.163,0 -0.3,0.051 -0.411,0.149 -0.111,0.1 -0.167,0.215 -0.167,0.348 0,0.187 0.075,0.366 0.222,0.536 0.15,0.172 0.356,0.302 0.622,0.393 0.266,0.092 0.541,0.137 0.828,0.137 0.346,0 0.62,-0.074 0.822,-0.22 0.202,-0.148 0.332,-0.306 0.392,-0.479 0.038,-0.109 0.056,-0.361 0.056,-0.755 v -1.417 c 0,-0.167 0.006,-0.272 0.019,-0.315 0.014,-0.043 0.032,-0.074 0.059,-0.096 0.025,-0.02 0.056,-0.03 0.09,-0.03 0.067,0 0.136,0.047 0.208,0.144 l 0.115,-0.094 c -0.129,-0.193 -0.264,-0.333 -0.403,-0.42 -0.14,-0.087 -0.297,-0.13 -0.476,-0.13 -0.208,0 -0.37,0.049 -0.487,0.146 -0.117,0.099 -0.19,0.246 -0.215,0.443 z m 0,0.285 v 1.224 c -0.315,-0.186 -0.55,-0.384 -0.702,-0.594 -0.104,-0.142 -0.154,-0.282 -0.154,-0.425 0,-0.121 0.042,-0.226 0.129,-0.318 0.066,-0.071 0.156,-0.106 0.273,-0.106 0.132,0 0.282,0.074 0.454,0.219"
         style="fill:#000000;fill-opacity:1;fill-rule:evenodd;stroke:none"
         id="path2405" /><path
         d="m 429.32001,542.96201 c 0.096,-0.101 0.169,-0.203 0.217,-0.304 0.036,-0.071 0.093,-0.255 0.173,-0.553 l 0.258,0.386 c 0.068,0.094 0.152,0.183 0.249,0.268 0.097,0.085 0.183,0.144 0.257,0.174 0.047,0.021 0.1,0.029 0.156,0.029 0.084,0 0.151,-0.021 0.201,-0.066 0.049,-0.046 0.076,-0.101 0.076,-0.164 0,-0.075 -0.017,-0.125 -0.046,-0.153 -0.055,-0.049 -0.116,-0.074 -0.187,-0.074 -0.041,0 -0.085,0.009 -0.132,0.027 -0.091,0.033 -0.154,0.047 -0.185,0.047 -0.046,0 -0.102,-0.028 -0.167,-0.082 -0.121,-0.101 -0.265,-0.297 -0.433,-0.589 l 0.24,-1.007 c 0.038,-0.154 0.068,-0.247 0.094,-0.276 0.026,-0.032 0.05,-0.047 0.076,-0.047 0.041,0 0.089,0.023 0.144,0.068 0.108,0.089 0.199,0.208 0.275,0.351 l 0.102,-0.053 c -0.123,-0.23 -0.278,-0.421 -0.469,-0.574 -0.107,-0.086 -0.198,-0.129 -0.271,-0.129 -0.11,0 -0.197,0.061 -0.262,0.184 -0.041,0.077 -0.126,0.405 -0.254,0.985 -0.305,-0.53 -0.549,-0.869 -0.732,-1.023 -0.119,-0.096 -0.235,-0.146 -0.346,-0.146 -0.079,0 -0.15,0.028 -0.214,0.085 -0.047,0.044 -0.071,0.1 -0.071,0.174 0,0.064 0.022,0.118 0.065,0.16 0.042,0.043 0.095,0.064 0.158,0.064 0.062,0 0.129,-0.03 0.2,-0.094 0.05,-0.044 0.089,-0.066 0.116,-0.066 0.024,0 0.055,0.015 0.092,0.046 0.091,0.074 0.216,0.234 0.375,0.48 0.157,0.246 0.261,0.424 0.31,0.535 -0.122,0.473 -0.185,0.724 -0.197,0.752 -0.044,0.126 -0.103,0.217 -0.176,0.27 -0.072,0.052 -0.178,0.078 -0.319,0.078 -0.045,0 -0.097,-0.002 -0.154,-0.006 v 0.106 l 0.781,0.137"
         style="fill:#000000;fill-opacity:1;fill-rule:evenodd;stroke:none"
         id="path2409" /></g><g
       id="g3767-5"
       transform="matrix(0.66,0,0,0.66,92.637223,69.364613)"><path
         d="m 431.536,588.198 -0.223,-30.341 h 29.626"
         style="fill:none;stroke:#ff0000;stroke-width:1.134;stroke-linecap:butt;stroke-linejoin:miter;stroke-miterlimit:2.613;stroke-dasharray:none;stroke-opacity:1"
         id="path2237-6" /><path
         d="m 431.573,593.13 1.855,-6.333 c -1.261,0.912 -2.53,0.921 -3.804,0.027 l 1.949,6.306"
         style="fill:#ff0000;fill-opacity:1;fill-rule:evenodd;stroke:none"
         id="path2241-5" /><path
         d="m 465.89101,557.85699 -6.346,1.91 c 0.907,-1.273 0.907,-2.547 0,-3.82 l 6.346,1.91"
         style="fill:#ff0000;fill-opacity:1;fill-rule:evenodd;stroke:none"
         id="path2245-2" /><path
         d="M 431.549,557.621 420.737,546.385"
         style="fill:none;stroke:#ff0000;stroke-width:1.134;stroke-linecap:butt;stroke-linejoin:miter;stroke-miterlimit:2.613;stroke-dasharray:none;stroke-opacity:1"
         id="path2249-9" /><path
         d="m 417.312,542.826 5.763,3.239 c -1.542,0.231 -2.458,1.11 -2.747,2.644 l -3.016,-5.883"
         style="fill:#ff0000;fill-opacity:1;fill-rule:evenodd;stroke:none"
         id="path2253-9" /><path
         d="m 436.746,589.44299 c -0.446,-0.394 -0.846,-0.59 -1.2,-0.59 -0.208,0 -0.382,0.069 -0.519,0.206 -0.139,0.136 -0.207,0.308 -0.207,0.513 0,0.279 0.119,0.529 0.359,0.752 0.24,0.223 0.761,0.519 1.567,0.889 v 0.367 c 0,0.277 -0.015,0.449 -0.045,0.521 -0.03,0.072 -0.087,0.135 -0.169,0.189 -0.084,0.053 -0.179,0.079 -0.283,0.079 -0.168,0 -0.309,-0.039 -0.418,-0.113 -0.067,-0.046 -0.101,-0.101 -0.101,-0.164 0,-0.055 0.037,-0.123 0.109,-0.204 0.099,-0.112 0.15,-0.219 0.15,-0.323 0,-0.129 -0.049,-0.237 -0.144,-0.328 -0.096,-0.089 -0.219,-0.134 -0.373,-0.134 -0.164,0 -0.301,0.05 -0.412,0.15 -0.11,0.098 -0.166,0.214 -0.166,0.346 0,0.188 0.074,0.366 0.223,0.537 0.149,0.171 0.355,0.302 0.622,0.393 0.264,0.091 0.541,0.137 0.826,0.137 0.348,0 0.62,-0.074 0.823,-0.221 0.202,-0.148 0.332,-0.306 0.393,-0.478 0.037,-0.11 0.054,-0.361 0.054,-0.754 v -1.418 c 0,-0.167 0.006,-0.272 0.02,-0.314 0.014,-0.043 0.032,-0.076 0.059,-0.097 0.025,-0.02 0.055,-0.031 0.089,-0.031 0.069,0 0.137,0.048 0.208,0.145 l 0.117,-0.094 c -0.13,-0.193 -0.265,-0.333 -0.405,-0.42 -0.138,-0.086 -0.297,-0.131 -0.474,-0.131 -0.208,0 -0.371,0.05 -0.489,0.148 -0.117,0.096 -0.189,0.244 -0.214,0.442 z m 0,0.285 v 1.223 c -0.315,-0.186 -0.549,-0.383 -0.703,-0.594 -0.103,-0.141 -0.154,-0.282 -0.154,-0.425 0,-0.119 0.043,-0.224 0.13,-0.317 0.065,-0.071 0.156,-0.106 0.273,-0.106 0.131,0 0.282,0.075 0.454,0.219"
         style="fill:#000000;fill-opacity:1;fill-rule:evenodd;stroke:none"
         id="path2389-2" /><path
         d="m 438.964,589.38499 h 1.861 v -0.072 l -2.028,-2.111 h 0.859 c 0.202,0 0.331,0.009 0.386,0.024 0.055,0.016 0.105,0.05 0.151,0.099 0.047,0.052 0.097,0.143 0.154,0.276 h 0.109 l -0.255,-0.797 h -1.908 v 0.085 l 2.027,2.11 h -0.843 c -0.178,0 -0.286,-0.006 -0.322,-0.015 -0.055,-0.012 -0.11,-0.042 -0.162,-0.093 -0.055,-0.049 -0.11,-0.132 -0.166,-0.247 h -0.112 l 0.249,0.741"
         style="fill:#000000;fill-opacity:1;fill-rule:evenodd;stroke:none"
         id="path2393-0" /><path
         d="m 461.511,551.61 c -0.445,-0.393 -0.845,-0.588 -1.2,-0.588 -0.208,0 -0.381,0.067 -0.518,0.204 -0.138,0.136 -0.207,0.308 -0.207,0.514 0,0.278 0.12,0.529 0.36,0.752 0.239,0.222 0.76,0.518 1.565,0.888 v 0.369 c 0,0.276 -0.014,0.448 -0.045,0.52 -0.029,0.072 -0.087,0.134 -0.169,0.189 -0.085,0.052 -0.177,0.079 -0.282,0.079 -0.169,0 -0.309,-0.038 -0.418,-0.113 -0.066,-0.046 -0.101,-0.102 -0.101,-0.165 0,-0.054 0.038,-0.122 0.109,-0.203 0.099,-0.112 0.149,-0.22 0.149,-0.324 0,-0.127 -0.048,-0.236 -0.143,-0.327 -0.096,-0.088 -0.22,-0.134 -0.372,-0.134 -0.164,0 -0.302,0.05 -0.412,0.15 -0.112,0.097 -0.167,0.213 -0.167,0.345 0,0.188 0.074,0.367 0.222,0.538 0.15,0.17 0.357,0.302 0.621,0.393 0.266,0.091 0.542,0.137 0.828,0.137 0.347,0 0.621,-0.074 0.824,-0.221 0.2,-0.148 0.331,-0.307 0.391,-0.479 0.037,-0.108 0.055,-0.361 0.055,-0.754 v -1.418 c 0,-0.165 0.006,-0.272 0.021,-0.314 0.012,-0.042 0.03,-0.075 0.057,-0.096 0.027,-0.02 0.056,-0.03 0.09,-0.03 0.068,0 0.138,0.047 0.207,0.144 l 0.117,-0.094 c -0.13,-0.194 -0.265,-0.334 -0.405,-0.42 -0.138,-0.087 -0.297,-0.13 -0.474,-0.13 -0.208,0 -0.371,0.048 -0.488,0.147 -0.118,0.096 -0.19,0.244 -0.215,0.441 z m 0,0.287 v 1.221 c -0.313,-0.185 -0.549,-0.382 -0.702,-0.592 -0.103,-0.142 -0.153,-0.284 -0.153,-0.426 0,-0.119 0.043,-0.225 0.13,-0.318 0.064,-0.069 0.155,-0.105 0.272,-0.105 0.131,0 0.281,0.074 0.453,0.22"
         style="fill:#000000;fill-opacity:1;fill-rule:evenodd;stroke:none"
         id="path2397-5" /><path
         d="m 464.18401,551.62399 c 0.066,-0.114 0.112,-0.22 0.139,-0.318 0.024,-0.098 0.049,-0.293 0.075,-0.582 l 0.129,-1.441 c 0.117,0.14 0.287,0.364 0.51,0.668 0.107,0.148 0.24,0.35 0.398,0.606 0.097,0.157 0.154,0.266 0.176,0.328 0.011,0.032 0.017,0.064 0.017,0.097 0,0.021 -0.006,0.04 -0.02,0.053 -0.014,0.013 -0.049,0.03 -0.107,0.049 -0.058,0.017 -0.106,0.052 -0.144,0.101 -0.038,0.05 -0.057,0.108 -0.057,0.172 0,0.081 0.025,0.145 0.072,0.193 0.045,0.049 0.104,0.074 0.174,0.074 0.086,0 0.16,-0.035 0.22,-0.108 0.062,-0.071 0.091,-0.169 0.091,-0.294 0,-0.154 -0.053,-0.331 -0.157,-0.529 -0.107,-0.198 -0.31,-0.502 -0.611,-0.912 -0.3,-0.411 -0.665,-0.858 -1.092,-1.341 -0.294,-0.334 -0.514,-0.546 -0.657,-0.633 -0.141,-0.086 -0.263,-0.13 -0.366,-0.13 -0.06,0 -0.114,0.023 -0.16,0.069 -0.046,0.047 -0.067,0.099 -0.067,0.16 0,0.076 0.03,0.145 0.094,0.208 0.064,0.062 0.132,0.094 0.206,0.094 0.039,0 0.073,-0.009 0.097,-0.027 0.017,-0.009 0.033,-0.038 0.052,-0.084 0.018,-0.045 0.035,-0.075 0.051,-0.092 0.009,-0.01 0.021,-0.014 0.036,-0.014 0.01,0 0.031,0.01 0.06,0.03 0.109,0.065 0.234,0.172 0.375,0.315 0.189,0.192 0.326,0.348 0.416,0.469 l -0.164,1.857 c -0.027,0.307 -0.068,0.494 -0.123,0.56 -0.055,0.066 -0.145,0.1 -0.274,0.1 -0.041,0 -0.116,-0.006 -0.221,-0.018 l -0.025,0.108 0.857,0.212"
         style="fill:#000000;fill-opacity:1;fill-rule:evenodd;stroke:none"
         id="path2401-6" /><path
         d="m 426.56599,542.95 c -0.445,-0.393 -0.846,-0.589 -1.199,-0.589 -0.208,0 -0.382,0.068 -0.52,0.205 -0.138,0.136 -0.207,0.309 -0.207,0.513 0,0.28 0.119,0.53 0.359,0.753 0.241,0.222 0.761,0.518 1.567,0.887 v 0.368 c 0,0.276 -0.015,0.449 -0.046,0.522 -0.028,0.071 -0.086,0.134 -0.169,0.188 -0.084,0.053 -0.177,0.081 -0.281,0.081 -0.17,0 -0.31,-0.039 -0.419,-0.115 -0.067,-0.047 -0.101,-0.101 -0.101,-0.164 0,-0.053 0.037,-0.122 0.11,-0.203 0.098,-0.113 0.148,-0.221 0.148,-0.325 0,-0.128 -0.048,-0.235 -0.142,-0.327 -0.096,-0.089 -0.219,-0.134 -0.374,-0.134 -0.163,0 -0.3,0.051 -0.411,0.149 -0.111,0.1 -0.167,0.215 -0.167,0.348 0,0.187 0.075,0.366 0.222,0.536 0.15,0.172 0.356,0.302 0.622,0.393 0.266,0.092 0.541,0.137 0.828,0.137 0.346,0 0.62,-0.074 0.822,-0.22 0.202,-0.148 0.332,-0.306 0.392,-0.479 0.038,-0.109 0.056,-0.361 0.056,-0.755 v -1.417 c 0,-0.167 0.006,-0.272 0.019,-0.315 0.014,-0.043 0.032,-0.074 0.059,-0.096 0.025,-0.02 0.056,-0.03 0.09,-0.03 0.067,0 0.136,0.047 0.208,0.144 l 0.115,-0.094 c -0.129,-0.193 -0.264,-0.333 -0.403,-0.42 -0.14,-0.087 -0.297,-0.13 -0.476,-0.13 -0.208,0 -0.37,0.049 -0.487,0.146 -0.117,0.099 -0.19,0.246 -0.215,0.443 z m 0,0.285 v 1.224 c -0.315,-0.186 -0.55,-0.384 -0.702,-0.594 -0.104,-0.142 -0.154,-0.282 -0.154,-0.425 0,-0.121 0.042,-0.226 0.129,-0.318 0.066,-0.071 0.156,-0.106 0.273,-0.106 0.132,0 0.282,0.074 0.454,0.219"
         style="fill:#000000;fill-opacity:1;fill-rule:evenodd;stroke:none"
         id="path2405-1" /><path
         d="m 429.32001,542.96201 c 0.096,-0.101 0.169,-0.203 0.217,-0.304 0.036,-0.071 0.093,-0.255 0.173,-0.553 l 0.258,0.386 c 0.068,0.094 0.152,0.183 0.249,0.268 0.097,0.085 0.183,0.144 0.257,0.174 0.047,0.021 0.1,0.029 0.156,0.029 0.084,0 0.151,-0.021 0.201,-0.066 0.049,-0.046 0.076,-0.101 0.076,-0.164 0,-0.075 -0.017,-0.125 -0.046,-0.153 -0.055,-0.049 -0.116,-0.074 -0.187,-0.074 -0.041,0 -0.085,0.009 -0.132,0.027 -0.091,0.033 -0.154,0.047 -0.185,0.047 -0.046,0 -0.102,-0.028 -0.167,-0.082 -0.121,-0.101 -0.265,-0.297 -0.433,-0.589 l 0.24,-1.007 c 0.038,-0.154 0.068,-0.247 0.094,-0.276 0.026,-0.032 0.05,-0.047 0.076,-0.047 0.041,0 0.089,0.023 0.144,0.068 0.108,0.089 0.199,0.208 0.275,0.351 l 0.102,-0.053 c -0.123,-0.23 -0.278,-0.421 -0.469,-0.574 -0.107,-0.086 -0.198,-0.129 -0.271,-0.129 -0.11,0 -0.197,0.061 -0.262,0.184 -0.041,0.077 -0.126,0.405 -0.254,0.985 -0.305,-0.53 -0.549,-0.869 -0.732,-1.023 -0.119,-0.096 -0.235,-0.146 -0.346,-0.146 -0.079,0 -0.15,0.028 -0.214,0.085 -0.047,0.044 -0.071,0.1 -0.071,0.174 0,0.064 0.022,0.118 0.065,0.16 0.042,0.043 0.095,0.064 0.158,0.064 0.062,0 0.129,-0.03 0.2,-0.094 0.05,-0.044 0.089,-0.066 0.116,-0.066 0.024,0 0.055,0.015 0.092,0.046 0.091,0.074 0.216,0.234 0.375,0.48 0.157,0.246 0.261,0.424 0.31,0.535 -0.122,0.473 -0.185,0.724 -0.197,0.752 -0.044,0.126 -0.103,0.217 -0.176,0.27 -0.072,0.052 -0.178,0.078 -0.319,0.078 -0.045,0 -0.097,-0.002 -0.154,-0.006 v 0.106 l 0.781,0.137"
         style="fill:#000000;fill-opacity:1;fill-rule:evenodd;stroke:none"
         id="path2409-9" /></g></g></svg>
