<?xml version="1.0" encoding="UTF-8" standalone="no"?>
<!-- Created with Inkscape (http://www.inkscape.org/) -->

<svg
   width="49.985653mm"
   height="54.093147mm"
   viewBox="0 0 49.985653 54.093147"
   version="1.1"
   id="svg2235"
   inkscape:version="1.1 (c68e22c387, 2021-05-23)"
   sodipodi:docname="sphere_b.svg"
   xmlns:inkscape="http://www.inkscape.org/namespaces/inkscape"
   xmlns:sodipodi="http://sodipodi.sourceforge.net/DTD/sodipodi-0.dtd"
   xmlns="http://www.w3.org/2000/svg"
   xmlns:svg="http://www.w3.org/2000/svg">
  <sodipodi:namedview
     id="namedview2237"
     pagecolor="#ffffff"
     bordercolor="#666666"
     borderopacity="1.0"
     inkscape:pageshadow="2"
     inkscape:pageopacity="0.0"
     inkscape:pagecheckerboard="0"
     inkscape:document-units="mm"
     showgrid="false"
     fit-margin-top="0"
     fit-margin-left="0"
     fit-margin-right="0"
     fit-margin-bottom="0"
     inkscape:zoom="1.9598765"
     inkscape:cx="99.240945"
     inkscape:cy="146.18268"
     inkscape:window-width="1280"
     inkscape:window-height="995"
     inkscape:window-x="1351"
     inkscape:window-y="-9"
     inkscape:window-maximized="1"
     inkscape:current-layer="layer1" />
  <defs
     id="defs2232">
    <clipPath
       clipPathUnits="userSpaceOnUse"
       id="clipPath2233">
      <path
         d="m 1243.47,695.031 c -1.18,0 -27.14,662.329 -670.599,688.249 C 113.293,888.352 191.371,333.199 180.914,291.871 c 43.629,-3.34 773.316,-54.832 1062.556,403.16"
         clip-rule="evenodd"
         id="path2231" />
    </clipPath>
    <clipPath
       clipPathUnits="userSpaceOnUse"
       id="clipPath2243">
      <path
         d="M 0,0 H 3353 V 3363.52 H 0 Z"
         id="path2241" />
    </clipPath>
    <clipPath
       clipPathUnits="userSpaceOnUse"
       id="clipPath2249">
      <path
         d="m 542.184,781.199 h 941.396 c 0,519.651 -421.75,941.391 -941.396,941.391 -519.6527,0 -941.403,-421.74 -941.403,-941.391 0,-519.66 421.7503,-941.398 941.403,-941.398 519.646,0 941.396,421.738 941.396,941.398"
         clip-rule="evenodd"
         id="path2247" />
    </clipPath>
    <clipPath
       clipPathUnits="userSpaceOnUse"
       id="clipPath2255">
      <path
         d="m 1243.47,695.031 c -1.18,0 -27.14,662.329 -670.599,688.249 C 113.293,888.352 191.371,333.199 180.914,291.871 c 43.629,-3.34 773.316,-54.832 1062.556,403.16"
         clip-rule="evenodd"
         id="path2253" />
    </clipPath>
    <clipPath
       clipPathUnits="userSpaceOnUse"
       id="clipPath2261">
      <path
         d="m 113.293,237.039 h 1130.18 v 1146.24 H 113.293 Z"
         id="path2259" />
    </clipPath>
    <radialGradient
       fx="0"
       fy="0"
       cx="0"
       cy="0"
       r="1"
       gradientUnits="userSpaceOnUse"
       gradientTransform="matrix(941.399,0,0,-941.399,542.184,781.21)"
       spreadMethod="pad"
       id="radialGradient2267">
      <stop
         style="stop-opacity:1;stop-color:#f2fbfe"
         offset="0"
         id="stop2263" />
      <stop
         style="stop-opacity:1;stop-color:#7fd6f7"
         offset="1"
         id="stop2265" />
    </radialGradient>
  </defs>
  <g
     inkscape:label="Layer 1"
     inkscape:groupmode="layer"
     id="layer1"
     transform="translate(-38.727173,-71.773427)"
     style="display:inline">
    <g
       id="g14004">
      <path
         d="m 39.31518,121.7123 c 0.0452,0.0473 0.0791,0.0949 0.10239,0.14291 0.01612,0.0331 0.04368,0.11987 0.08103,0.25989 l 0.121405,-0.18161 c 0.03211,-0.0434 0.07125,-0.0862 0.117136,-0.12626 0.04589,-0.0396 0.08613,-0.0671 0.120989,-0.0816 0.02219,-0.01 0.04658,-0.0134 0.07331,-0.0134 0.03955,0 0.07069,0.0102 0.09425,0.0314 0.02329,0.0208 0.03528,0.0466 0.03528,0.0765 0,0.0353 -0.007,0.0589 -0.02081,0.0721 -0.02577,0.0233 -0.05498,0.0344 -0.08778,0.0344 -0.01943,0 -0.04024,-0.004 -0.06215,-0.0123 -0.04341,-0.0148 -0.07262,-0.0222 -0.08709,-0.0222 -0.02233,0 -0.04809,0.013 -0.07869,0.0384 -0.05678,0.0483 -0.124576,0.14002 -0.203535,0.27728 l 0.112861,0.47403 c 0.01723,0.0724 0.03211,0.11617 0.0441,0.13025 0.01199,0.014 0.02356,0.0212 0.03597,0.0212 0.01902,0 0.04162,-0.0106 0.06697,-0.0314 0.05085,-0.0423 0.09385,-0.0977 0.129812,-0.1658 l 0.04809,0.0247 c -0.05788,0.10897 -0.131325,0.19897 -0.220486,0.27023 -0.05044,0.0405 -0.09316,0.0606 -0.128157,0.0606 -0.05112,0 -0.09205,-0.0285 -0.122785,-0.0864 -0.01901,-0.0357 -0.05926,-0.19057 -0.119888,-0.46316 -0.142903,0.2486 -0.257556,0.40887 -0.344233,0.4808 -0.05581,0.0455 -0.110106,0.0688 -0.162747,0.0688 -0.03666,0 -0.06987,-0.0131 -0.100461,-0.0403 -0.02191,-0.0197 -0.03279,-0.0466 -0.03279,-0.0812 0,-0.0299 0.0102,-0.0552 0.03031,-0.0754 0.01971,-0.0205 0.04479,-0.0307 0.07442,-0.0307 0.02894,0 0.06064,0.0148 0.09343,0.0444 0.02398,0.0216 0.04245,0.0318 0.05512,0.0318 0.0113,0 0.02536,-0.007 0.04272,-0.0222 0.04327,-0.0346 0.102249,-0.11013 0.176389,-0.22588 0.07441,-0.11575 0.123334,-0.19967 0.146346,-0.25121 -0.05746,-0.22253 -0.08792,-0.34107 -0.09274,-0.35345 -0.02122,-0.0596 -0.04837,-0.10227 -0.08254,-0.12693 -0.0339,-0.0255 -0.08406,-0.0378 -0.14993,-0.0378 -0.02164,0 -0.04589,9.6e-4 -0.07304,0.003 v -0.0504 l 0.367521,-0.0638"
         style="fill:#ff0000;fill-opacity:1;fill-rule:evenodd;stroke:none;stroke-width:0.0352778"
         id="path2217" />
      <path
         d="m 87.926133,102.46509 c 0.03104,0.0536 0.05256,0.10294 0.06491,0.14951 0.01164,0.0466 0.02328,0.13769 0.03563,0.2734 l 0.06068,0.67772 c 0.05503,-0.0656 0.134761,-0.17032 0.239889,-0.3139 0.05045,-0.0699 0.112889,-0.16439 0.186972,-0.28469 0.04551,-0.0737 0.07267,-0.12527 0.0829,-0.15448 0.0053,-0.0145 0.0081,-0.0301 0.0081,-0.0456 0,-0.0102 -0.0028,-0.0183 -0.0095,-0.0254 -0.0067,-0.006 -0.02293,-0.0138 -0.05009,-0.0222 -0.02752,-0.009 -0.05009,-0.0251 -0.06773,-0.0484 -0.01799,-0.0229 -0.02716,-0.0504 -0.02716,-0.0805 0,-0.038 0.01129,-0.0681 0.03351,-0.0909 0.02187,-0.0233 0.04939,-0.0346 0.08255,-0.0346 0.04022,0 0.07444,0.017 0.103364,0.0509 0.02858,0.0328 0.04269,0.079 0.04269,0.1378 0,0.0724 -0.02469,0.156 -0.07444,0.24874 -0.04974,0.0936 -0.144992,0.23605 -0.286808,0.42898 -0.141112,0.19375 -0.312562,0.4039 -0.513645,0.63112 -0.138642,0.15766 -0.241653,0.25689 -0.309033,0.29781 -0.06667,0.0402 -0.124178,0.061 -0.172156,0.061 -0.02822,0 -0.05362,-0.0106 -0.07514,-0.0325 -0.02152,-0.0215 -0.0321,-0.0469 -0.0321,-0.0755 0,-0.0353 0.01482,-0.0677 0.0448,-0.0973 0.02963,-0.0293 0.06209,-0.0438 0.09701,-0.0438 0.01799,0 0.03387,0.004 0.04551,0.012 0.0074,0.005 0.01552,0.018 0.02399,0.0391 0.0088,0.0216 0.01693,0.0364 0.02434,0.0434 0.0042,0.005 0.0099,0.007 0.01658,0.007 0.0053,0 0.01517,-0.005 0.02858,-0.0138 0.0508,-0.0311 0.109714,-0.0812 0.176389,-0.14856 0.08855,-0.0903 0.153458,-0.16372 0.195791,-0.22049 l -0.07726,-0.87421 c -0.0127,-0.14429 -0.03175,-0.23206 -0.05786,-0.26321 -0.02575,-0.031 -0.06844,-0.0469 -0.12947,-0.0469 -0.01905,0 -0.05397,0.003 -0.103364,0.009 l -0.01199,-0.0513 0.403578,-0.0991"
         style="fill:#ff0000;fill-opacity:1;fill-rule:evenodd;stroke:none;stroke-width:0.0352778"
         id="path2219" />
      <path
         d="m 57.41336,71.773427 h 0.874924 V 71.808 l -0.95317,0.992011 h 0.40319 c 0.09564,0 0.15628,-0.0032 0.182033,-0.01094 0.02579,-0.0074 0.04935,-0.02293 0.07084,-0.04692 0.02191,-0.02328 0.0459,-0.06668 0.07278,-0.129469 h 0.05069 l -0.119874,0.375002 h -0.897114 v -0.04022 l 0.953594,-0.991659 H 57.65466 c -0.08393,0 -0.134761,0.0025 -0.151976,0.006 -0.02537,0.006 -0.05115,0.02081 -0.07624,0.04374 -0.02533,0.02364 -0.05112,0.06209 -0.078,0.116417 h -0.05221 l 0.117122,-0.348545"
         style="fill:#ff0000;fill-opacity:1;fill-rule:evenodd;stroke:none;stroke-width:0.0352778"
         id="path2221" />
      <path
         d="m 67.174439,91.257696 h 0.735859 c 0.192652,0 0.33722,0.04198 0.432576,0.124178 0.0955,0.08361 0.143581,0.185208 0.143581,0.304095 0,0.09525 -0.03073,0.186972 -0.09151,0.275872 -0.06061,0.08925 -0.150177,0.161925 -0.269804,0.217311 -0.119627,0.05503 -0.248321,0.08294 -0.386962,0.08294 -0.0864,0 -0.196215,-0.01556 -0.329495,-0.04695 l -0.148942,0.510117 c -0.03489,0.121003 -0.05211,0.201471 -0.05211,0.239501 0,0.02963 0.01228,0.05405 0.03694,0.07345 0.02508,0.01901 0.08435,0.03129 0.177906,0.03736 l -0.01379,0.05084 h -0.742879 l 0.01542,-0.05084 c 0.09744,0 0.1651,-0.01693 0.203271,-0.05045 0.03803,-0.0339 0.07895,-0.125942 0.123049,-0.277954 l 0.30868,-1.063307 c 0.03665,-0.128411 0.05514,-0.214136 0.05514,-0.25647 0,-0.03281 -0.01284,-0.05891 -0.0393,-0.07973 -0.02646,-0.02117 -0.08364,-0.03387 -0.173214,-0.03916 z m 0.257528,0.870656 c 0.103646,0.02716 0.187713,0.04022 0.251107,0.04022 0.09962,0 0.191276,-0.02046 0.27312,-0.06209 0.08255,-0.04127 0.146756,-0.103364 0.192935,-0.185561 0.04657,-0.08326 0.06943,-0.168981 0.06943,-0.257881 0,-0.09349 -0.02812,-0.166864 -0.08488,-0.220486 -0.05761,-0.05398 -0.143581,-0.08149 -0.259327,-0.08149 -0.06244,0 -0.138218,0.0081 -0.227542,0.02364 l -0.214841,0.743656"
         style="fill:#231f20;fill-opacity:1;fill-rule:evenodd;stroke:none;stroke-width:0.0352778"
         id="path2223" />
      <path
         d="m 56.193525,111.27216 c 0.159032,-0.0455 0.296298,-0.14775 0.412327,-0.30622 0.116417,-0.15832 0.174731,-0.31432 0.174731,-0.46633 0,-0.11219 -0.02551,-0.20077 -0.07595,-0.26526 -0.05041,-0.0649 -0.127741,-0.10721 -0.23107,-0.12774 z m 0.135044,-1.16417 c -0.07331,0.008 -0.141112,0.0282 -0.20313,0.0624 -0.06212,0.0336 -0.120967,0.0823 -0.177482,0.14581 -0.07511,0.086 -0.134762,0.18478 -0.178435,0.29559 -0.04452,0.11038 -0.06601,0.21661 -0.06601,0.31859 0,0.0998 0.02258,0.17777 0.06914,0.23566 0.0466,0.0581 0.116734,0.0966 0.211667,0.11423 z m -0.156951,1.26337 -0.144957,0.58455 h -0.236749 l 0.172262,-0.58992 c -0.160973,-0.0267 -0.286527,-0.0892 -0.376097,-0.18866 -0.08996,-0.0988 -0.135184,-0.22296 -0.135184,-0.37359 0,-0.20754 0.08795,-0.39025 0.263913,-0.54681 0.176106,-0.15709 0.390807,-0.24239 0.645195,-0.25548 l 0.161643,-0.55838 h 0.109008 l -0.135184,0.56445 c 0.171838,0.0165 0.307304,0.0712 0.407211,0.16467 0.09934,0.0932 0.149084,0.21139 0.149084,0.35458 0,0.19897 -0.08502,0.38241 -0.255341,0.54818 -0.170321,0.16687 -0.378812,0.26526 -0.624804,0.29641"
         style="fill:#231f20;fill-opacity:1;fill-rule:evenodd;stroke:none;stroke-width:0.0352778"
         id="path2225" />
      <g
         id="g2227"
         transform="matrix(0.03527778,0,0,-0.03527778,37.568517,127.51549)"
         style="display:inline">
        <g
           id="g2229"
           clip-path="url(#clipPath2233)">
          <path
             d="m 1243.47,695.031 c -1.18,0 -27.14,662.329 -670.599,688.249 C 113.293,888.352 191.371,333.199 180.914,291.871 224.543,288.531 954.23,237.039 1243.47,695.031 Z M 180.914,288.582 h 1062.55 v 1094.7 H 180.914 Z m 361.27,492.617 h 941.396 c 0,519.651 -421.75,941.391 -941.396,941.391 -519.6527,0 -941.403,-421.74 -941.403,-941.391 0,-519.66 421.7503,-941.398 941.403,-941.398 519.646,0 941.396,421.738 941.396,941.398"
             style="fill:#bebdbd;fill-opacity:1;fill-rule:evenodd;stroke:none"
             id="path2235" />
        </g>
      </g>
      <g
         id="g2237"
         transform="matrix(0.03527778,0,0,-0.03527778,37.568517,127.51549)"
         style="display:inline">
        <g
           id="g2239"
           clip-path="url(#clipPath2243)">
          <g
             id="g2245"
             clip-path="url(#clipPath2249)">
            <g
               id="g2251"
               clip-path="url(#clipPath2255)">
              <g
                 id="g2257"
                 clip-path="url(#clipPath2261)">
                <path
                   d="m 243,288 v 1 h -30 v 1 h -20 v 1 h -13 v 2 h 1 v 15 h 1 v 12 h -1 v 93 h 1 v 31 h 1 v 22 h 1 v 16 h 1 v 15 h 1 v 12 h 1 v 12 h 1 v 11 h 1 v 9 h 1 v 10 h 1 v 9 h 1 v 8 h 1 v 8 h 1 v 8 h 1 v 8 h 1 v 7 h 1 v 6 h 1 v 7 h 1 v 6 h 1 v 7 h 1 v 6 h 1 v 6 h 1 v 6 h 1 v 5 h 1 v 6 h 1 v 6 h 1 v 5 h 1 v 6 h 1 v 4 h 1 v 5 h 1 v 5 h 1 v 5 h 1 v 5 h 1 v 5 h 1 v 5 h 1 v 4 h 1 v 5 h 1 v 4 h 1 v 4 h 1 v 4 h 1 v 5 h 1 v 4 h 1 v 4 h 1 v 5 h 1 v 4 h 1 v 4 h 1 v 3 h 1 v 4 h 1 v 4 h 1 v 4 h 1 v 3 h 1 v 4 h 1 v 4 h 1 v 4 h 1 v 4 h 1 v 3 h 1 v 4 h 1 v 3 h 1 v 3 h 1 v 4 h 1 v 3 h 1 v 3 h 1 v 4 h 1 v 3 h 1 v 4 h 1 v 3 h 1 v 3 h 1 v 4 h 1 v 3 h 1 v 3 h 1 v 3 h 1 v 3 h 1 v 3 h 1 v 3 h 1 v 3 h 1 v 3 h 1 v 3 h 1 v 3 h 1 v 3 h 1 v 3 h 1 v 3 h 1 v 3 h 1 v 3 h 1 v 3 h 1 v 3 h 1 v 2 h 1 v 3 h 1 v 3 h 1 v 2 h 1 v 3 h 1 v 3 h 1 v 3 h 1 v 2 h 1 v 3 h 1 v 3 h 1 v 2 h 1 v 3 h 1 v 3 h 1 v 3 h 1 v 2 h 1 v 3 h 1 v 2 h 1 v 2 h 1 v 3 h 1 v 2 h 1 v 3 h 1 v 2 h 1 v 3 h 1 v 2 h 1 v 3 h 1 v 2 h 1 v 3 h 1 v 2 h 1 v 2 h 1 v 3 h 1 v 2 h 1 v 3 h 1 v 2 h 1 v 2 h 1 v 3 h 1 v 2 h 1 v 2 h 1 v 2 h 1 v 3 h 1 v 2 h 1 v 2 h 1 v 2 h 1 v 2 h 1 v 3 h 1 v 2 h 1 v 2 h 1 v 2 h 1 v 3 h 1 v 2 h 1 v 2 h 1 v 2 h 1 v 3 h 1 v 2 h 1 v 2 h 1 v 2 h 1 v 2 h 1 v 2 h 1 v 2 h 1 v 2 h 1 v 2 h 1 v 2 h 1 v 2 h 1 v 2 h 1 v 2 h 1 v 2 h 1 v 2 h 1 v 2 h 1 v 2 h 1 v 2 h 1 v 2 h 1 v 2 h 1 v 2 h 1 v 2 h 1 v 2 h 1 v 3 h 1 v 2 h 1 v 1 h 1 v 2 h 1 v 2 h 1 v 2 h 1 v 2 h 1 v 2 h 1 v 2 h 1 v 1 h 1 v 2 h 1 v 2 h 1 v 2 h 1 v 2 h 1 v 2 h 1 v 2 h 1 v 1 h 1 v 2 h 1 v 2 h 1 v 2 h 1 v 2 h 1 v 2 h 1 v 2 h 1 v 1 h 1 v 2 h 1 v 2 h 1 v 2 h 1 v 2 h 1 v 1 h 1 v 2 h 1 v 2 h 1 v 1 h 1 v 2 h 1 v 2 h 1 v 2 h 1 v 1 h 1 v 2 h 1 v 2 h 1 v 1 h 1 v 2 h 1 v 2 h 1 v 1 h 1 v 2 h 1 v 2 h 1 v 2 h 1 v 1 h 1 v 2 h 1 v 2 h 1 v 1 h 1 v 2 h 1 v 2 h 1 v 1 h 1 v 2 h 1 v 2 h 1 v 1 h 1 v 2 h 1 v 2 h 1 v 1 h 1 v 2 h 1 v 1 h 1 v 2 h 1 v 1 h 1 v 2 h 1 v 1 h 1 v 2 h 1 v 2 h 1 v 1 h 1 v 2 h 1 v 1 h 1 v 2 h 1 v 1 h 1 v 2 h 1 v 2 h 1 v 1 h 1 v 2 h 1 v 1 h 1 v 2 h 1 v 1 h 1 v 2 h 1 v 1 h 1 v 2 h 1 v 2 h 1 v 1 h 1 v 2 h 1 v 1 h 1 v 2 h 1 v 1 h 1 v 1 h 1 v 2 h 1 v 1 h 1 v 2 h 1 v 1 h 1 v 2 h 1 v 1 h 1 v 2 h 1 v 1 h 1 v 1 h 1 v 2 h 1 v 1 h 1 v 2 h 1 v 1 h 1 v 2 h 1 v 1 h 1 v 1 h 1 v 2 h 1 v 1 h 1 v 2 h 1 v 1 h 1 v 2 h 1 v 1 h 1 v 1 h 1 v 2 h 1 v 1 h 1 v 2 h 1 v 1 h 1 v 2 h 1 v 1 h 1 v 1 h 1 v 2 h 1 v 1 h 1 v 1 h 1 v 2 h 1 v 1 h 1 v 1 h 1 v 2 h 1 v 1 h 1 v 1 h 1 v 2 h 1 v 1 h 1 v 1 h 1 v 2 h 1 v 1 h 1 v 1 h 1 v 2 h 1 v 1 h 1 v 1 h 1 v 1 h 1 v 2 h 1 v 1 h 1 v 1 h 1 v 2 h 1 v 1 h 1 v 1 h 1 v 2 h 1 v 1 h 1 v 1 h 1 v 2 h 1 v 1 h 1 v 1 h 1 v 2 h 1 v 1 h 1 v 1 h 1 v 2 h 1 v 1 h 1 v 1 h 1 v 1 h 1 v 1 h 1 v 2 h 1 v 1 h 1 v 1 h 1 v 1 h 1 v 2 h 1 v 1 h 1 v 1 h 1 v 1 h 1 v 1 h 1 v 2 h 1 v 1 h 1 v 1 h 1 v 1 h 1 v 1 h 1 v 2 h 1 v 1 h 1 v 1 h 1 v 1 h 1 v 2 h 1 v 1 h 1 v 1 h 1 v 1 h 1 v 1 h 1 v 2 h 1 v 1 h 1 v 1 h 1 v 1 h 1 v 2 h 1 v 1 h 1 v 1 h 1 v 1 h 1 v 1 h 1 v 2 h 1 v 1 h 1 v 1 h 1 v 1 h 1 v 1 h 1 v 1 h 1 v 2 h 1 v 1 h 1 v 1 h 1 v 1 h 1 v 1 h 1 v 1 h 1 v 1 h 1 v 1 h 1 v 2 h 1 v 1 h 1 v 1 h 1 v 1 h 1 v 1 h 1 v 1 h 1 v 1 h 1 v 2 h 1 v 1 h 1 v 1 h 1 v 1 h 1 v 1 h 1 v 1 h 1 v 1 h 1 v 2 h 1 v 1 h 1 v 1 h 1 v 1 h 1 v 1 h 1 v 1 h 1 v 1 h 1 v 1 h 1 v 1 h 1 v 1 h 1 v 2 h 1 v 1 h 1 v 1 h 1 v 1 h 1 v 1 h 1 v 1 h 8 v -1 h 16 v -1 h 12 v -1 h 12 v -1 h 12 v -1 h 7 v -1 h 7 v -1 h 7 v -1 h 7 v -1 h 8 v -1 h 7 v -1 h 7 v -1 h 6 v -1 h 5 v -1 h 5 v -1 h 4 v -1 h 5 v -1 h 5 v -1 h 4 v -1 h 5 v -1 h 5 v -1 h 4 v -1 h 5 v -1 h 5 v -1 h 3 v -1 h 3 v -1 h 4 v -1 h 3 v -1 h 4 v -1 h 3 v -1 h 4 v -1 h 3 v -1 h 4 v -1 h 3 v -1 h 3 v -1 h 4 v -1 h 3 v -1 h 4 v -1 h 2 v -1 h 3 v -1 h 3 v -1 h 2 v -1 h 3 v -1 h 3 v -1 h 2 v -1 h 3 v -1 h 3 v -1 h 2 v -1 h 3 v -1 h 3 v -1 h 3 v -1 h 2 v -1 h 3 v -1 h 3 v -1 h 2 v -1 h 2 v -1 h 2 v -1 h 3 v -1 h 2 v -1 h 2 v -1 h 2 v -1 h 2 v -1 h 2 v -1 h 3 v -1 h 2 v -1 h 2 v -1 h 2 v -1 h 2 v -1 h 3 v -1 h 2 v -1 h 2 v -1 h 2 v -1 h 2 v -1 h 2 v -1 h 2 v -1 h 2 v -1 h 2 v -1 h 2 v -1 h 1 v -1 h 2 v -1 h 2 v -1 h 2 v -1 h 2 v -1 h 1 v -1 h 2 v -1 h 2 v -1 h 2 v -1 h 2 v -1 h 1 v -1 h 2 v -1 h 2 v -1 h 2 v -1 h 2 v -1 h 1 v -1 h 2 v -1 h 2 v -1 h 1 v -1 h 2 v -1 h 2 v -1 h 1 v -1 h 2 v -1 h 1 v -1 h 2 v -1 h 1 v -1 h 2 v -1 h 1 v -1 h 2 v -1 h 1 v -1 h 2 v -1 h 1 v -1 h 2 v -1 h 1 v -1 h 2 v -1 h 1 v -1 h 2 v -1 h 2 v -1 h 1 v -1 h 2 v -1 h 1 v -1 h 1 v -1 h 2 v -1 h 1 v -1 h 1 v -1 h 2 v -1 h 1 v -1 h 1 v -1 h 2 v -1 h 1 v -1 h 1 v -1 h 2 v -1 h 1 v -1 h 1 v -1 h 2 v -1 h 1 v -1 h 1 v -1 h 1 v -1 h 2 v -1 h 1 v -1 h 1 v -1 h 2 v -1 h 1 v -1 h 1 v -1 h 2 v -1 h 1 v -1 h 1 v -1 h 1 v -1 h 2 v -1 h 1 v -1 h 1 v -1 h 1 v -1 h 1 v -1 h 1 v -1 h 1 v -1 h 1 v -1 h 2 v -1 h 1 v -1 h 1 v -1 h 1 v -1 h 1 v -1 h 1 v -1 h 1 v -1 h 2 v -1 h 1 v -1 h 1 v -1 h 1 v -1 h 1 v -1 h 1 v -1 h 1 v -1 h 2 v -1 h 1 v -1 h 1 v -1 h 1 v -1 h 1 v -1 h 1 v -1 h 1 v -1 h 1 v -1 h 1 v -1 h 1 v -1 h 1 v -1 h 1 v -1 h 1 v -1 h 1 v -1 h 1 v -1 h 1 v -1 h 1 v -1 h 1 v -1 h 1 v -1 h 1 v -1 h 1 v -1 h 1 v -1 h 1 v -1 h 1 v -1 h 1 v -1 h 1 v -1 h 1 v -1 h 1 v -1 h 1 v -1 h 1 v -1 h 1 v -1 h 1 v -1 h 1 v -1 h 1 v -2 h 1 v -1 h 1 v -1 h 1 v -1 h 1 v -1 h 1 v -1 h 1 v -1 h 1 v -2 h 1 v -1 h 1 v -1 h 1 v -1 h 1 v -1 h 1 v -1 h 1 v -1 h 1 v -2 h 1 v -1 h 1 v -1 h 1 v -1 h 1 v -1 h 1 v -1 h 1 v -1 h 1 v -2 h 1 v -1 h 1 v -1 h 1 v -1 h 1 v -1 h 1 v -2 h 1 v -1 h 1 v -1 h 1 v -1 h 1 v -2 h 1 v -1 h 1 v -1 h 1 v -2 h 1 v -1 h 1 v -1 h 1 v -2 h 1 v -1 h 1 v -1 h 1 v -1 h 1 v -2 h 1 v -1 h 1 v -1 h 1 v -2 h 1 v -1 h 1 v -1 h 1 v -1 h 1 v -2 h 1 v -1 h 1 v -2 h 1 v -1 h 1 v -2 h 1 v -1 h 1 v -1 h 1 v -2 h 1 v -1 h 1 v -2 h 1 v -1 h 1 v -2 h 1 v -1 h 1 v -2 h 1 v -1 h 1 v -2 h 1 v -1 h 1 v -1 h 1 v -2 h 1 v -1 h 1 v -2 h 1 v -1 h 1 v -2 h 1 v -1 h 1 v -2 h 1 v -2 h 1 v -1 h 1 v -2 h 1 v -2 h 1 v -1 h 1 v -2 h 1 v -2 h 1 v -1 h 1 v -2 h 1 v -1 h 1 v -2 h 1 v -2 h 1 v -1 h 1 v -2 h 1 v -2 h 1 v -1 h 1 v -2 h 1 v -2 h 1 v -2 h 1 v -1 h 1 v -2 h 1 v -2 h 1 v -2 h 1 v -2 h 1 v -2 h 1 v -1 h 1 v -2 h 1 v -2 h 1 v -2 h 1 v -2 h 1 v -2 h 1 v -1 h 1 v -2 h 1 v -2 h 1 v -2 h 1 v -2 h 1 v -2 h 1 v -2 h 1 v -2 h 1 v -2 h 1 v -2 h 1 v -2 h 1 v -2 h 1 v -3 h 1 v -2 h 1 v -2 h 1 v -2 h 1 v -2 h 1 v -2 h 1 v -2 h 1 v -2 h 1 v -3 h 1 v -2 h 1 v -2 h 1 v -2 h 1 v -3 h 1 v -2 h 1 v -2 h 1 v -3 h 1 v -2 h 1 v -2 h 1 v -2 h 1 v -3 h 1 v -2 h 1 v -3 h 1 v -2 h 1 v -3 h 1 v -3 h 1 v -2 h 1 v -3 h 1 v -2 h 1 v -3 h 1 v -2 h 1 v -3 h 1 v -3 h 1 v -2 h 1 v -3 h 1 v -3 h 1 v -3 h 1 v -3 h 1 v -3 h 1 v -3 h 1 v -3 h 1 v -2 h 1 v -3 h 1 v -3 h 1 v -4 h 1 v -3 h 1 v -3 h 1 v -3 h 1 v -3 h 1 v -4 h 1 v -3 h 1 v -3 h 1 v -4 h 1 v -3 h 1 v -4 h 1 v -4 h 1 v -3 h 1 v -4 h 1 v -3 h 1 v -4 h 1 v -4 h 1 v -4 h 1 v -4 h 1 v -4 h 1 v -4 h 1 v -5 h 1 v -4 h 1 v -5 h 1 v -4 h 1 v -5 h 1 v -4 h 1 v -5 h 1 v -6 h 1 v -5 h 1 v -5 h 1 v -5 h 1 v -6 h 1 v -6 h 1 v -6 h 1 v -7 h 1 v -7 h 1 v -7 h 1 v -8 h 1 v -9 h 1 v -9 h 1 v -11 h 1 v -7 h -1 v -2 h -1 v -1 h -1 v -2 h -1 v -2 h -1 v -1 h -1 v -2 h -1 v -1 h -1 v -2 h -1 v -1 h -1 v -1 h -1 v -2 h -1 v -1 h -1 v -2 h -1 v -1 h -1 v -2 h -1 v -1 h -1 v -1 h -1 v -2 h -1 v -1 h -1 v -2 h -1 v -1 h -1 v -2 h -1 v -1 h -1 v -1 h -1 v -2 h -1 v -1 h -1 v -2 h -1 v -1 h -1 v -1 h -1 v -2 h -1 v -1 h -1 v -1 h -1 v -1 h -1 v -2 h -1 v -1 h -1 v -1 h -1 v -1 h -1 v -2 h -1 v -1 h -1 v -1 h -1 v -1 h -1 v -2 h -1 v -1 h -1 v -1 h -1 v -1 h -1 v -2 h -1 v -1 h -1 v -1 h -1 v -1 h -1 v -2 h -1 v -1 h -1 v -1 h -1 v -1 h -1 v -2 h -1 v -1 h -1 v -1 h -1 v -1 h -1 v -2 h -1 v -1 h -1 v -1 h -1 v -1 h -1 v -1 h -1 v -1 h -1 v -1 h -1 v -1 h -1 v -1 h -1 v -2 h -1 v -1 h -1 v -1 h -1 v -1 h -1 v -1 h -1 v -1 h -1 v -1 h -1 v -1 h -1 v -1 h -1 v -1 h -1 v -1 h -1 v -2 h -1 v -1 h -1 v -1 h -1 v -1 h -1 v -1 h -1 v -1 h -1 v -1 h -1 v -1 h -1 v -1 h -1 v -1 h -1 v -1 h -1 v -2 h -1 v -1 h -1 v -1 h -1 v -1 h -1 v -1 h -1 v -1 h -1 v -1 h -1 v -1 h -2 v -1 h -1 v -1 h -1 v -1 h -1 v -1 h -1 v -1 h -1 v -1 h -1 v -1 h -1 v -1 h -1 v -1 h -1 v -1 h -1 v -1 h -1 v -1 h -1 v -1 h -1 v -1 h -1 v -1 h -1 v -1 h -1 v -1 h -1 v -1 h -1 v -1 h -2 v -1 h -1 v -1 h -1 v -1 h -1 v -1 h -1 v -1 h -1 v -1 h -1 v -1 h -1 v -1 h -1 v -1 h -1 v -1 h -1 v -1 h -1 v -1 h -2 v -1 h -1 v -1 h -1 v -1 h -1 v -1 h -1 v -1 h -2 v -1 h -1 v -1 h -1 v -1 h -1 v -1 h -1 v -1 h -2 v -1 h -1 v -1 h -1 v -1 h -1 v -1 h -1 v -1 h -2 v -1 h -1 v -1 h -1 v -1 h -1 v -1 h -1 v -1 h -2 v -1 h -1 v -1 h -1 v -1 h -1 v -1 h -1 v -1 h -2 v -1 h -1 v -1 h -1 v -1 h -1 v -1 h -2 v -1 h -1 v -1 h -1 v -1 h -2 v -1 h -1 v -1 h -1 v -1 h -2 v -1 h -1 v -1 h -2 v -1 h -1 v -1 h -1 v -1 h -2 v -1 h -1 v -1 h -1 v -1 h -2 v -1 h -1 v -1 h -1 v -1 h -2 v -1 h -1 v -1 h -2 v -1 h -1 v -1 h -1 v -1 h -2 v -1 h -1 v -1 h -1 v -1 h -2 v -1 h -1 v -1 h -1 v -1 h -2 v -1 h -2 v -1 h -1 v -1 h -2 v -1 h -1 v -1 h -2 v -1 h -1 v -1 h -2 v -1 h -1 v -1 h -2 v -1 h -1 v -1 h -2 v -1 h -1 v -1 h -2 v -1 h -2 v -1 h -1 v -1 h -2 v -1 h -1 v -1 h -2 v -1 h -1 v -1 h -2 v -1 h -1 v -1 h -2 v -1 h -1 v -1 h -2 v -1 h -2 v -1 h -1 v -1 h -2 v -1 h -2 v -1 h -2 v -1 h -1 v -1 h -2 v -1 h -2 v -1 h -2 v -1 h -1 v -1 h -2 v -1 h -2 v -1 h -1 v -1 h -2 v -1 h -2 v -1 h -2 v -1 h -1 v -1 h -2 v -1 h -2 v -1 h -2 v -1 h -1 v -1 h -2 v -1 h -2 v -1 h -2 v -1 h -2 v -1 h -2 v -1 h -2 v -1 h -1 v -1 h -2 v -1 h -2 v -1 h -2 v -1 h -2 v -1 h -2 v -1 h -2 v -1 h -2 v -1 h -2 v -1 h -2 v -1 h -2 v -1 h -2 v -1 h -2 v -1 h -2 v -1 h -2 v -1 h -2 v -1 h -2 v -1 h -2 v -1 h -2 v -1 h -2 v -1 h -2 v -1 h -3 v -1 h -2 v -1 h -2 v -1 h -2 v -1 h -2 v -1 h -3 v -1 h -2 v -1 h -2 v -1 h -2 v -1 h -2 v -1 h -3 v -1 h -2 v -1 h -2 v -1 h -2 v -1 h -2 v -1 h -3 v -1 h -2 v -1 h -3 v -1 h -2 v -1 h -3 v -1 h -2 v -1 h -3 v -1 h -2 v -1 h -3 v -1 h -2 v -1 h -3 v -1 h -2 v -1 h -2 v -1 h -3 v -1 h -2 v -1 h -3 v -1 h -2 v -1 h -3 v -1 h -3 v -1 h -2 v -1 h -3 v -1 h -3 v -1 h -3 v -1 h -3 v -1 h -2 v -1 h -3 v -1 h -3 v -1 h -3 v -1 h -3 v -1 h -3 v -1 h -2 v -1 h -3 v -1 h -3 v -1 h -3 v -1 h -3 v -1 h -3 v -1 h -3 v -1 h -4 v -1 h -3 v -1 h -3 v -1 h -3 v -1 h -3 v -1 h -3 v -1 h -4 v -1 h -3 v -1 h -3 v -1 h -3 v -1 h -4 v -1 h -3 v -1 h -4 v -1 h -4 v -1 h -3 v -1 h -4 v -1 h -3 v -1 h -4 v -1 h -4 v -1 h -3 v -1 h -4 v -1 h -3 v -1 h -4 v -1 h -5 v -1 h -4 v -1 h -4 v -1 h -4 v -1 h -4 v -1 h -4 v -1 h -4 v -1 h -4 v -1 h -5 v -1 h -4 v -1 h -5 v -1 h -4 v -1 h -5 v -1 h -5 v -1 h -5 v -1 h -4 v -1 h -5 v -1 h -5 v -1 h -5 v -1 h -5 v -1 h -6 v -1 h -5 v -1 h -6 v -1 h -5 v -1 h -6 v -1 h -5 v -1 h -7 v -1 h -6 v -1 h -6 v -1 h -7 v -1 h -6 v -1 h -7 v -1 h -7 v -1 h -7 v -1 h -8 v -1 h -8 v -1 h -7 v -1 h -8 v -1 h -10 v -1 h -9 v -1 h -9 v -1 h -10 v -1 h -11 v -1 h -12 v -1 h -11 v -1 h -15 v -1 h -15 v -1 h -18 v -1 h -21 v -1 h -33 v -1"
                   style="fill:url(#radialGradient2267);fill-opacity:1;fill-rule:nonzero;stroke:none"
                   id="path2269" />
              </g>
            </g>
          </g>
        </g>
      </g>
      <path
         d="m 57.736505,103.07928 9.83054,10.49627 m -0.04272,-0.0834 c 0,0 0.833296,-23.323479 -9.745768,-34.818742"
         style="fill:none;stroke:#231f20;stroke-width:0.0998361;stroke-linecap:butt;stroke-linejoin:miter;stroke-miterlimit:2.613;stroke-dasharray:1.00013, 0.499886;stroke-dashoffset:0;stroke-opacity:1"
         id="path2271" />
      <path
         d="m 67.423853,107.28548 c 0.273403,0 0.496358,0.22324 0.496358,0.49636 0,0.27369 -0.222955,0.49664 -0.496358,0.49664 -0.273403,0 -0.496359,-0.22295 -0.496359,-0.49664 0,-0.27312 0.222956,-0.49636 0.496359,-0.49636"
         style="fill:#231f20;fill-opacity:1;fill-rule:evenodd;stroke:none;stroke-width:0.0352778"
         id="path2273" />
      <path
         d="m 67.423853,107.28548 c 0.273403,0 0.496358,0.22324 0.496358,0.49636 0,0.27369 -0.222955,0.49664 -0.496358,0.49664 -0.273403,0 -0.496359,-0.22295 -0.496359,-0.49664 0,-0.27312 0.222956,-0.49636 0.496359,-0.49636 z"
         style="fill:#ff0000;stroke:#ff0000;stroke-width:0.200025;stroke-linecap:butt;stroke-linejoin:miter;stroke-miterlimit:2.613;stroke-dasharray:none;stroke-opacity:1;fill-opacity:1"
         id="path2275" />
      <path
         d="m 60.438853,107.99309 c -1.779058,0.69716 -4.032568,1.08369 -6.325623,1.08369 -0.672042,0 -1.423494,-0.0384 -2.056024,-0.0962"
         style="fill:none;stroke:#231f20;stroke-width:0.0998361;stroke-linecap:butt;stroke-linejoin:miter;stroke-miterlimit:2.613;stroke-dasharray:none;stroke-opacity:1"
         id="path2277" />
      <path
         d="m 61.635546,107.52428 -1.194894,0.93804 c 0.0871,-0.34714 -0.01944,-0.61941 -0.319299,-0.81524 l 1.514193,-0.1228"
         style="fill:#231f20;fill-opacity:1;fill-rule:evenodd;stroke:none;stroke-width:0.0352778"
         id="path2279" />
      <path
         d="m 57.710046,89.705121 c 2.611261,1.562453 4.441578,6.491817 4.441578,11.958499 0,0.68298 -0.04879,1.41527 -0.09786,2.04957"
         style="fill:none;stroke:#231f20;stroke-width:0.0998361;stroke-linecap:butt;stroke-linejoin:miter;stroke-miterlimit:2.613;stroke-dasharray:none;stroke-opacity:1"
         id="path2281" />
      <path
         d="m 61.955374,104.99518 0.548181,-1.41704 c -0.306881,0.18521 -0.597923,0.16221 -0.873125,-0.0667 l 0.324944,1.48375"
         style="fill:#231f20;fill-opacity:1;fill-rule:evenodd;stroke:none;stroke-width:0.0352778"
         id="path2283" />
      <path
         d="m 60.659339,96.00859 c 0.02124,-0.09814 0.03665,-0.187713 0.04685,-0.267758 0.0099,-0.08047 0.01517,-0.155575 0.01517,-0.224367 0,-0.115747 -0.01834,-0.203235 -0.05457,-0.262925 -0.03637,-0.05951 -0.08999,-0.08985 -0.16055,-0.08985 -0.09313,0 -0.182738,0.07221 -0.269522,0.218017 -0.08682,0.144568 -0.1651,0.354436 -0.234985,0.626886 z m -0.686541,0.110384 c -0.02921,0.117546 -0.05112,0.224049 -0.06558,0.31817 -0.01422,0.09493 -0.02124,0.179282 -0.02124,0.253965 0,0.106257 0.01806,0.190606 0.05292,0.251919 0.03528,0.06174 0.08322,0.09204 0.144286,0.09204 0.101001,0 0.19939,-0.07937 0.29464,-0.238407 0.09451,-0.15875 0.178859,-0.384598 0.252589,-0.677686 z m -0.31817,0.337185 c 0,-0.139594 0.02148,-0.285679 0.06516,-0.437374 0.04382,-0.15173 0.105551,-0.296298 0.185632,-0.433528 0.09426,-0.161643 0.194027,-0.284022 0.298767,-0.368653 0.105128,-0.08403 0.210961,-0.12566 0.318594,-0.12566 0.132962,0 0.237419,0.05719 0.313231,0.171838 0.07592,0.114653 0.113947,0.27298 0.113947,0.474451 0,0.166476 -0.02533,0.331294 -0.07687,0.495688 -0.05087,0.164677 -0.123084,0.3175 -0.216641,0.457518 -0.09095,0.137654 -0.187007,0.24197 -0.28635,0.314043 -0.100188,0.07151 -0.198719,0.107491 -0.295063,0.107491 -0.128975,0 -0.230928,-0.05884 -0.306881,-0.176389 -0.0755,-0.117404 -0.113524,-0.27753 -0.113524,-0.479425"
         style="fill:#231f20;fill-opacity:1;fill-rule:evenodd;stroke:none;stroke-width:0.0352778"
         id="path2285" />
      <path
         d="m 57.753897,103.10574 8.168428,3.90701"
         style="fill:none;stroke:#231f20;stroke-width:0.200025;stroke-linecap:butt;stroke-linejoin:miter;stroke-miterlimit:2.613;stroke-dasharray:none;stroke-opacity:1"
         id="path2287" />
      <path
         d="m 67.081976,107.56728 -1.123245,-1.02263 c 0.06145,0.35306 -0.06449,0.61627 -0.377437,0.78987 l 1.500682,0.23276"
         style="display:inline;fill:#231f20;fill-opacity:1;fill-rule:evenodd;stroke:none;stroke-width:0.0352778"
         id="path2289" />
      <path
         d="m 67.344054,107.64168 3.775569,1.78968"
         style="display:inline;fill:none;stroke:#ff0000;stroke-width:0.40005;stroke-linecap:butt;stroke-linejoin:miter;stroke-miterlimit:2.613;stroke-dasharray:none;stroke-opacity:1"
         id="path2291" />
      <path
         d="m 72.695129,110.17826 -1.730834,-1.56464 c 0.09634,0.54187 -0.09564,0.94686 -0.576015,1.21529 l 2.306849,0.34935"
         style="fill:#ff0000;fill-opacity:1;fill-rule:evenodd;stroke:none;stroke-width:0.0352778"
         id="path2293" />
      <path
         d="m 67.408966,107.64168 2.948163,-1.59632"
         style="display:inline;fill:none;stroke:#ff0000;stroke-width:0.40005;stroke-linecap:butt;stroke-linejoin:miter;stroke-miterlimit:2.613;stroke-dasharray:none;stroke-opacity:1"
         id="path2295" />
      <path
         d="m 71.890337,105.21538 -2.284907,0.47241 c 0.494172,0.24197 0.707602,0.63637 0.640645,1.18247 l 1.644262,-1.65488"
         style="fill:#ff0000;fill-opacity:1;fill-rule:evenodd;stroke:none;stroke-width:0.0352778"
         id="path2297" />
      <path
         d="m 67.408966,107.70659 0.322862,3.0558"
         style="display:inline;fill:none;stroke:#ff0000;stroke-width:0.40005;stroke-linecap:butt;stroke-linejoin:miter;stroke-miterlimit:2.613;stroke-dasharray:none;stroke-opacity:1"
         id="path2299" />
      <path
         d="m 67.91499,112.49488 0.433529,-2.29058 c -0.412186,0.36406 -0.857286,0.41134 -1.336428,0.14111 l 0.902899,2.14947"
         style="fill:#ff0000;fill-opacity:1;fill-rule:evenodd;stroke:none;stroke-width:0.0352778"
         id="path2301" />
      <path
         d="m 64.134906,104.64738 0.475544,-0.0773 -0.19872,0.6689 c 0.160973,-0.27407 0.307305,-0.46634 0.438644,-0.57535 0.07398,-0.0624 0.13462,-0.0936 0.182034,-0.0936 0.02992,0 0.05387,0.009 0.07122,0.0265 0.01764,0.0181 0.02646,0.0438 0.02646,0.078 0,0.0608 -0.01556,0.11849 -0.04699,0.17363 -0.02215,0.0409 -0.05359,0.062 -0.09521,0.062 -0.0212,0 -0.03955,-0.007 -0.05429,-0.0211 -0.01517,-0.0135 -0.02466,-0.0346 -0.02826,-0.0624 -0.002,-0.0181 -0.0063,-0.0294 -0.01238,-0.035 -0.0073,-0.007 -0.01584,-0.0109 -0.02646,-0.0109 -0.01545,0 -0.02992,0.003 -0.0441,0.0109 -0.02357,0.0131 -0.06022,0.0491 -0.108585,0.10763 -0.0762,0.0896 -0.159173,0.20673 -0.248073,0.34988 -0.03842,0.0608 -0.07193,0.12884 -0.09906,0.20507 -0.03845,0.10513 -0.06078,0.16782 -0.06629,0.18906 l -0.0441,0.17321 h -0.210714 l 0.254812,-0.85548 c 0.02963,-0.0988 0.0441,-0.17004 0.0441,-0.21209 0,-0.0165 -0.0067,-0.0303 -0.02053,-0.0409 -0.01834,-0.0151 -0.043,-0.0222 -0.07303,-0.0222 -0.01944,0 -0.055,0.004 -0.106115,0.012 l -0.0099,-0.0504"
         style="fill:#231f20;fill-opacity:1;fill-rule:evenodd;stroke:none;stroke-width:0.0352778"
         id="path3885" />
      <path
         d="M 57.653284,75.398924 V 103.07998 H 85.16741"
         style="fill:none;stroke:#bdbbbc;stroke-width:0.200025;stroke-linecap:butt;stroke-linejoin:miter;stroke-miterlimit:2.613;stroke-dasharray:none;stroke-opacity:1"
         id="path3887" />
      <path
         d="m 57.653284,73.845644 0.599052,1.990372 c -0.399379,-0.284692 -0.798724,-0.284692 -1.198068,0 l 0.599016,-1.990372"
         style="fill:#bdbbbc;fill-opacity:1;fill-rule:evenodd;stroke:none;stroke-width:0.0352778"
         id="path3889" />
      <path
         d="m 86.720338,103.07998 -1.990019,-0.59862 c 0.284339,0.39934 0.284339,0.79872 0,1.19764 l 1.990019,-0.59902"
         style="fill:#bdbbbc;fill-opacity:1;fill-rule:evenodd;stroke:none;stroke-width:0.0352778"
         id="path3891" />
      <path
         d="M 57.653284,103.07928 41.049167,120.17249"
         style="fill:none;stroke:#bdbbbc;stroke-width:0.200025;stroke-linecap:butt;stroke-linejoin:miter;stroke-miterlimit:2.613;stroke-dasharray:none;stroke-opacity:1"
         id="path3893" />
      <path
         d="m 39.966856,121.28649 1.816403,-1.01039 c -0.484823,-0.074 -0.771162,-0.35278 -0.859356,-0.83495 l -0.957047,1.84534"
         style="fill:#bdbbbc;fill-opacity:1;fill-rule:evenodd;stroke:none;stroke-width:0.0352778"
         id="path3895" />
      <path
         d="m 68.139604,104.53876 h 0.735612 c 0.192511,0 0.337185,0.0416 0.432823,0.12484 0.09522,0.0833 0.143192,0.18482 0.143192,0.30375 0,0.0949 -0.03034,0.1863 -0.09137,0.2752 -0.06064,0.09 -0.150354,0.16189 -0.26984,0.21731 -0.119592,0.0561 -0.248461,0.0835 -0.387068,0.0835 -0.0864,0 -0.196109,-0.0155 -0.329494,-0.0469 l -0.148837,0.50945 c -0.03485,0.12167 -0.05221,0.20175 -0.05221,0.24021 0,0.0296 0.01238,0.0533 0.03708,0.073 0.02505,0.0197 0.08431,0.0321 0.177765,0.0374 l -0.01379,0.0513 h -0.742915 l 0.01559,-0.0513 c 0.0973,0 0.165065,-0.0165 0.203129,-0.05 0.03817,-0.0343 0.07909,-0.12637 0.12319,-0.2781 l 0.308681,-1.06355 c 0.03665,-0.12778 0.05496,-0.21347 0.05496,-0.25605 0,-0.0325 -0.01266,-0.059 -0.03912,-0.0802 -0.02646,-0.0215 -0.08364,-0.0341 -0.172932,-0.0384 z m 0.257139,0.87136 c 0.103787,0.0267 0.187678,0.0398 0.251213,0.0398 0.09977,0 0.190853,-0.0208 0.273403,-0.0624 0.08213,-0.0413 0.146368,-0.10336 0.192652,-0.1852 0.04657,-0.083 0.06946,-0.16937 0.06946,-0.25785 0,-0.0931 -0.02783,-0.16658 -0.08502,-0.22087 -0.05719,-0.0543 -0.143616,-0.0812 -0.258939,-0.0812 -0.06283,0 -0.138642,0.008 -0.22793,0.023 l -0.214842,0.74472"
         style="fill:#231f20;fill-opacity:1;fill-rule:evenodd;stroke:none;stroke-width:0.0352778"
         id="path3907" />
      <path
         d="m 56.373512,111.26168 c 0.159033,-0.0456 0.296545,-0.14827 0.412715,-0.30635 0.116029,-0.15875 0.174167,-0.31391 0.174167,-0.46659 0,-0.11151 -0.02533,-0.20009 -0.0755,-0.26543 -0.05073,-0.0645 -0.128023,-0.10678 -0.231387,-0.12693 z m 0.135044,-1.16389 c -0.07345,0.007 -0.141111,0.0278 -0.203271,0.0621 -0.06202,0.0331 -0.121003,0.0825 -0.177341,0.14566 -0.07525,0.0864 -0.134797,0.18454 -0.178612,0.29559 -0.04438,0.11039 -0.06629,0.21703 -0.06629,0.31888 0,0.0992 0.0229,0.1779 0.06946,0.23579 0.04657,0.0581 0.116876,0.0959 0.211667,0.11381 z m -0.156951,1.26323 -0.145133,0.58388 h -0.236326 l 0.171838,-0.58981 c -0.160796,-0.0265 -0.286067,-0.0896 -0.376061,-0.18838 -0.08999,-0.0984 -0.135043,-0.22338 -0.135043,-0.37359 0,-0.20736 0.08819,-0.39024 0.263737,-0.54681 0.176142,-0.15734 0.390983,-0.24264 0.645336,-0.25548 l 0.161537,-0.55838 h 0.108973 l -0.135043,0.56445 c 0.171697,0.0165 0.307163,0.0717 0.40707,0.16468 0.09952,0.0929 0.149542,0.21138 0.149542,0.35429 0,0.19967 -0.0853,0.38241 -0.255375,0.54846 -0.17071,0.16687 -0.379237,0.26568 -0.625052,0.29669"
         style="fill:#231f20;fill-opacity:1;fill-rule:evenodd;stroke:none;stroke-width:0.0352778"
         id="path3909" />
      <path
         d="m 72.85335,106.08353 c -0.157269,0.13865 -0.29838,0.20811 -0.423228,0.20811 -0.07345,0 -0.134761,-0.024 -0.183127,-0.0726 -0.04907,-0.0479 -0.07306,-0.10901 -0.07306,-0.18094 0,-0.0985 0.04205,-0.18697 0.126647,-0.26568 0.08477,-0.0783 0.268464,-0.18273 0.552768,-0.31323 v -0.12978 c 0,-0.097 -0.0053,-0.15808 -0.01616,-0.18359 -0.01019,-0.0253 -0.03073,-0.0475 -0.05965,-0.067 -0.02963,-0.0183 -0.06272,-0.0282 -0.09952,-0.0282 -0.05951,0 -0.108973,0.0138 -0.147426,0.0407 -0.02356,0.0161 -0.03556,0.0355 -0.03556,0.0577 0,0.0188 0.01295,0.0431 0.03845,0.0721 0.03485,0.0394 0.05249,0.0772 0.05249,0.11426 0,0.0452 -0.01693,0.0829 -0.05002,0.11533 -0.03432,0.0314 -0.07757,0.0473 -0.132009,0.0473 -0.05789,0 -0.106116,-0.0176 -0.145239,-0.0529 -0.0393,-0.0346 -0.05856,-0.0755 -0.05856,-0.12209 0,-0.0666 0.02603,-0.1294 0.07825,-0.18934 0.05292,-0.0604 0.125554,-0.10654 0.219393,-0.13864 0.09356,-0.0325 0.190853,-0.0484 0.292135,-0.0484 0.121991,0 0.218299,0.026 0.289913,0.078 0.07126,0.0522 0.117122,0.10792 0.138289,0.16852 0.01341,0.0385 0.0194,0.1275 0.0194,0.2661 v 0.49982 c 0,0.059 0.0021,0.0963 0.0071,0.11148 0.0046,0.0152 0.01129,0.0262 0.02046,0.0339 0.0092,0.007 0.01976,0.0109 0.03175,0.0109 0.02399,0 0.04833,-0.017 0.07338,-0.0511 l 0.04092,0.0332 c -0.04586,0.0677 -0.09313,0.1174 -0.142522,0.14813 -0.04904,0.0307 -0.104775,0.0462 -0.167569,0.0462 -0.07338,0 -0.130881,-0.0176 -0.172156,-0.0523 -0.04127,-0.0341 -0.06668,-0.0864 -0.07549,-0.15586 z m 0,-0.10057 v -0.43173 c -0.11109,0.066 -0.193922,0.13543 -0.247933,0.20944 -0.03637,0.0502 -0.05429,0.0995 -0.05429,0.15036 0,0.0423 0.01517,0.079 0.0459,0.11147 0.02286,0.0251 0.05496,0.0378 0.09617,0.0378 0.04632,0 0.09924,-0.0265 0.160162,-0.0773"
         style="fill:#ff0000;fill-opacity:1;fill-rule:evenodd;stroke:none;stroke-width:0.0352778"
         id="path3911" />
      <path
         d="m 74.196727,106.97003 c 0.119239,-0.0341 0.22225,-0.11148 0.309386,-0.22998 0.08714,-0.11892 0.130881,-0.23565 0.130881,-0.35002 0,-0.0835 -0.01905,-0.15021 -0.0568,-0.19858 -0.0381,-0.0487 -0.09596,-0.0808 -0.173567,-0.0959 z m 0.101248,-0.87312 c -0.05503,0.006 -0.105834,0.0212 -0.1524,0.0466 -0.04657,0.0251 -0.09066,0.0621 -0.132998,0.10939 -0.05644,0.0649 -0.101247,0.13865 -0.134055,0.22148 -0.03316,0.0832 -0.04974,0.16259 -0.04974,0.23964 0,0.0744 0.01729,0.13324 0.05221,0.17664 0.03493,0.043 0.08749,0.0717 0.15875,0.0854 z m -0.117828,0.94756 -0.108656,0.43822 h -0.177447 l 0.129117,-0.44235 c -0.12065,-0.0201 -0.214842,-0.0671 -0.282223,-0.14111 -0.06738,-0.0742 -0.101247,-0.16757 -0.101247,-0.2806 0,-0.15586 0.06597,-0.29242 0.197909,-0.41021 0.131938,-0.11783 0.293158,-0.18165 0.484011,-0.19114 l 0.121002,-0.41881 h 0.08185 l -0.101247,0.42266 c 0.128764,0.0123 0.230364,0.0539 0.305152,0.12375 0.07479,0.0699 0.112184,0.15875 0.112184,0.2661 0,0.14951 -0.06385,0.28635 -0.191559,0.4112 -0.128058,0.12457 -0.284338,0.19872 -0.468841,0.22229"
         style="fill:#ff0000;fill-opacity:1;fill-rule:evenodd;stroke:none;stroke-width:0.0352778"
         id="path3913" />
      <path
         d="m 73.690491,110.26921 c -0.157339,0.13903 -0.29845,0.20821 -0.423333,0.20821 -0.07338,0 -0.134408,-0.024 -0.183092,-0.0724 -0.04904,-0.0484 -0.07303,-0.10897 -0.07303,-0.18175 0,-0.0977 0.04198,-0.18616 0.126647,-0.26486 0.08467,-0.0782 0.268464,-0.18271 0.552803,-0.31295 v -0.12979 c 0,-0.0977 -0.0053,-0.15917 -0.01623,-0.18411 -0.01023,-0.0255 -0.03034,-0.0477 -0.05962,-0.0664 -0.02963,-0.0186 -0.06244,-0.0281 -0.09913,-0.0281 -0.05997,0 -0.109361,0.0138 -0.147813,0.0403 -0.02364,0.0161 -0.03563,0.0351 -0.03563,0.0577 0,0.0191 0.01305,0.0431 0.03845,0.0721 0.03493,0.0392 0.05256,0.0776 0.05256,0.11384 0,0.0456 -0.01693,0.0834 -0.05009,0.11508 -0.03387,0.0317 -0.07761,0.0479 -0.131939,0.0479 -0.0575,0 -0.106186,-0.0183 -0.145344,-0.0525 -0.03881,-0.035 -0.05856,-0.076 -0.05856,-0.12252 0,-0.0663 0.02611,-0.1294 0.07832,-0.18934 0.05292,-0.0604 0.125589,-0.10654 0.219428,-0.13945 0.09349,-0.0313 0.190853,-0.0476 0.2921,-0.0476 0.122061,0 0.218722,0.026 0.289984,0.0773 0.07126,0.0525 0.117122,0.10859 0.138288,0.16919 0.01341,0.0382 0.0194,0.12707 0.0194,0.26639 v 0.49995 c 0,0.0589 0.0025,0.0955 0.0071,0.11109 0.0046,0.0149 0.01129,0.0258 0.02081,0.0339 0.0088,0.007 0.01976,0.0106 0.0314,0.0106 0.02399,0 0.04833,-0.0174 0.07338,-0.0508 l 0.04092,0.0328 c -0.04551,0.0685 -0.09313,0.11755 -0.142522,0.14813 -0.04904,0.0303 -0.104775,0.0463 -0.16757,0.0463 -0.07338,0 -0.130528,-0.0176 -0.172155,-0.0515 -0.04127,-0.0346 -0.06668,-0.0868 -0.0755,-0.15667 z m 0,-0.10019 v -0.43173 c -0.111125,0.0656 -0.194028,0.13504 -0.248003,0.20916 -0.03634,0.0504 -0.05397,0.0998 -0.05397,0.15064 0,0.0423 0.01482,0.0794 0.04551,0.11148 0.02293,0.0254 0.05503,0.0374 0.09631,0.0374 0.04621,0 0.09948,-0.0258 0.160161,-0.0769"
         style="fill:#ff0000;fill-opacity:1;fill-rule:evenodd;stroke:none;stroke-width:0.0352778"
         id="path3915" />
      <path
         d="m 74.617238,110.32279 0.356659,-0.0574 -0.148872,0.50158 c 0.12065,-0.20602 0.230363,-0.35027 0.328788,-0.4313 0.05574,-0.047 0.1016,-0.0703 0.136525,-0.0703 0.02258,0 0.04057,0.007 0.05397,0.0197 0.0127,0.0135 0.0194,0.0332 0.0194,0.0583 0,0.0455 -0.01164,0.0889 -0.03528,0.1301 -0.01623,0.0307 -0.04022,0.0463 -0.07126,0.0463 -0.01587,0 -0.02963,-0.005 -0.04092,-0.0156 -0.01094,-0.009 -0.01834,-0.0258 -0.02117,-0.0473 -0.0014,-0.0134 -0.0046,-0.0211 -0.0092,-0.026 -0.0053,-0.005 -0.01199,-0.008 -0.0194,-0.008 -0.01199,0 -0.02293,0.003 -0.03351,0.008 -0.01729,0.0102 -0.04516,0.0371 -0.08149,0.0812 -0.05715,0.067 -0.118886,0.15473 -0.185914,0.26279 -0.02858,0.0451 -0.05398,0.0963 -0.07444,0.1531 -0.02893,0.0794 -0.04551,0.12623 -0.04974,0.14207 l -0.03316,0.13024 H 74.55018 l 0.191205,-0.64135 c 0.02223,-0.0748 0.03316,-0.12802 0.03316,-0.16012 0,-0.012 -0.0053,-0.0219 -0.01552,-0.0303 -0.01376,-0.0117 -0.0321,-0.0163 -0.05433,-0.0163 -0.01482,0 -0.04163,0.003 -0.08008,0.009 l -0.0074,-0.0382"
         style="fill:#ff0000;fill-opacity:1;fill-rule:evenodd;stroke:none;stroke-width:0.0352778"
         id="path3917" />
      <path
         d="m 68.787021,113.49892 c -0.157374,0.13861 -0.298485,0.2074 -0.423333,0.2074 -0.07345,0 -0.134514,-0.0236 -0.183162,-0.0726 -0.04904,-0.0473 -0.07303,-0.10791 -0.07303,-0.18065 0,-0.0984 0.04202,-0.18701 0.126647,-0.26529 0.0846,-0.0783 0.268429,-0.18313 0.552873,-0.31323 v -0.12979 c 0,-0.0977 -0.0054,-0.15847 -0.01626,-0.18426 -0.01019,-0.0249 -0.03034,-0.0473 -0.05969,-0.0659 -0.02963,-0.0192 -0.06241,-0.0283 -0.09906,-0.0283 -0.05997,0 -0.109431,0.0138 -0.147884,0.0398 -0.02357,0.0167 -0.03556,0.036 -0.03556,0.0575 0,0.0198 0.01312,0.0434 0.03845,0.0721 0.03489,0.0398 0.05253,0.078 0.05253,0.11423 0,0.0452 -0.01697,0.0836 -0.05002,0.11575 -0.0339,0.0314 -0.07775,0.0473 -0.132044,0.0473 -0.05743,0 -0.106081,-0.0176 -0.144957,-0.0526 -0.03912,-0.0349 -0.05884,-0.0754 -0.05884,-0.12238 0,-0.066 0.02603,-0.12912 0.07828,-0.18976 0.05292,-0.0599 0.125519,-0.10622 0.219393,-0.13833 0.09356,-0.0321 0.190853,-0.048 0.292135,-0.048 0.122096,0 0.218687,0.0254 0.289948,0.0776 0.07123,0.0523 0.117122,0.10806 0.138324,0.16909 0.01337,0.0385 0.0193,0.12693 0.0193,0.26596 v 0.50024 c 0,0.0586 0.0025,0.0956 0.0072,0.11038 0.0045,0.0152 0.01132,0.0269 0.02081,0.0339 0.0088,0.007 0.01972,0.0109 0.03143,0.0109 0.02399,0 0.04823,-0.0165 0.07331,-0.0504 l 0.04092,0.0328 c -0.04547,0.0685 -0.09313,0.1178 -0.142487,0.14828 -0.04904,0.0303 -0.10488,0.0457 -0.167569,0.0457 -0.07345,0 -0.130492,-0.017 -0.172261,-0.0514 -0.04121,-0.0346 -0.06653,-0.0866 -0.07535,-0.156 z m 0,-0.10128 v -0.43063 c -0.111231,0.0649 -0.194027,0.13462 -0.248073,0.20916 -0.03637,0.0497 -0.05401,0.0998 -0.05401,0.14954 0,0.0423 0.01489,0.08 0.04561,0.11257 0.0229,0.0247 0.055,0.0366 0.0962,0.0366 0.04628,0 0.09948,-0.0254 0.160267,-0.0773"
         style="fill:#ff0000;fill-opacity:1;fill-rule:evenodd;stroke:none;stroke-width:0.0352778"
         id="path3919" />
      <path
         d="m 70.384717,113.62762 c 0.01584,-0.0737 0.02755,-0.14111 0.03528,-0.20133 0.0074,-0.0601 0.01129,-0.11646 0.01129,-0.168 0,-0.0868 -0.01379,-0.15268 -0.04064,-0.19759 -0.02745,-0.0448 -0.06766,-0.067 -0.120332,-0.067 -0.07013,0 -0.137513,0.0541 -0.202424,0.1633 -0.06491,0.10873 -0.123896,0.2661 -0.176389,0.47061 z m -0.514703,0.0823 c -0.02191,0.0882 -0.03817,0.16828 -0.04949,0.23922 -0.01044,0.0708 -0.01584,0.13395 -0.01584,0.19004 0,0.0798 0.01337,0.14263 0.03983,0.1892 0.02688,0.0462 0.06258,0.0688 0.108303,0.0688 0.07553,0 0.14926,-0.0597 0.220486,-0.17861 0.07168,-0.1192 0.134514,-0.28882 0.1899,-0.50864 z m -0.238549,0.2533 c 0,-0.10446 0.01584,-0.21414 0.04879,-0.3284 0.03281,-0.11367 0.07895,-0.22229 0.138888,-0.32495 0.07098,-0.12096 0.145662,-0.21304 0.22479,-0.27657 0.07825,-0.0628 0.157621,-0.0942 0.238372,-0.0942 0.09991,0 0.178612,0.0431 0.235373,0.12912 0.0568,0.0861 0.08502,0.20464 0.08502,0.35567 0,0.12442 -0.01902,0.24874 -0.05747,0.37179 -0.03817,0.12347 -0.09246,0.2377 -0.162736,0.34325 -0.06809,0.10294 -0.140017,0.18137 -0.214418,0.23523 -0.07553,0.0536 -0.149225,0.0809 -0.221157,0.0809 -0.09701,0 -0.173637,-0.0441 -0.230434,-0.13229 -0.05676,-0.0882 -0.08502,-0.20779 -0.08502,-0.35952"
         style="fill:#ff0000;fill-opacity:1;fill-rule:evenodd;stroke:none;stroke-width:0.0352778"
         id="path3921" />
      <g
         id="g2025"
         transform="matrix(0.35277777,0,0,-0.35277777,-25.222434,186.6075)"
         style="display:inline">
        <path
           d="m 246.644,172.323 v -0.144 c -0.394,0.197 -0.722,0.429 -0.984,0.695 -0.375,0.377 -0.664,0.822 -0.867,1.335 -0.204,0.514 -0.304,1.046 -0.304,1.598 0,0.807 0.2,1.545 0.596,2.209 0.4,0.665 0.919,1.141 1.559,1.428 v -0.164 c -0.32,-0.177 -0.583,-0.419 -0.789,-0.727 -0.205,-0.305 -0.359,-0.696 -0.459,-1.168 -0.103,-0.469 -0.154,-0.964 -0.154,-1.476 0,-0.556 0.043,-1.064 0.129,-1.52 0.069,-0.36 0.151,-0.648 0.246,-0.865 0.096,-0.218 0.225,-0.427 0.388,-0.627 0.163,-0.201 0.376,-0.392 0.639,-0.574"
           style="fill:#231f20;fill-opacity:1;fill-rule:evenodd;stroke:none;stroke-width:0.1"
           id="path4079" />
        <path
           d="m 251.004,179.28 v 0.164 c 0.397,-0.194 0.726,-0.425 0.988,-0.692 0.372,-0.379 0.661,-0.825 0.863,-1.337 0.203,-0.513 0.305,-1.046 0.305,-1.6 0,-0.807 -0.199,-1.543 -0.595,-2.208 -0.399,-0.666 -0.918,-1.142 -1.561,-1.428 v 0.144 c 0.32,0.18 0.584,0.422 0.79,0.729 0.207,0.305 0.362,0.696 0.462,1.168 0.101,0.472 0.15,0.966 0.15,1.477 0,0.555 -0.043,1.061 -0.128,1.52 -0.066,0.36 -0.148,0.647 -0.245,0.865 -0.099,0.215 -0.228,0.423 -0.389,0.623 -0.161,0.202 -0.375,0.392 -0.64,0.575"
           style="fill:#231f20;fill-opacity:1;fill-rule:evenodd;stroke:none;stroke-width:0.1"
           id="path4081" />
        <path
           d="m 249.132,179.444 -0.769,-2.699 c 0.251,0.26 0.467,0.44 0.654,0.535 0.187,0.096 0.383,0.144 0.584,0.144 0.287,0 0.521,-0.095 0.703,-0.284 0.183,-0.191 0.273,-0.448 0.273,-0.775 0,-0.418 -0.119,-0.836 -0.358,-1.252 -0.241,-0.414 -0.54,-0.737 -0.902,-0.969 -0.363,-0.232 -0.72,-0.348 -1.072,-0.348 -0.393,0 -0.796,0.147 -1.211,0.441 l 1.188,4.09 c 0.092,0.314 0.137,0.5 0.137,0.554 0,0.068 -0.021,0.12 -0.062,0.152 -0.059,0.049 -0.148,0.072 -0.266,0.072 -0.055,0 -0.138,-0.011 -0.25,-0.028 v 0.148 z m -1.511,-5.249 c 0.26,-0.144 0.49,-0.215 0.687,-0.215 0.229,0 0.467,0.083 0.714,0.251 0.246,0.169 0.46,0.452 0.639,0.851 0.181,0.398 0.272,0.799 0.272,1.206 0,0.24 -0.059,0.427 -0.177,0.564 -0.119,0.133 -0.259,0.201 -0.42,0.201 -0.243,0 -0.479,-0.096 -0.711,-0.291 -0.232,-0.194 -0.397,-0.463 -0.496,-0.81 l -0.508,-1.757"
           style="fill:#231f20;fill-opacity:1;fill-rule:evenodd;stroke:none;stroke-width:0.1"
           id="path4083" />
      </g>
    </g>
  </g>
</svg>
